{"text_format":"1","workbook":"xlsx","n_sheets":2,"sheets":["ملابس (2)","شهادة نصف العام"],"not_rendered":{"charts":0,"images":0,"macros":1,"external_links":1,"defined_names":2,"comments":0,"pivot_tables":0},"unopened":[],"bounds":{"document_bytes":16777216,"sheet_cells":100000,"rows_first":2000,"rows_last":500,"rows_between":2000,"halvings":0,"cell_chars":16384,"cell_head_chars":4096},"cells_cut":0,"cells_raw":0,"read":"whole","date_system":"1900"}

{"sheet":"ملابس (2)","index":0,"n_rows":166,"n_cols":248,"rows_kept":166,"cut":false,"hidden":false,"merged":[[2,2,2,9],[3,2,3,9],[4,2,4,9],[5,2,5,9],[6,0,11,0],[6,1,10,3],[6,4,11,4],[6,5,11,5],[6,6,10,8],[6,9,11,9],[6,23,7,27],[8,13,8,14],[8,15,8,16],[8,17,9,17],[8,18,8,19],[8,23,8,24],[8,25,8,26],[8,27,9,27],[6,10,11,10],[6,11,11,11],[6,12,11,12],[6,13,7,17],[6,18,7,22],[8,20,8,21],[8,22,9,22],[6,54,7,58],[7,33,7,37],[7,38,7,42],[8,30,8,31],[8,32,9,32],[6,28,7,32],[6,33,6,42],[6,43,9,43],[6,44,7,48],[6,49,7,53],[8,42,9,42],[8,28,8,29],[8,33,8,34],[8,35,8,36],[8,37,9,37],[8,38,8,39],[6,59,7,63],[6,64,6,73],[6,74,9,74],[6,75,7,79],[6,80,7,84],[7,64,7,68],[7,69,7,73],[8,64,8,65],[8,66,8,67],[8,68,9,68],[8,69,8,70],[8,71,8,72],[8,73,9,73],[8,75,8,76],[8,77,8,78],[8,79,9,79],[8,40,8,41],[8,63,9,63],[8,44,8,45],[8,46,8,47],[8,48,9,48],[8,49,8,50],[8,51,8,52],[8,53,9,53],[8,54,8,55],[8,56,8,57],[8,58,9,58],[8,59,8,60],[8,61,8,62],[8,80,8,81],[8,113,8,116],[10,126,11,127],[8,89,9,89],[8,91,8,92],[8,93,8,94],[8,95,9,95],[8,96,8,97],[8,98,8,99],[6,90,9,90],[6,91,7,95],[6,96,7,100],[6,101,7,105],[6,106,11,106],[8,103,8,104],[8,105,9,105],[6,85,7,89],[6,107,11,107],[8,100,9,100],[8,101,8,102],[8,82,8,83],[8,84,9,84],[8,85,8,86],[8,87,8,88]]}
["S1",null,null,null,null,null,null,null,null,"S5","S6","S7","S8","S12","S13","S14","S15","S16","S17","S18","S19","S20","S21","S22","S23","S24","S25","S26","S27","S28","S29","S30","S31","S32","S33","S34","S35","S36","S37","S38","S39","S40","S41","S42","S43","S44","S45","S46","S47","S48","S49","S50","S51","S52","S53","S54","S55","S56","S57","S58","S59","S60","S61","S62","S63","S64","S65","S66","S67","S68","S69","S70","S71","S72","S73","S74","S75","S76","S77","S78","S79","S80","S81","S82","S83","S84","S85","S86","S87","S88","S89","S90","S91","S92","S93","S94","S95","S96","S97","S98","S99","s100","s101","s102","s103","s104","s105","s106",null,"S108","S109"]
[1,10,2017]
[null,null,"وزارة التربية والتعليم"]
[null,null,"محافظة الشرقية"]
[null,null,"إدارة ههيا التعليمية"]
[null,null,"مدرسة ههيا الثانوية الصناعية بنات"]
["م","تاريخ الميلاد",null,null,"الرقم \nالقومى","تاريخ الميلاد","السن في 1/10/2017",null,null,"الاسم","رقم الجلوس","سري1","سري2","لغة عربية",null,null,null,null,"لغة أجنبية",null,null,null,null,"رياضيات عامة",null,null,null,null,"الفزياء العامة",null,null,null,null,"رسم فني",null,null,null,null,"عملي رسم فني",null,null,null,null,"مجموع الرسم","تخطيط وإدارة انتاج",null,null,null,null,"أمن صناعي",null,null,null,null,"خامات واقمشة",null,null,null,null,"تصميم صناعي",null,null,null,null,"معدات وماكينات وصيانة",null,null,null,null,"عملي تكنولوجيا العمليات",null,null,null,null,"مجموع العمليات","مراقبة جودة",null,null,null,null,"مقايسات وتكاليف",null,null,null,null,"الحاسب الالي",null,null,null,null,"مجموع كلي","تربية دينية",null,null,null,null,"تربية رياضية",null,null,null,null,"أنشطة",null,null,null,null,"نتيجة الطالبة","مواد الرسوب"]
[null,null,null,null,null,null,null,null,null,null,null,null,null,null,null,null,null,null,null,null,null,null,null,null,null,null,null,null,null,null,null,null,null,"نظري",null,null,null,null,"عملي رسم فني",null,null,null,null,null,null,null,null,null,null,null,null,null,null,null,null,null,null,null,null,null,null,null,null,null,"نظري",null,null,null,null,"عملي معدات وماكينات وصيانة"]
[null,null,null,null,null,null,null,null,null,null,null,null,null,"نصف العام",null,"آخر العام",null,"مجموع","نصف العام",null,"آخر العام",null,"مجموع","نصف العام",null,"آخر العام",null,"مجموع","نصف العام",null,"آخر العام",null,"مجموع","نصف العام",null,"آخر العام",null,"مجموع","نصف العام",null,"آخر العام",null,"مجموع",null,"نصف العام",null,"آخر العام",null,"مجموع","نصف العام",null,"آخر العام",null,"مجموع","نصف العام",null,"آخر العام",null,"مجموع","نصف العام",null,"آخر العام",null,"مجموع","نصف العام",null,"آخر العام",null,"مجموع","نصف العام",null,"آخر العام",null,"مجموع",null,"نصف العام",null,"آخر العام",null,"مجموع","نصف العام",null,"آخر العام",null,"مجموع","نصف العام",null,"آخر العام",null,"مجموع",null,"نصف العام",null,"آخر العام",null,"مجموع","نصف العام",null,"آخر العام",null,"مجموع","نصف العام",null,"آخر العام",null,"مجموع",null,null,null,null,null,null,null,"البرمجة"]
[null,null,null,null,null,null,null,null,null,null,null,null,null,"أعمال السنة","امتحان","أعمال السنة","امتحان",null,"أعمال السنة","امتحان","أعمال السنة","امتحان",null,"أعمال السنة","امتحان","أعمال السنة","امتحان",null,"أعمال السنة","امتحان","أعمال السنة","امتحان",null,"أعمال السنة","امتحان","أعمال السنة","امتحان",null,"أعمال السنة","امتحان","أعمال السنة","امتحان",null,null,"أعمال السنة","امتحان","أعمال السنة","امتحان",null,"أعمال السنة","امتحان","أعمال السنة","امتحان",null,"أعمال السنة","امتحان","أعمال السنة","امتحان",null,"أعمال السنة","امتحان","أعمال السنة","امتحان",null,"أعمال السنة","امتحان","أعمال السنة","امتحان",null,"أعمال السنة","امتحان","أعمال السنة","امتحان",null,null,"أعمال السنة","امتحان","أعمال السنة","امتحان",null,"أعمال السنة","امتحان","أعمال السنة","امتحان",null,"أعمال السنة","امتحان","أعمال السنة","امتحان",null,null,"أعمال السنة","امتحان","أعمال السنة","امتحان",null,"أعمال السنة","امتحان","أعمال السنة","امتحان",null,"أعمال السنة","امتحان","أعمال السنة","امتحان"]
[null,null,null,null,null,null,null,null,null,null,null,null,null,5,20,5,20,{"$f":"Q11+P11+O11+N11","v":50},4,16,4,16,{"$f":"V11+U11+T11+S11","v":40},5,20,5,20,{"$f":"AA11+Z11+Y11+X11","v":50},4,16,4,16,{"$f":"AF11+AE11+AD11+AC11","v":40},10,40,10,40,{"$f":"AK11+AJ11+AI11+AH11","v":100},10,40,10,40,{"$f":"AP11+AO11+AN11+AM11","v":100},{"$f":"AQ11+AL11","v":200},4,16,4,16,{"$f":"AV11+AU11+AT11+AS11","v":40},2,8,2,8,{"$f":"BA11+AZ11+AY11+AX11","v":20},4,16,4,16,{"$f":"BF11+BE11+BD11+BC11","v":40},4,16,4,16,{"$f":"BK11+BJ11+BI11+BH11","v":40},4,16,4,16,{"$f":"BP11+BO11+BN11+BM11","v":40},5,20,5,20,{"$f":"BU11+BT11+BS11+BR11","v":50},{"$f":"BV11+BQ11","v":90},4,16,4,16,{"$f":"CA11+BZ11+BY11+BX11","v":40},4,16,4,16,{"$f":"CF11+CE11+CD11+CC11","v":40},2,8,2,8,{"$f":"CK11+CJ11+CI11+CH11","v":20},{"$f":"SUM(R11,W11,AB11,AG11,AL11,AQ11,AW11,BB11,BG11,BL11,BQ11,BV11,CB11,CG11,CL11)","v":710},2,8,2,8,{"$f":"CQ11+CP11+CO11+CN11","v":20},2,8,2,8,{"$f":"CV11+CU11+CT11+CS11","v":20},2,8,2,8,{"$f":"DA11+CZ11+CY11+CX11","v":20},null,null,null,1,2,3,4,5,6,7,8,9,10,11,12,13,14,15,16,17,"مواد النجاح"]
[null,"يوم ","شهر","سنة",null,null,"يوم ","شهر","سنة",null,null,null,null,null,null,null,{"$f":"Q11*1/4","v":5},{"$f":"R11*1/2","v":25},null,null,null,{"$f":"V11*1/4","v":4},{"$f":"W11*1/2","v":20},null,null,null,{"$f":"AA11*1/4","v":5},{"$f":"AB11*1/2","v":25},null,null,null,{"$f":"AF11*1/4","v":4},{"$f":"AG11*1/2","v":20},null,null,null,{"$f":"AK11*1/4","v":10},{"$f":"AL11*1/2","v":50},null,null,null,{"$f":"AP11*1/4","v":10},{"$f":"AQ11*1/2","v":50},100,null,null,null,{"$f":"AV11*1/4","v":4},{"$f":"AW11*1/2","v":20},null,null,null,{"$f":"BA11*1/4","v":2},{"$f":"BB11*1/2","v":10},null,null,null,{"$f":"BF11*1/4","v":4},{"$f":"BG11*1/2","v":20},null,null,null,{"$f":"BK11*1/4","v":4},{"$f":"BL11*1/2","v":20},null,null,null,{"$f":"BP11*1/4","v":4},{"$f":"BQ11*1/2","v":20},null,null,null,{"$f":"BU11*1/4","v":5},{"$f":"BV11*1/2","v":25},45,null,null,null,{"$f":"CA11*1/4","v":4},{"$f":"CB11*1/2","v":20},null,null,null,{"$f":"CF11*1/4","v":4},{"$f":"CG11*1/2","v":20},null,null,null,{"$f":"CK11*1/4","v":2},{"$f":"CL11/2","v":10},355,null,null,null,{"$f":"CQ11*1/4","v":2},{"$f":"CR11*1/2","v":10},null,null,null,{"$f":"CV11*1/4","v":2},{"$f":"CW11*1/2","v":10},null,null,null,{"$f":"DA11*1/4","v":2},{"$f":"DB11*1/2","v":10},null,null,null,"لغة عربية","لغة اجنبية","رياضيات","الفزياء","رسم فني","عملي رسم فني","تخطيط","أمن صناعي","خامات","تصميم","نظري معدات وماكينات","عملي معدات وماكينات","مراقبة جودة","مقايسات","الحاسب الالي","مجموع كلي","تربية دينية"]
[1,null,null,null,null,{"$f":"IF(E13=\"\",\"\",DATE(IF(LEFT($E13,1)=\"2\",MID($E13,2,2),\"20\"&MID($E13,2,2)),MID($E13,4,2),MID($E13,6,2)))","v":""},{"$f":"IF(OR(B13=\"\",C13=\"\",D13=\"\"),\"\",DATEDIF(DATE(D13,C13,B13),DATE($C$2,$B$2,$A$2),\"md\"))","v":""},{"$f":"IF(OR(B13=\"\",C13=\"\",D13=\"\"),\"\",DATEDIF(DATE(D13,C13,B13),DATE($C$2,$B$2,$A$2),\"YM\"))","v":""},{"$f":"IF(OR(B13=\"\",C13=\"\",D13=\"\"),\"\",DATEDIF(DATE(D13,C13,B13),DATE($C$2,$B$2,$A$2),\"Y\"))","v":""},"z1",10,null,null,3,15,null,null,{"$f":"IF(Q13=0.1,0,N13+O13+P13+Q13)","v":18},4,12,null,null,{"$f":"IF(V13=0.1,0,S13+T13+U13+V13)","v":16},null,null,null,null,{"$f":"IF(AA13=0.1,0,X13+Y13+Z13+AA13)","v":0},null,null,null,null,{"$f":"IF(AF13=0.1,0,AC13+AD13+AE13+AF13)","v":0},null,null,null,null,{"$f":"IF(AK13=0.1,0,AH13+AI13+AJ13+AK13)","v":0},null,null,null,null,{"$f":"IF(AP13=0.1,0,AM13+AN13+AO13+AP13)","v":0},0,null,null,null,null,{"$f":"IF(AV13=0.1,0,AS13+AT13+AU13+AV13)","v":0},null,null,null,null,{"$f":"IF(BA13=0.1,0,AY14+AY13+AZ13+BA13)","v":0},null,null,null,null,{"$f":"IF(BF13=0.1,0,BC13+BD13+BE13+BF13)","v":0},null,null,null,null,{"$f":"IF(BK13=0.1,0,BH13+BI13+BJ13+BK13)","v":0},null,null,null,null,{"$f":"IF(BP13=0.1,0,BM13+BN13+BO13+BP13)","v":0},null,null,null,null,{"$f":"IF(BU13=0.1,0,BR13+BS13+BT13+BU13)","v":0},0,null,null,null,null,{"$f":"IF(CA13=0.1,0,BX13+BY13+BZ13+CA13)","v":0},null,null,null,null,{"$f":"IF(CF13=0.1,0,CC13+CD13+CE13+CF13)","v":0},null,null,null,null,{"$f":"IF(CK13=0.1,0,CH13+CI13+CJ13+CK13)","v":0},34,null,null,null,null,{"$f":"IF(CQ13=0.1,0,CN13+CO13+CP13+CQ13)","v":0},null,null,null,null,{"$f":"IF(CV13=0.1,0,CS13+CT13+CU13+CV13)","v":0},null,null,null,null,{"$f":"IF(DA13=0.1,0,CX13+CY13+CZ13+DA13)","v":0},{"$f":"IF(DX13=17,\"ناجحة\",IF(DW13<13,\"راسبة\",\"دور ثان\"))","v":"راسبة"},{"$f":"CONCATENATE(DF13,DG13,DH13,DI13,DJ13,DK13,DL13,DM13,DN13,DO13,DP13,DQ13,DR13,DS13,DT13,DU13,DV13)","v":" *عربى*انجليزي *رياضيات *الفزياء *رسم فني *عملي رسم فني *تخطيط *أمن صناعي *خامات *أمن صناعي *نظري معدات وماكنات *عملي معدات وماكينات *مراقبة جودة *مقايسات *الحاسب الالي* مجموع كلى *دين"},null,{"$f":"IF(R13<R$12,\" *عربى\",IF(Q13<Q$12,\" *عربى\",\"\"))","v":" *عربى"},{"$f":"IF(W13<W$12,\"*انجليزي\",IF(V13<V$12,\" *انجليزي\",\"\"))","v":"*انجليزي"},{"$f":"IF(AB13<AB$12,\" *رياضيات\",IF(AA13<AA$12,\" *رياضيات\",\"\"))","v":" *رياضيات"},{"$f":"IF(AG13<15,\" *الفزياء\",IF(AF13<3,\" *الفزياء\",\"\"))","v":" *الفزياء"},{"$f":"IF(AL13<AL$12,\" *رسم فني\",IF(AK13<AK$12,\" *رسم فني\",\"\"))","v":" *رسم فني"},{"$f":"IF(AQ13<AQ$12,\" *عملي رسم فني\",IF(AP13<AP$12,\" *عملي رسم فني\",\"\"))","v":" *عملي رسم فني"},{"$f":"IF(AW13<AW$12,\" *تخطيط\",IF(AV13<AV$12,\" *تخطيط\",\"\"))","v":" *تخطيط"},{"$f":"IF(BB13<BB$12,\" *أمن صناعي\",IF(BA13<BA$12,\" *أمن صناعي\",\"\"))","v":" *أمن صناعي"},{"$f":"IF(BG13<BG$12,\" *خامات\",IF(BF13<BF$12,\" *خامات\",\"\"))","v":" *خامات"},{"$f":"IF(BL13<BL$12,\" *أمن صناعي\",IF(BK13<BK$12,\" *أمن صناعي\",\"\"))","v":" *أمن صناعي"},{"$f":"IF(BQ13<BQ$12,\" *نظري معدات وماكنات\",IF(BP13<BP$12,\" *نظري معدات وماكنات\",\"\"))","v":" *نظري معدات وماكنات"},{"$f":"IF(BV13<BV$12,\" *عملي معدات وماكينات\",IF(BU13<BU$12,\" *عملي معدات وماكينات\",\"\"))","v":" *عملي معدات وماكينات"},{"$f":"IF(CB13<CB$12,\" *مراقبة جودة\",IF(CA13<CA$12,\" *مراقبة جودة\",\"\"))","v":" *مراقبة جودة"},{"$f":"IF(CG13<CG$12,\" *مقايسات\",IF(CF13<CF$12,\" *مقايسات\",\"\"))","v":" *مقايسات"},{"$f":"IF(CL13<CL$12,\" *الحاسب الالي\",IF(CK13<CK$12,\" *الحاسب الالي\",\"\"))","v":" *الحاسب الالي"},{"$f":"IF(CM13<CM$12,\"* مجموع كلى\",\"\")","v":"* مجموع كلى"},{"$f":"IF(CR13<CR$12,\" *دين\",IF(CQ13<CQ$12,\" *دين\",\"\"))","v":" *دين"},{"$f":"COUNTBLANK(DF13:DT13)","v":0},{"$f":"COUNTBLANK(DF13:DV13)","v":0}]
[2,null,null,null,null,"","","","","z2",20,null,null,3,15,null,null,18,4,12,null,null,16,null,null,null,null,0,null,null,null,null,0,null,null,null,null,0,null,null,null,null,0,0,null,null,null,null,0,null,null,null,null,{"$f":"IF(BA14=0.1,0,AY15+AY14+AZ14+BA14)","v":0},null,null,null,null,0,null,null,null,null,0,null,null,null,null,0,null,null,null,null,0,0,null,null,null,null,0,null,null,null,null,0,null,null,null,null,0,34,null,null,null,null,0,null,null,null,null,0,null,null,null,null,0,"راسبة"," *عربى*انجليزي *رياضيات *الفزياء *رسم فني *عملي رسم فني *تخطيط *أمن صناعي *خامات *أمن صناعي *نظري معدات وماكنات *عملي معدات وماكينات *مراقبة جودة *مقايسات *الحاسب الالي* مجموع كلى *دين",null," *عربى","*انجليزي"," *رياضيات"," *الفزياء"," *رسم فني"," *عملي رسم فني"," *تخطيط"," *أمن صناعي"," *خامات"," *أمن صناعي"," *نظري معدات وماكنات"," *عملي معدات وماكينات"," *مراقبة جودة"," *مقايسات"," *الحاسب الالي","* مجموع كلى"," *دين",0,0]
[3,null,null,null,null,"","","","","z3",30,null,null,3,15,null,null,18,4,12,null,null,16,null,null,null,null,0,null,null,null,null,0,null,null,null,null,0,null,null,null,null,0,0,null,null,null,null,0,null,null,null,null,{"$f":"IF(BA15=0.1,0,AX15+AY15+AZ15+BA15)","v":0},null,null,null,null,0,null,null,null,null,0,null,null,null,null,0,null,null,null,null,0,0,null,null,null,null,0,null,null,null,null,0,null,null,null,null,0,34,null,null,null,null,0,null,null,null,null,0,null,null,null,null,0,"راسبة"," *عربى*انجليزي *رياضيات *الفزياء *رسم فني *عملي رسم فني *تخطيط *أمن صناعي *خامات *أمن صناعي *نظري معدات وماكنات *عملي معدات وماكينات *مراقبة جودة *مقايسات *الحاسب الالي* مجموع كلى *دين",null," *عربى","*انجليزي"," *رياضيات"," *الفزياء"," *رسم فني"," *عملي رسم فني"," *تخطيط"," *أمن صناعي"," *خامات"," *أمن صناعي"," *نظري معدات وماكنات"," *عملي معدات وماكينات"," *مراقبة جودة"," *مقايسات"," *الحاسب الالي","* مجموع كلى"," *دين",0,0]
[4,null,null,null,null,"","","","","z4",40,null,null,3,15,null,null,18,null,null,null,null,0,null,null,null,null,0,null,null,null,null,0,null,null,null,null,0,null,null,null,null,0,0,null,null,null,null,0,null,null,null,null,0,null,null,null,null,0,null,null,null,null,0,null,null,null,null,0,null,null,null,null,0,0,null,null,null,null,0,null,null,null,null,0,null,null,null,null,0,18,null,null,null,null,0,null,null,null,null,0,null,null,null,null,0,"راسبة"," *عربى*انجليزي *رياضيات *الفزياء *رسم فني *عملي رسم فني *تخطيط *أمن صناعي *خامات *أمن صناعي *نظري معدات وماكنات *عملي معدات وماكينات *مراقبة جودة *مقايسات *الحاسب الالي* مجموع كلى *دين",null," *عربى","*انجليزي"," *رياضيات"," *الفزياء"," *رسم فني"," *عملي رسم فني"," *تخطيط"," *أمن صناعي"," *خامات"," *أمن صناعي"," *نظري معدات وماكنات"," *عملي معدات وماكينات"," *مراقبة جودة"," *مقايسات"," *الحاسب الالي","* مجموع كلى"," *دين",0,0]
[5,null,null,null,null,"","","","","z5",50,null,null,3,15,null,null,18,null,null,null,null,0,null,null,null,null,0,null,null,null,null,0,null,null,null,null,0,null,null,null,null,0,0,null,null,null,null,0,null,null,null,null,0,null,null,null,null,0,null,null,null,null,0,null,null,null,null,0,null,null,null,null,0,0,null,null,null,null,0,null,null,null,null,0,null,null,null,null,0,18,null,null,null,null,0,null,null,null,null,0,null,null,null,null,0,"راسبة"," *عربى*انجليزي *رياضيات *الفزياء *رسم فني *عملي رسم فني *تخطيط *أمن صناعي *خامات *أمن صناعي *نظري معدات وماكنات *عملي معدات وماكينات *مراقبة جودة *مقايسات *الحاسب الالي* مجموع كلى *دين",null," *عربى","*انجليزي"," *رياضيات"," *الفزياء"," *رسم فني"," *عملي رسم فني"," *تخطيط"," *أمن صناعي"," *خامات"," *أمن صناعي"," *نظري معدات وماكنات"," *عملي معدات وماكينات"," *مراقبة جودة"," *مقايسات"," *الحاسب الالي","* مجموع كلى"," *دين",0,0]
[6,null,null,null,null,"","","","","z6",60,null,null,null,null,null,null,0,null,null,null,null,0,null,null,null,null,0,null,null,null,null,0,null,null,null,null,0,null,null,null,null,0,0,null,null,null,null,0,null,null,null,null,0,null,null,null,null,0,null,null,null,null,0,null,null,null,null,0,null,null,null,null,0,0,null,null,null,null,0,null,null,null,null,0,null,null,null,null,0,0,null,null,null,null,0,null,null,null,null,0,null,null,null,null,0,"راسبة"," *عربى*انجليزي *رياضيات *الفزياء *رسم فني *عملي رسم فني *تخطيط *أمن صناعي *خامات *أمن صناعي *نظري معدات وماكنات *عملي معدات وماكينات *مراقبة جودة *مقايسات *الحاسب الالي* مجموع كلى *دين",null," *عربى","*انجليزي"," *رياضيات"," *الفزياء"," *رسم فني"," *عملي رسم فني"," *تخطيط"," *أمن صناعي"," *خامات"," *أمن صناعي"," *نظري معدات وماكنات"," *عملي معدات وماكينات"," *مراقبة جودة"," *مقايسات"," *الحاسب الالي","* مجموع كلى"," *دين",0,0]
[7,null,null,null,null,"","","","","z7",70,null,null,null,null,null,null,0,null,null,null,null,0,null,null,null,null,0,null,null,null,null,0,null,null,null,null,0,null,null,null,null,0,0,null,null,null,null,0,null,null,null,null,0,null,null,null,null,0,null,null,null,null,0,null,null,null,null,0,null,null,null,null,0,0,null,null,null,null,0,null,null,null,null,0,null,null,null,null,0,0,null,null,null,null,0,null,null,null,null,0,null,null,null,null,0,"راسبة"," *عربى*انجليزي *رياضيات *الفزياء *رسم فني *عملي رسم فني *تخطيط *أمن صناعي *خامات *أمن صناعي *نظري معدات وماكنات *عملي معدات وماكينات *مراقبة جودة *مقايسات *الحاسب الالي* مجموع كلى *دين",null," *عربى","*انجليزي"," *رياضيات"," *الفزياء"," *رسم فني"," *عملي رسم فني"," *تخطيط"," *أمن صناعي"," *خامات"," *أمن صناعي"," *نظري معدات وماكنات"," *عملي معدات وماكينات"," *مراقبة جودة"," *مقايسات"," *الحاسب الالي","* مجموع كلى"," *دين",0,0]
[8,null,null,null,null,"","","","","z8",80,null,null,null,null,null,null,0,null,null,null,null,0,null,null,null,null,0,null,null,null,null,0,null,null,null,null,0,null,null,null,null,0,0,null,null,null,null,0,null,null,null,null,0,null,null,null,null,0,null,null,null,null,0,null,null,null,null,0,null,null,null,null,0,0,null,null,null,null,0,null,null,null,null,0,null,null,null,null,0,0,null,null,null,null,0,null,null,null,null,0,null,null,null,null,0,"راسبة"," *عربى*انجليزي *رياضيات *الفزياء *رسم فني *عملي رسم فني *تخطيط *أمن صناعي *خامات *أمن صناعي *نظري معدات وماكنات *عملي معدات وماكينات *مراقبة جودة *مقايسات *الحاسب الالي* مجموع كلى *دين",null," *عربى","*انجليزي"," *رياضيات"," *الفزياء"," *رسم فني"," *عملي رسم فني"," *تخطيط"," *أمن صناعي"," *خامات"," *أمن صناعي"," *نظري معدات وماكنات"," *عملي معدات وماكينات"," *مراقبة جودة"," *مقايسات"," *الحاسب الالي","* مجموع كلى"," *دين",0,0]
{"$rows_left_out":147}
{"sheet":"شهادة نصف العام","index":1,"n_rows":51,"n_cols":29,"rows_kept":51,"cut":false,"hidden":false,"merged":[[43,15,44,15],[43,7,44,7],[43,8,44,8],[50,2,51,4],[50,9,51,11],[50,15,51,18],[43,16,44,16],[43,17,44,17],[43,18,44,18],[48,2,49,4],[48,9,49,11],[48,15,49,18],[43,9,44,9],[43,10,43,11],[43,12,44,12],[43,13,44,13],[43,14,44,14],[43,2,44,2],[43,3,44,3],[43,4,44,4],[43,5,44,5],[43,6,44,6],[38,3,38,6],[38,10,39,18],[42,5,42,6],[42,10,42,13],[42,16,42,18],[41,5,41,18],[39,3,39,7],[32,2,33,4],[32,9,33,11],[32,15,33,18],[27,9,28,9],[27,10,27,11],[27,12,28,12],[27,13,28,13],[27,14,28,14],[27,15,28,15],[34,2,35,4],[34,9,35,11],[34,15,35,18],[26,5,26,6],[26,10,26,13],[26,16,26,18],[27,2,28,2],[27,3,28,3],[27,4,28,4],[27,5,28,5],[27,6,28,6],[27,7,28,7],[27,8,28,8],[27,16,28,16],[27,17,28,17],[27,18,28,18],[25,5,25,18],[11,15,12,15],[11,16,12,16],[11,17,12,17],[11,18,12,18],[11,10,12,10],[23,3,23,7],[18,2,19,4],[18,9,19,11],[18,15,19,18],[22,3,22,6],[22,10,23,18],[16,2,17,4],[16,9,17,11],[16,15,17,18],[11,8,12,8],[11,9,12,9],[11,12,12,12],[11,13,12,13],[11,14,12,14],[11,2,12,2],[11,3,12,3],[11,4,12,4],[11,5,12,5],[11,6,12,6],[11,7,12,7],[11,11,12,11],[6,3,6,6],[6,10,7,18],[9,5,9,18],[10,5,10,6],[10,10,10,13],[10,16,10,18],[7,3,7,7]]}
[null,null,null,null,null,null,null,null,null,null,null,null,null,null,null,null,null,null,1]
[null,null,null,null,null,null,null,null,null,null,null,null,null,null,null,null,null,null,null,null,null,null,null,{"$f":"COUNTA('ملابس (2)'!$A$13:$A$166)-1","v":153}]
[]
[]
[null,null,null,null,null,null,null,null,null,null,null,null,null,null,null,null,null,null,null,null,null,1]
[]
[null,null,null,"إدارة القاهره التعليميه",null,null,null,null,null,null,"كنتـــــــــــــــــرول الصـــــــــــف الاول"]
[null,null,null,"مدرسة السدس الصناعيه بنات"]
[]
[null,null,"اسم الطالبة//",null,null,{"$f":"IFERROR(INDEX('ملابس (2)'!$J$13:$J$1660,MATCH($F11,'ملابس (2)'!$K$13:$K$1660,0)),\"\")","v":"z1"},null,null,null,null,null,null,null,null,null,null,null,null,null,null,null,null,null,null,null,null,null,"عدد الطلبه",{"$f":"MAX('ملابس (2)'!$A:$A)","v":154}]
[null,null,"رقم الجلوس//         ",null,null,{"$f":"IFERROR(VLOOKUP($V$5,'ملابس (2)'!$A$13:$K$1600,11,0),\"\")","v":10},null,null,null,null,"الصف//     الأول",null,null,null,null,"التخصص//","ملابس"]
[null,null,"لغة عربية","لغة انجليزية","رياضيات عامة","فيزياء","رسم نظرى","رسم عملى","تخطيط","امن صناعي","خامات","تصميم ","معدات","مراقبه","تك  معدات وصيانه","مقايسات ","حاسب الي","المجموع","تربية  دينية"]
[]
[null,null,{"$f":"[1]ملابس!L13","v":25},{"$f":"[1]ملابس!M13","v":20},{"$f":"[1]ملابس!N13","v":15},{"$f":"[1]ملابس!O13","v":10},{"$f":"[1]ملابس!P13","v":10},{"$f":"[1]ملابس!Q13","v":10},{"$f":"[1]ملابس!R13","v":10},{"$f":"[1]ملابس!S13","v":10},{"$f":"[1]ملابس!T13","v":75},{"$f":"[1]ملابس!U13","v":100},{"$f":"[1]ملابس!V13","v":15},{"$f":"[1]ملابس!W13","v":20},{"$f":"[1]ملابس!X13","v":20},{"$f":"[1]ملابس!Y13","v":10},{"$f":"[1]ملابس!Z13","v":10},{"$f":"[1]ملابس!AA13","v":360},{"$f":"[1]ملابس!AB13","v":10}]
[null,null,{"$f":"IFERROR(INDEX('ملابس (2)'!$R$13:$R$1660,MATCH($F11,'ملابس (2)'!$K$13:$K$1660,0)),\"\")","v":18},{"$f":"IFERROR(INDEX('ملابس (2)'!$W$13:$W$1660,MATCH($F11,'ملابس (2)'!$K$13:$K$1660,0)),\"\")","v":16},{"$f":"IFERROR(INDEX('ملابس (2)'!$AB$13:$AB$1660,MATCH($F11,'ملابس (2)'!$K$13:$K$1660,0)),\"\")","v":0},{"$f":"IFERROR(INDEX('ملابس (2)'!$AG$13:$AG$1660,MATCH($F11,'ملابس (2)'!$K$13:$K$1660,0)),\"\")","v":0},{"$f":"IFERROR(INDEX('ملابس (2)'!$AL$13:$AL$1660,MATCH($F11,'ملابس (2)'!$K$13:$K$1660,0)),\"\")","v":0},{"$f":"IFERROR(INDEX('ملابس (2)'!$AQ$13:$AQ$1660,MATCH($F11,'ملابس (2)'!$K$13:$K$1660,0)),\"\")","v":0},{"$f":"IFERROR(INDEX('ملابس (2)'!$AW$13:$AW$1660,MATCH($F11,'ملابس (2)'!$K$13:$K$1660,0)),\"\")","v":0},{"$f":"IFERROR(INDEX('ملابس (2)'!$BB$13:$BB$1660,MATCH($F11,'ملابس (2)'!$K$13:$K$1660,0)),\"\")","v":0},{"$f":"IFERROR(INDEX('ملابس (2)'!$BG$13:$BG$1660,MATCH($F11,'ملابس (2)'!$K$13:$K$1660,0)),\"\")","v":0},{"$f":"IFERROR(INDEX('ملابس (2)'!$BL$13:$BL$1660,MATCH($F11,'ملابس (2)'!$K$13:$K$1660,0)),\"\")","v":0},{"$f":"IFERROR(INDEX('ملابس (2)'!$BQ$13:$BQ$1660,MATCH($F11,'ملابس (2)'!$K$13:$K$1660,0)),\"\")","v":0},{"$f":"IFERROR(INDEX('ملابس (2)'!$CB$13:$CB$1660,MATCH($F11,'ملابس (2)'!$K$13:$K$1660,0)),\"\")","v":0},{"$f":"IFERROR(INDEX('ملابس (2)'!$BV$13:$BV$1660,MATCH($F11,'ملابس (2)'!$K$13:$K$1660,0)),\"\")","v":0},{"$f":"IFERROR(INDEX('ملابس (2)'!$CG$13:$CG$1660,MATCH($F11,'ملابس (2)'!$K$13:$K$1660,0)),\"\")","v":0},{"$f":"IFERROR(INDEX('ملابس (2)'!$CL$13:$CL$1660,MATCH($F11,'ملابس (2)'!$K$13:$K$1660,0)),\"\")","v":0},{"$f":"IFERROR(INDEX('ملابس (2)'!$CM$13:$CM$1660,MATCH($F11,'ملابس (2)'!$K$13:$K$1660,0)),\"\")","v":34},{"$f":"IFERROR(INDEX('ملابس (2)'!$CR$13:$CR$1660,MATCH($F11,'ملابس (2)'!$K$13:$K$1660,0)),\"\")","v":0}]
[null,null,23,28,38,43,48,33,53,78,73,63,null,58,98,83,88,103,109]
[null,null," الكنترول",null,null,null,null,null,null,"رئيس الكنترول",null,null,null,null,null,"مدير إدارة المدرسه"]
[]
[]
[]
{"$rows_left_out":31}