{"text_format":"1","workbook":"xlsx","n_sheets":7,"sheets":["Sheet1","Misc Data","Segments","Products","Products 1","Products 2","Root List"],"not_rendered":{"charts":0,"images":0,"macros":1,"external_links":0,"defined_names":3,"comments":1,"pivot_tables":0},"unopened":[],"bounds":{"document_bytes":16777216,"sheet_cells":100000,"rows_first":2000,"rows_last":500,"rows_between":2000,"halvings":0,"cell_chars":16384,"cell_head_chars":4096},"cells_cut":0,"cells_raw":0,"read":"whole","date_system":"1900"}

{"sheet":"Sheet1","index":0,"n_rows":45,"n_cols":11,"rows_kept":45,"cut":false,"hidden":false,"merged":[[50,0,74,11],[75,0,99,11],[4,0,4,1],[0,0,2,1],[4,2,4,3],[8,0,8,2],[9,0,9,2],[5,0,5,1],[5,2,5,3],[19,10,22,11],[29,3,29,4],[28,0,28,1],[29,0,29,1],[26,4,26,5],[25,0,25,2],[26,0,26,2],[25,10,25,11],[26,10,26,11],[25,4,25,5],[28,3,28,4],[19,0,22,9],[33,1,33,4],[35,7,35,8],[39,0,39,11],[33,9,33,11],[34,9,34,11],[35,9,35,11],[36,9,36,11],[37,9,37,11],[33,7,33,8],[14,0,14,11],[8,4,8,7],[9,4,9,7],[16,9,16,11],[17,9,17,11],[16,0,16,2],[17,0,17,2],[16,4,16,7],[17,4,17,7],[9,9,9,11],[11,9,11,11],[12,9,12,11],[11,0,11,7],[12,0,12,7],[42,10,42,11],[44,10,49,11],[23,0,23,11],[25,7,25,8],[26,7,26,8],[31,0,31,11],[28,6,29,8],[28,9,29,11],[44,5,49,9],[44,2,49,3],[44,0,49,1],[34,7,34,8],[36,7,36,8],[37,7,37,8],[41,0,42,1],[41,2,42,3],[4,5,4,6],[3,5,3,6],[0,10,1,11],[2,10,2,11],[41,10,41,11],[0,2,2,9],[6,0,6,11],[4,8,4,9],[4,10,4,11],[8,9,8,11],[41,5,42,6],[41,7,42,8],[34,1,34,4],[35,1,35,4],[36,1,36,4],[37,1,37,4]]}
[null,null,"Complaints Receival & Follow Up Form\nنموذج إستقبال و متابعة الشكاوى",null,null,null,null,null,null,null,"V 1.0\n17/12/2019"]
[]
[]
[null,null,null,null,null,"Complaint # / رقم الشكوى"]
["Complaint Date",null,{"$f":"IF(F5<>\"\",IF(C5=\"\",TODAY(),C5),\"\")","v":""},null,null,null,null,null,"Reciever"]
["Complaint Time",null,{"$f":"IF(F5<>\"\",IF(C6=\"\",NOW(),C6),\"\")","v":""}]
["Complaint Details"]
[]
["Complainer / صاحب الشكوى",null,null,null,"Name / الإسم",null,null,null,null,"Phone Number"]
[]
[]
["Address / العنوان",null,null,null,null,null,null,null,null,"Purchased From / مكان الشراء"]
[]
[]
["Complaint Tree / موضوع الشكوى"]
[]
["Segment 1",null,null,null,"Segment 2",null,null,null,null,"Complaint Subject"]
[]
[]
[null,null,null,null,null,null,null,null,null,null,"Complainer Notes / \nملاحظات صاحب الشكوي"]
[]
[]
[]
["Product Details / بيانات المنتج"]
[]
["Product / المنتج",null,null,null,"Can Size / التعبئة",null,null,"Batch # / التشغيلة",null,null,"P. Date / تاريخ الإنتاج"]
[]
[]
["Colored / ملون",null,null,"Color Code / كود اللون",null,null,"Substrate / السطح الذي تم دهانة"]
[]
[]
["Paint System / نظام الدهان"]
[]
["Order / الترتيب","Product / المنتج",null,null,null,"# of Coats / عدد الطبقات","Dilution / نسبة التخفيف","Recoating period / الوقت بين الطبقات",null,"Notes / ملاحظات"]
[1]
[2]
[3]
[4]
[]
["Investigation / البحث و التحقيق"]
[]
["Department / الإدارة",null,null,null,null,"Name / إسم المسئول",null,null,null,null,"Date"]
[null,null,null,null,null,null,null,null,null,null,{"$f":"IF(A45<>\"\",IF(K43=\"\",TODAY(),K43),\"\")","v":""}]
[]
[null,null,"Recommended Action / الإجراء الموصى به",null,null,null,null,null,null,null,"Investigation Result / نتيجة البحث و التحليل"]

{"sheet":"Misc Data","index":1,"n_rows":6,"n_cols":13,"rows_kept":6,"cut":false,"hidden":false,"merged":[[0,8,0,9],[0,6,0,7]]}
["Complainer","Complaint Segment","Complaint Segment","Tree 1","#",null,"Filter 1",null,"Sort",null,"Color","Recommended Action","Reciever"]
["Home Owner / صاحب منزل","Service Complaint\nشكاوى خدمية","Service Complaint\nشكاوى خدمية","Delivery\nالتوصيل",1,1,{"$f":"IFERROR(VLOOKUP(H2,$D$2:$E$6,2,0),\"\")","v":""},{"$f":"IF('Misc Data'!C2=Sheet1!$A$18,'Misc Data'!D2,\"\")","v":""},{"$f":"IFERROR(SMALL($G$2:$G$6,F2),\"\")","v":""},{"$f":"VLOOKUP(I2,$G$2:$H$6,2,0)","v":""},"No","Application on site /\n التطبيق لدى العميل","محمود عاطف"]
["Painter / نقاش","Product Compalint\nشكاوى المنتجات","Service Complaint\nشكاوى خدمية","Packaging\nالعبوات",2,2,{"$f":"IFERROR(VLOOKUP(H3,$D$2:$E$6,2,0),\"\")","v":""},{"$f":"IF('Misc Data'!C3=Sheet1!$A$18,'Misc Data'!D3,\"\")","v":""},{"$f":"IFERROR(SMALL($G$2:$G$6,F3),\"\")","v":""},{"$f":"VLOOKUP(I3,$G$2:$H$6,2,0)","v":""},"With CC","Retain Sample / سحب عينة من العميل\n","محمد سيد"]
["Trader / تاجر",null,"Product Compalint\nشكاوى المنتجات","Prior To Application\nقبل التطبيق",1,3,"",{"$f":"IF('Misc Data'!C4=Sheet1!$A$18,'Misc Data'!D4,\"\")","v":""},"","","MC","Quantity Replacement /\n تبديل الكمية"]
["Contractor / مقاول",null,"Product Compalint\nشكاوى المنتجات","During Application\nأثناء التطبيق",2,4,"",{"$f":"IF('Misc Data'!C5=Sheet1!$A$18,'Misc Data'!D5,\"\")","v":""},"","",null,"Compensation /\n تعويض العميل"]
["Interior Designer / مهندس ديكور",null,"Product Compalint\nشكاوى المنتجات","After Curing\nبعد الجفاف",3,5,"",{"$f":"IF('Misc Data'!C6=Sheet1!$A$18,'Misc Data'!D6,\"\")","v":""},"","",null,"Not Valid - No action Required /\n شكوى غير صحيحة - لا يوجد إجراء مطلوب"]

{"sheet":"Segments","index":2,"n_rows":38,"n_cols":14,"rows_kept":38,"cut":false,"hidden":false,"merged":[[0,10,0,11],[0,12,0,13]]}
["Complaint Segment","#","Tree 2","#","Sort","Tree 3","#",null,null,null,"Filter",null,"Sort"]
["Service Complaint\nشكاوى خدمية",1,"Delivery\nالتوصيل",1,1,"Worng address / توصيل لعنوان خطأ",1,1,null,null,{"$f":"IF(C2=Sheet1!$E$18,Segments!F2,\"\")","v":""},{"$f":"IFERROR(VLOOKUP(K2,F2:H38,3,0),\"\")","v":""},{"$f":"IFERROR(SMALL($L$2:$L$38,H2),\"\")","v":""},{"$f":"IFERROR(VLOOKUP(M2,$E$2:$F$38,2,0),\"\")","v":""}]
["Service Complaint\nشكاوى خدمية",1,"Delivery\nالتوصيل",1,2,"Late Delivery / تأخر في توصيل الطلبية",2,2,null,null,{"$f":"IF(C3=Sheet1!$E$18,Segments!F3,\"\")","v":""},{"$f":"IFERROR(VLOOKUP(K3,F3:H39,3,0),\"\")","v":""},{"$f":"IFERROR(SMALL($L$2:$L$38,H3),\"\")","v":""},{"$f":"IFERROR(VLOOKUP(M3,$E$2:$F$38,2,0),\"\")","v":""}]
["Service Complaint\nشكاوى خدمية",1,"Delivery\nالتوصيل",1,3,"Unplanned Delivery / عدم الترتيب التسليم مع العميل",3,3,null,null,{"$f":"IF(C4=Sheet1!$E$18,Segments!F4,\"\")","v":""},"","",""]
["Service Complaint\nشكاوى خدمية",1,"Delivery\nالتوصيل",1,4,"Wrong Order / محتويات الطلبية خاطئة",4,4,null,null,{"$f":"IF(C5=Sheet1!$E$18,Segments!F5,\"\")","v":""},"","",""]
["Service Complaint\nشكاوى خدمية",1,"Delivery\nالتوصيل",1,5,"Missing Items / بنود لم يتم تسليمها",5,5,null,null,{"$f":"IF(C6=Sheet1!$E$18,Segments!F6,\"\")","v":""},"","",""]
["Service Complaint\nشكاوى خدمية",1,"Packaging\nالعبوات",2,6,"Open Lid / غطاء مفتوح",1,6,null,null,{"$f":"IF(C7=Sheet1!$E$18,Segments!F7,\"\")","v":""},"","",""]
["Service Complaint\nشكاوى خدمية",1,"Packaging\nالعبوات",2,7,"Broken Lid / غطاء مكسور",2,7,null,null,{"$f":"IF(C8=Sheet1!$E$18,Segments!F8,\"\")","v":""},"","",""]
["Service Complaint\nشكاوى خدمية",1,"Packaging\nالعبوات",2,8,"Damaged Can / عبوة مكسورة أو تالفة",3,8,null,null,{"$f":"IF(C9=Sheet1!$E$18,Segments!F9,\"\")","v":""},"","",""]
["Service Complaint\nشكاوى خدمية",1,"Packaging\nالعبوات",2,9,"Damaged Handle / يد العبوة مكسورة",4,9,null,null,{"$f":"IF(C10=Sheet1!$E$18,Segments!F10,\"\")","v":""},"","",""]
["Product Compalint\nشكاوى المنتجات",2,"Prior To Application\nقبل التطبيق",1,10,"Viscosity / اللزوجة",1,10,null,null,{"$f":"IF(C11=Sheet1!$E$18,Segments!F11,\"\")","v":""},"","",""]
["Product Compalint\nشكاوى المنتجات",2,"Prior To Application\nقبل التطبيق",1,11,"Residues / رواسب",2,11,null,null,{"$f":"IF(C12=Sheet1!$E$18,Segments!F12,\"\")","v":""},"","",""]
["Product Compalint\nشكاوى المنتجات",2,"Prior To Application\nقبل التطبيق",1,12,"Odor / رائحة",3,12,null,null,{"$f":"IF(C13=Sheet1!$E$18,Segments!F13,\"\")","v":""},"","",""]
["Product Compalint\nشكاوى المنتجات",2,"Prior To Application\nقبل التطبيق",1,13,"Impurities / شوائب ",4,13,null,null,{"$f":"IF(C14=Sheet1!$E$18,Segments!F14,\"\")","v":""},"","",""]
["Product Compalint\nشكاوى المنتجات",2,"Prior To Application\nقبل التطبيق",1,14,"Skinning / قشرة صلبة",5,14,null,null,{"$f":"IF(C15=Sheet1!$E$18,Segments!F15,\"\")","v":""},"","",""]
["Product Compalint\nشكاوى المنتجات",2,"Prior To Application\nقبل التطبيق",1,15,"Filling Level / كمية المنتج",6,15,null,null,{"$f":"IF(C16=Sheet1!$E$18,Segments!F16,\"\")","v":""},"","",""]
["Product Compalint\nشكاوى المنتجات",2,"Prior To Application\nقبل التطبيق",1,16,"Expired Product / منتج منتهي الصلاحية",7,16,null,null,{"$f":"IF(C17=Sheet1!$E$18,Segments!F17,\"\")","v":""},"","",""]
["Product Compalint\nشكاوى المنتجات",2,"Prior To Application\nقبل التطبيق",1,17,"Rust / صدأ",8,17,null,null,{"$f":"IF(C18=Sheet1!$E$18,Segments!F18,\"\")","v":""},"","",""]
["Product Compalint\nشكاوى المنتجات",2,"During Application\nأثناء التطبيق",2,18,"Spreading Rate / معدل الفرد",1,18,null,null,{"$f":"IF(C19=Sheet1!$E$18,Segments!F19,\"\")","v":""},"","",""]
["Product Compalint\nشكاوى المنتجات",2,"During Application\nأثناء التطبيق",2,19,"Opacity / التغطية",2,19,null,null,{"$f":"IF(C20=Sheet1!$E$18,Segments!F20,\"\")","v":""},"","",""]
["Product Compalint\nشكاوى المنتجات",2,"During Application\nأثناء التطبيق",2,20,"Sagging / تسييل",3,20,null,null,{"$f":"IF(C21=Sheet1!$E$18,Segments!F21,\"\")","v":""},"","",""]
["Product Compalint\nشكاوى المنتجات",2,"During Application\nأثناء التطبيق",2,21,"Filling / الملء",4,21,null,null,{"$f":"IF(C22=Sheet1!$E$18,Segments!F22,\"\")","v":""},"","",""]
["Product Compalint\nشكاوى المنتجات",2,"During Application\nأثناء التطبيق",2,22,"Color Deviation / عدم مطابقة اللون",5,22,null,null,{"$f":"IF(C23=Sheet1!$E$18,Segments!F23,\"\")","v":""},"","",""]
["Product Compalint\nشكاوى المنتجات",2,"During Application\nأثناء التطبيق",2,23,"Long Curing Time / وقت جفاف طويل",6,23,null,null,{"$f":"IF(C24=Sheet1!$E$18,Segments!F24,\"\")","v":""},"","",""]
["Product Compalint\nشكاوى المنتجات",2,"During Application\nأثناء التطبيق",2,24,"Short Curing Time / وقت جفاف قصير",7,24,null,null,{"$f":"IF(C25=Sheet1!$E$18,Segments!F25,\"\")","v":""},"","",""]
["Product Compalint\nشكاوى المنتجات",2,"During Application\nأثناء التطبيق",2,25,"Application Breaks / فواصل أو لحامات",8,25,null,null,{"$f":"IF(C26=Sheet1!$E$18,Segments!F26,\"\")","v":""},"","",""]
["Product Compalint\nشكاوى المنتجات",2,"During Application\nأثناء التطبيق",2,26,"Sanding / الصنفرة",9,26,null,null,{"$f":"IF(C27=Sheet1!$E$18,Segments!F27,\"\")","v":""},"","",""]
["Product Compalint\nشكاوى المنتجات",2,"During Application\nأثناء التطبيق",2,27,"Application Difficulties / صعوبة في التطبيق",10,27,null,null,{"$f":"IF(C28=Sheet1!$E$18,Segments!F28,\"\")","v":""},"","",""]
["Product Compalint\nشكاوى المنتجات",2,"After Curing\nبعد الجفاف",3,28,"Peeling / تقشير",1,28,null,null,{"$f":"IF(C29=Sheet1!$E$18,Segments!F29,\"\")","v":""},"","",""]
["Product Compalint\nشكاوى المنتجات",2,"After Curing\nبعد الجفاف",3,29,"Cracking / شروخ سطحية",2,29,null,null,{"$f":"IF(C30=Sheet1!$E$18,Segments!F30,\"\")","v":""},"","",""]
["Product Compalint\nشكاوى المنتجات",2,"After Curing\nبعد الجفاف",3,30,"Fading (Interior) / بهتان لون داخلي",3,30,null,null,{"$f":"IF(C31=Sheet1!$E$18,Segments!F31,\"\")","v":""},"","",""]
["Product Compalint\nشكاوى المنتجات",2,"After Curing\nبعد الجفاف",3,31,"Fading (Exterior) / بهتان لون خارجي",4,31,null,null,{"$f":"IF(C32=Sheet1!$E$18,Segments!F32,\"\")","v":""},"","",""]
["Product Compalint\nشكاوى المنتجات",2,"After Curing\nبعد الجفاف",3,32,"Washability / قابلية الغسيل",5,32,null,null,{"$f":"IF(C33=Sheet1!$E$18,Segments!F33,\"\")","v":""},"","",""]
["Product Compalint\nشكاوى المنتجات",2,"After Curing\nبعد الجفاف",3,33,"Glossiness Level / درجة اللمعة",6,33,null,null,{"$f":"IF(C34=Sheet1!$E$18,Segments!F34,\"\")","v":""},"","",""]
["Product Compalint\nشكاوى المنتجات",2,"After Curing\nبعد الجفاف",3,34,"Texture / الملمس",7,34,null,null,{"$f":"IF(C35=Sheet1!$E$18,Segments!F35,\"\")","v":""},"","",""]
["Product Compalint\nشكاوى المنتجات",2,"After Curing\nبعد الجفاف",3,35,"Color Deviation / عدم مطابقة اللون",8,35,null,null,{"$f":"IF(C36=Sheet1!$E$18,Segments!F36,\"\")","v":""},"","",""]
["Product Compalint\nشكاوى المنتجات",2,"After Curing\nبعد الجفاف",3,36,"Decorative Effect / التأثير الديكوري",9,36,null,null,{"$f":"IF(C37=Sheet1!$E$18,Segments!F37,\"\")","v":""},"","",""]
["Product Compalint\nشكاوى المنتجات",2,"After Curing\nبعد الجفاف",3,37,"Yellowing / إصفرار",10,37,null,null,{"$f":"IF(C38=Sheet1!$E$18,Segments!F38,\"\")","v":""},"","",""]

{"sheet":"Products","index":3,"n_rows":123,"n_cols":12,"rows_kept":123,"cut":false,"hidden":false,"merged":[[0,7,0,8],[0,10,0,11]]}
[null,"Family","Product","Packing",null,null,null,"Filter 1",null,null,"Sort"]
[1,"ستارت ميتاليك"," ستارت ميتالك أساس مائى","عبوة 0.750 لتر",null,null,null,{"$f":"IFERROR(VLOOKUP(I2,A1:D122,4,0),\"\")","v":""},{"$f":"IF(C2=Sheet1!$A$27,Products!A2,\"\")","v":""},null,{"$f":"IFERROR(SMALL($I$2:$I$300,A2),\"\")","v":""},{"$f":"IFERROR(VLOOKUP(K2,$A$1:$D$122,4,0),\"\")","v":""}]
[2,"ستارت ميتاليك"," ستارت ميتالك أساس مائى","عبوة 0.375 لتر",null,null,null,{"$f":"IFERROR(VLOOKUP(I3,A2:D123,4,0),\"\")","v":""},{"$f":"IF(C3=Sheet1!$A$27,Products!A3,\"\")","v":""},null,{"$f":"IFERROR(SMALL($I$2:$I$300,A3),\"\")","v":""},{"$f":"IFERROR(VLOOKUP(K3,$A$1:$D$122,4,0),\"\")","v":""}]
[3,"ستارت ميتاليك"," ستارت ميتالك أساس مائى","عبوة 0.190 لتر",null,null,null,"",{"$f":"IF(C4=Sheet1!$A$27,Products!A4,\"\")","v":""},null,"",""]
[4," كراكيل فينيش"," كراكيل فينيش","عبوة 1 لتر",null,null,null,"",{"$f":"IF(C5=Sheet1!$A$27,Products!A5,\"\")","v":""},null,"",""]
[5,"تاكت"," معجون تاكت","بستلة 22 كجم",null,null,null,"",{"$f":"IF(C6=Sheet1!$A$27,Products!A6,\"\")","v":""},null,"",""]
[6,"تاكت"," معجون تاكت","بستلة 15 كجم",null,null,null,"",{"$f":"IF(C7=Sheet1!$A$27,Products!A7,\"\")","v":""},null,"",""]
[7,"تاكت"," معجون تاكت","شيكارة 15 كجم",null,null,null,"",{"$f":"IF(C8=Sheet1!$A$27,Products!A8,\"\")","v":""},null,"",""]
[8,"تاكت"," معجون تاكت","جالون 5 كجم",null,null,null,"",{"$f":"IF(C9=Sheet1!$A$27,Products!A9,\"\")","v":""},null,"",""]
[9,"تاكت"," معجون تاكت","عبوة 1 كجم",null,null,null,"",{"$f":"IF(C10=Sheet1!$A$27,Products!A10,\"\")","v":""},null,"",""]
[10,1015,"1015","بستلة",null,null,null,"",{"$f":"IF(C11=Sheet1!$A$27,Products!A11,\"\")","v":""},null,"",""]
[11,"المقاوم ","المقاوم 0017","بستلة 14 لتر",null,null,null,"",{"$f":"IF(C12=Sheet1!$A$27,Products!A12,\"\")","v":""},null,"",""]
[12,"المقاوم ","المقاوم 0017","بستلة 9 لتر",null,null,null,"",{"$f":"IF(C13=Sheet1!$A$27,Products!A13,\"\")","v":""},null,"",""]
[13,"المقاوم ","المقاوم 0017","جالون 2.4 لتر",null,null,null,"",{"$f":"IF(C14=Sheet1!$A$27,Products!A14,\"\")","v":""},null,"",""]
[14,"المقاوم ","المقاوم 0017","عبوة 0.650 لتر",null,null,null,"",{"$f":"IF(C15=Sheet1!$A$27,Products!A15,\"\")","v":""},null,"",""]
[15,"باي تون","باي تون","بستلة",null,null,null,"",{"$f":"IF(C16=Sheet1!$A$27,Products!A16,\"\")","v":""},null,"",""]
[16,"برماستار ","برماستار 1010","بستلة 14 كجم ",null,null,null,"",{"$f":"IF(C17=Sheet1!$A$27,Products!A17,\"\")","v":""},null,"",""]
[17,"برماستار ","برماستار 1010","جالون 3.75 لتر",null,null,null,"",{"$f":"IF(C18=Sheet1!$A$27,Products!A18,\"\")","v":""},null,"",""]
[18,"برماكوول ","برماكوول 001","بستلة 18 كجم ",null,null,null,"",{"$f":"IF(C19=Sheet1!$A$27,Products!A19,\"\")","v":""},null,"",""]
[19,"برماكوول ","برماكوول 001","جالون 2.5 لتر",null,null,null,"",{"$f":"IF(C20=Sheet1!$A$27,Products!A20,\"\")","v":""},null,"",""]
[20,"بنتون","بنتون","بستلة",null,null,null,"",{"$f":"IF(C21=Sheet1!$A$27,Products!A21,\"\")","v":""},null,"",""]
[21,"جلتكس ","جلتكس 15000","بستلة 9 لتر",null,null,null,"",{"$f":"IF(C22=Sheet1!$A$27,Products!A22,\"\")","v":""},null,"",""]
[22,"جلتكس ","جلتكس 15000","جالون 2.5 لتر",null,null,null,"",{"$f":"IF(C23=Sheet1!$A$27,Products!A23,\"\")","v":""},null,"",""]
[23,"جلتكس ","جلتكس 20000","بستلة 9 لتر",null,null,null,"",{"$f":"IF(C24=Sheet1!$A$27,Products!A24,\"\")","v":""},null,"",""]
[24,"جلتكس ","جلتكس 20000","جالون 2.5 لتر",null,null,null,"",{"$f":"IF(C25=Sheet1!$A$27,Products!A25,\"\")","v":""},null,"",""]
[25,"جلتكس ","جلتكس 20000","عبوة 0.650 لتر",null,null,null,"",{"$f":"IF(C26=Sheet1!$A$27,Products!A26,\"\")","v":""},null,"",""]
[26,"جلتكس ","جلتكس 25000","بستلة 9 لتر",null,null,null,"",{"$f":"IF(C27=Sheet1!$A$27,Products!A27,\"\")","v":""},null,"",""]
[27,"جلتكس ","جلتكس 25000","جالون 2.5 لتر",null,null,null,"",{"$f":"IF(C28=Sheet1!$A$27,Products!A28,\"\")","v":""},null,"",""]
[28,"جلتكس ","جلتكس 25000","عبوة 0.650 لتر",null,null,null,"",{"$f":"IF(C29=Sheet1!$A$27,Products!A29,\"\")","v":""},null,"",""]
[29,"داي - تون بلّس ","داي - تون بلّس 2020","بستلة 14 كجم ",null,null,null,"",{"$f":"IF(C30=Sheet1!$A$27,Products!A30,\"\")","v":""},null,"",""]
[30,"داي - تون بلّس ","داي - تون بلّس 2020","جالون 3.75 لتر",null,null,null,"",{"$f":"IF(C31=Sheet1!$A$27,Products!A31,\"\")","v":""},null,"",""]
[31,"داي - ستون ","داي - ستون 7070","بستلة 9 لتر",null,null,null,"",{"$f":"IF(C32=Sheet1!$A$27,Products!A32,\"\")","v":""},null,"",""]
[32,"داي - ستون ","داي - ستون 7070","جالون 2.5 لتر",null,null,null,"",{"$f":"IF(C33=Sheet1!$A$27,Products!A33,\"\")","v":""},null,"",""]
[33,"داي - ستون ","داي - ستون 7070","عبوة 0.650 لتر",null,null,null,"",{"$f":"IF(C34=Sheet1!$A$27,Products!A34,\"\")","v":""},null,"",""]
[34,"زيجزاج ","زيجزاج 303","عبوة 0.750 لتر",null,null,null,"",{"$f":"IF(C35=Sheet1!$A$27,Products!A35,\"\")","v":""},null,"",""]
[35,"زيجزاج ","زيجزاج 303","عبوة 0.350 لتر",null,null,null,"",{"$f":"IF(C36=Sheet1!$A$27,Products!A36,\"\")","v":""},null,"",""]
[36,"ستارت ","ستارت بلاستيك","بستلة 9 لتر",null,null,null,"",{"$f":"IF(C37=Sheet1!$A$27,Products!A37,\"\")","v":""},null,"",""]
[37,"ستارت ","ستارت بلاستيك","بستلة 16 لتر",null,null,null,"",{"$f":"IF(C38=Sheet1!$A$27,Products!A38,\"\")","v":""},null,"",""]
[38,"ستارت ","ستارت بلاستيك","برميل 150 كجم",null,null,null,"",{"$f":"IF(C39=Sheet1!$A$27,Products!A39,\"\")","v":""},null,"",""]
[39,"ستارت","ستارت سيلر","بستلة 14 لتر",null,null,null,"",{"$f":"IF(C40=Sheet1!$A$27,Products!A40,\"\")","v":""},null,"",""]
[40,"ستارت","ستارت سيلر","بستلة 7.5 لتر",null,null,null,"",{"$f":"IF(C41=Sheet1!$A$27,Products!A41,\"\")","v":""},null,"",""]
[41,"سوبر برايتون ","سوبر برايتون 1515","بستلة",null,null,null,"",{"$f":"IF(C42=Sheet1!$A$27,Products!A42,\"\")","v":""},null,"",""]
[42,"سوبر داي - تون ","سوبر داي - تون 3030","بستلة 14 لتر",null,null,null,"",{"$f":"IF(C43=Sheet1!$A$27,Products!A43,\"\")","v":""},null,"",""]
[43,"سوبر داي - تون ","سوبر داي - تون 3030","بستلة 14 كجم ",null,null,null,"",{"$f":"IF(C44=Sheet1!$A$27,Products!A44,\"\")","v":""},null,"",""]
[44,"سوبر داي - تون ","سوبر داي - تون 3030","جالون 2.5 لتر",null,null,null,"",{"$f":"IF(C45=Sheet1!$A$27,Products!A45,\"\")","v":""},null,"",""]
[45,"سوبر داي - تون ","سوبر داي - تون 3030","عبوة 1 كجم",null,null,null,"",{"$f":"IF(C46=Sheet1!$A$27,Products!A46,\"\")","v":""},null,"",""]
[46,"سيلر جيل نيل ","سيلر جيل نيل 29","بستلة 9 لتر",null,null,null,"",{"$f":"IF(C47=Sheet1!$A$27,Products!A47,\"\")","v":""},null,"",""]
[47,"سيلر جيل نيل ","سيلر جيل نيل 29","جالون 2.5 لتر",null,null,null,"",{"$f":"IF(C48=Sheet1!$A$27,Products!A48,\"\")","v":""},null,"",""]
[48,"سيلر جيل نيل ","سيلر جيل نيل 290","بستلة 9 لتر",null,null,null,"",{"$f":"IF(C49=Sheet1!$A$27,Products!A49,\"\")","v":""},null,"",""]
[49,"غراء ","غراء بولى بوند","جالون 4 كجم",null,null,null,"",{"$f":"IF(C50=Sheet1!$A$27,Products!A50,\"\")","v":""},null,"",""]
[50,"غراء ","غراء بولى بوند","بستلة 10 كجم",null,null,null,"",{"$f":"IF(C51=Sheet1!$A$27,Products!A51,\"\")","v":""},null,"",""]
[51,"كوش برايمر ","كوش برايمر سينتيتيك 150","بستلة 15 كجم",null,null,null,"",{"$f":"IF(C52=Sheet1!$A$27,Products!A52,\"\")","v":""},null,"",""]
[52,"كوش برايمر ","كوش برايمر سينتيتيك 150","جالون 3 كجم",null,null,null,"",{"$f":"IF(C53=Sheet1!$A$27,Products!A53,\"\")","v":""},null,"",""]
[53,"كوش برايمر ","كوش برايمر سينتيتيك 150","عبوة 0.850 جم",null,null,null,"",{"$f":"IF(C54=Sheet1!$A$27,Products!A54,\"\")","v":""},null,"",""]
[54,"كوملبيكو ","كوملبيكو 27","بستلة 16 كجم",null,null,null,"",{"$f":"IF(C55=Sheet1!$A$27,Products!A55,\"\")","v":""},null,"",""]
[55,"لاكيه داي-تون مط ","لاكيه داي-تون مط 200 الوان","جالون 6 كجم",null,null,null,"",{"$f":"IF(C56=Sheet1!$A$27,Products!A56,\"\")","v":""},null,"",""]
[56,"لاكيه داي-تون مط ","لاكيه داي-تون مط 200 الوان","جالون 3.75 كجم",null,null,null,"",{"$f":"IF(C57=Sheet1!$A$27,Products!A57,\"\")","v":""},null,"",""]
[57,"لاكيه داي-تون مط ","لاكيه داي-تون مط 200 الوان","عبوة 1 كجم",null,null,null,"",{"$f":"IF(C58=Sheet1!$A$27,Products!A58,\"\")","v":""},null,"",""]
[58,"لاكيه داي-تون مط ","لاكيه داي-تون مط 200 أبيض","جالون 3.5 لتر",null,null,null,"",{"$f":"IF(C59=Sheet1!$A$27,Products!A59,\"\")","v":""},null,"",""]
[59,"لاكيه داي-تون مط ","لاكيه داي-تون مط 200 أبيض","جالون 3.5 كجم",null,null,null,"",{"$f":"IF(C60=Sheet1!$A$27,Products!A60,\"\")","v":""},null,"",""]
{"$rows_left_out":64}
{"sheet":"Products 1","index":4,"n_rows":45,"n_cols":2,"rows_kept":45,"cut":false,"hidden":false,"merged":[]}
["Family","Product"]
["ستارت ميتاليك"," ستارت ميتالك أساس مائى"]
[" كراكيل فينيش"," كراكيل فينيش"]
["تاكت"," معجون تاكت"]
[1015,"1015"]
["المقاوم ","المقاوم 0017"]
["باي تون","باي تون"]
["برماستار ","برماستار 1010"]
["برماكوول ","برماكوول 001"]
["بنتون","بنتون"]
["جلتكس ","جلتكس 15000"]
["جلتكس ","جلتكس 20000"]
["جلتكس ","جلتكس 25000"]
["داي - تون بلّس ","داي - تون بلّس 2020"]
["داي - ستون ","داي - ستون 7070"]
["زيجزاج ","زيجزاج 303"]
["ستارت ","ستارت بلاستيك"]
["ستارت","ستارت سيلر"]
["سوبر برايتون ","سوبر برايتون 1515"]
["سوبر داي - تون ","سوبر داي - تون 3030"]
["جيل نيل ","سيلر جيل نيل 29"]
["جيل نيل ","سيلر جيل نيل 290"]
["غراء ","غراء بولى بوند"]
["كوش برايمر ","كوش برايمر سينتيتيك 150"]
["كوملبيكو ","كوملبيكو 27"]
["لاكيه داي-تون مط ","لاكيه داي-تون مط 200 الوان"]
["لاكيه داي-تون مط ","لاكيه داي-تون مط 200 أبيض"]
["لاكيه داي-تون مط ","لاكيه داي-تون مط 200 عسلي"]
["لاكيه ستارت","لاكيه ستارت الوان"]
["لاكيه ستارت","لاكيه ستارت أبيض"]
["لاكيه سوبر لاك ","لاكيه سوبر لاك ابيض 786"]
["لاكيه سوبر لاك ","لاكيه سوبر لاك الوان"]
["لاكيه سوبر لاك ","لاكيه سوبر لاك الوان 708"]
["لاكيه فرست كوت","لاكيه فرست كوت 505"]
["لاكيه لؤلؤ","لاكيه لؤلؤ أبيض"]
["مذيب مخفف ","مذيب مخفف 033"]
["معجون أكريليك ","معجون أكريليك 900"]
["معجون برايتو ","معجون برايتو 999"]
["معجون داي - تون ","معجون داي - تون 100"]
["معجون شروخ ","معجون شروخ فل تايم"]
["ملونات ","ملونات ســـــى ســـــى "]
["ورنيش بيور ","ورنيش بيور 1901"]
["ورنيش زجاجي لامع ","ورنيش زجاجي لامع 901"]
["ورنيش زجاجي مط ","ورنيش زجاجي مط 1001"]
["ورنيش ستاندرد ","ورنيش ستاندرد 690"]

{"sheet":"Products 2","index":5,"n_rows":0,"n_cols":0,"rows_kept":0,"cut":false,"hidden":false,"merged":[]}

{"sheet":"Root List","index":6,"n_rows":38,"n_cols":6,"rows_kept":38,"cut":false,"hidden":false,"merged":[[1,3,5,3],[6,3,9,3],[10,3,17,3],[18,3,27,3],[28,3,37,3],[1,0,9,0],[10,0,37,0],[1,2,5,2],[6,2,9,2],[10,2,17,2],[18,2,27,2],[28,2,37,2],[1,1,9,1],[10,1,37,1]]}
["Complaint Segment","#","Tree 2","#","Tree 3","#"]
["Service Complaint\nشكاوى خدمية",1,"Delivery\nالتوصيل",1,"Worng address / توصيل لعنوان خطأ",1]
[null,null,null,null,"Late Delivery / تأخر في توصيل الطلبية",2]
[null,null,null,null,"Unplanned Delivery / عدم الترتيب التسليم مع العميل",3]
[null,null,null,null,"Wrong Order / محتويات الطلبية خاطئة",4]
[null,null,null,null,"Missing Items / بنود لم يتم تسليمها",5]
[null,null,"Packaging\nالعبوات",2,"Open Lid / غطاء مفتوح",1]
[null,null,null,null,"Broken Lid / غطاء مكسور",2]
[null,null,null,null,"Damaged Can / عبوة مكسورة أو تالفة",3]
[null,null,null,null,"Damaged Handle / يد العبوة مكسورة",4]
["Product Compalint\nشكاوى المنتجات",2,"Prior To Application\nقبل التطبيق",1,"Viscosity / اللزوجة",1]
[null,null,null,null,"Residues / رواسب",2]
[null,null,null,null,"Odor / رائحة",3]
[null,null,null,null,"Impurities / شوائب ",4]
[null,null,null,null,"Skinning / قشرة صلبة",5]
[null,null,null,null,"Filling Level / كمية المنتج",6]
[null,null,null,null,"Expired Product / منتج منتهي الصلاحية",7]
[null,null,null,null,"Rust / صدأ",8]
[null,null,"During Application\nأثناء التطبيق",2,"Spreading Rate / معدل الفرد",1]
[null,null,null,null,"Opacity / التغطية",2]
[null,null,null,null,"Sagging / تسييل",3]
[null,null,null,null,"Filling / الملء",4]
[null,null,null,null,"Color Deviation / عدم مطابقة اللون",5]
[null,null,null,null,"Long Curing Time / وقت جفاف طويل",6]
[null,null,null,null,"Short Curing Time / وقت جفاف قصير",7]
[null,null,null,null,"Application Breaks / فواصل أو لحامات",8]
[null,null,null,null,"Sanding / الصنفرة",9]
[null,null,null,null,"Application Difficulties / صعوبة في التطبيق",10]
[null,null,"After Curing\nبعد الجفاف",3,"Peeling / تقشير",1]
[null,null,null,null,"Cracking / شروخ سطحية",2]
[null,null,null,null,"Fading (Interior) / بهتان لون داخلي",3]
[null,null,null,null,"Fading (Exterior) / بهتان لون خارجي",4]
[null,null,null,null,"Washability / قابلية الغسيل",5]
[null,null,null,null,"Glossiness Level / درجة اللمعة",6]
[null,null,null,null,"Texture / الملمس",7]
[null,null,null,null,"Color Deviation / عدم مطابقة اللون",8]
[null,null,null,null,"Decorative Effect / التأثير الديكوري",9]
[null,null,null,null,"Yellowing / إصفرار",10]