{"text_format":"1","workbook":"xlsx","n_sheets":3,"sheets":["الاسئلة","الاختبارات","اسماء المتسابقين"],"not_rendered":{"charts":0,"images":0,"macros":1,"external_links":0,"defined_names":0,"comments":0,"pivot_tables":0},"unopened":[],"bounds":{"document_bytes":16777216,"sheet_cells":100000,"rows_first":2000,"rows_last":500,"rows_between":2000,"halvings":0,"cell_chars":16384,"cell_head_chars":4096},"cells_cut":0,"cells_raw":0,"read":"whole","date_system":"1900"}

{"sheet":"الاسئلة","index":0,"n_rows":16,"n_cols":7,"rows_kept":16,"cut":false,"hidden":false,"merged":[]}
["م","الاسم","الاختيار 1","الاختيار 2","الاختيار 3","الاختيار 4","الإجابة"]
[1,"من هو الصديق","عمر بن الخطاب","عثمان بن عفان","أبو بكر – عبد الله بن قحافة","علي بن أبي طالب","أبو بكر – عبد الله بن قحافة"]
[2,"الفاروق - شهيد المحراب","عبدالله بن عباس","سعد بن أبي وقاص","عبدالله بن الزبير","عمر بن الخطاب","عمر بن الخطاب"]
[3,"ذو النورين","الزبير بن العوام","عثمان بن عفان","عبدالرحمن بن عوف","أبو عبيدة عامر بن الجراح","عثمان بن عفان"]
[4,"فدائي الهجرة","علي بن أبي طالب","عمر بن الخطاب","عثمان بن عفان","أبو بكر – عبد الله بن قحافة","علي بن أبي طالب"]
[5,"حبر الأمة - ترجمان القرآن","عبدالله بن عباس","سعد بن أبي وقاص","عبدالله بن عباس","عبدالله بن الزبير","عبدالله بن عباس"]
[6,"الأسد في براثنه","أسامة بن حارثة","سعد بن أبي وقاص","الحسن والحسين","بلال بن رباح","سعد بن أبي وقاص"]
[7,"أسد الله - سيد الشهداء","العباس بن عبدالمطلب","الزبير بن العوام","حمزة بن عبدالمطلب","أبو عبيدة عامر بن الجراح","حمزة بن عبدالمطلب"]
[8,"خطيب رسول الله","ثابت بن قيس","خالد بن الوليد","زيد بن حارثة","أسامة بن حارثة","ثابت بن قيس"]
[9,"صاحبة الهجرتين","حفصة بنت عمر","أسماء بنت عميس","نسيبة بنت كعب الأنصارية","أم حرام","أسماء بنت عميس"]
[10,"حِبُ رسول الله","خبيب بن عدي","عكرمة بن أبي جهل","عمرو بن العاص","زيد بن حارثة","زيد بن حارثة"]
[11,"ريحانتي الرسول","جعفر بن أبي طالب","الحسن والحسين","بلال بن رباح","حسان بن ثابت","الحسن والحسين"]
[12,"مدة خلافة أبو بكر الصديق","4 سنوات و 3 اشهر","11 سنة","سنتان و3 أشهر","8 سنوات و 6 اشهر","سنتان و3 أشهر"]
[13,"مدة خلافة عمر بن الخطاب","6 سنوات و8 اشهر","10 سنوات و4 أشهر","3 سنوات و 4 اشهر","7 سنوات وشهران","10 سنوات و4 أشهر"]
[14,"مدة خلافة عثمان بن عفان","12 سنة","11 سنة","6 سنوات","9 سنوات","12 سنة"]
[15," مدة خلافةعلي بن أبي طالب","3 سنوت و 5 اشهر","4 سنوات","13 سنة ","5 سنوات","5 سنوات"]

{"sheet":"الاختبارات","index":1,"n_rows":19,"n_cols":11,"rows_kept":19,"cut":false,"hidden":false,"merged":[[1,2,1,7],[10,2,13,3],[2,5,2,8]]}
[null,"زمن البداية","08:01:13","زمن النهاية",null,"المدة بالثواني",{"$f":"IF(E1=\"\",\"\",(E1-C1)*86400)","v":""}]
[null,null,{"$f":"\"لديك \"&G4&\" ثانية للإجابة على كل سؤال\"","v":"لديك 15 ثانية للإجابة على كل سؤال"},null,null,null,null,null,null,null,{"$f":"VLOOKUP(C9,الاسئلة!$A$2:$G$16,7,0)","v":"زيد بن حارثة"}]
[null,null,"اسم المتسابق","محمد المحمدي"]
[null,null,"الصف الذى به الطالب","الأول",null,"أقصى مدة للتفكير",15,"الرقم بالثواني وهو الزمن المسموح للطالب أن يفكر فيه بالأجابة وبعدها سيفقد درجة السؤال ولا يسمح له بالإجابة عليه"]
[null,null,"الاجوابة الصحيحة",0,null,"مؤقت زمنى للاسئلة",2,"الرقم بالثواني وهو الزمن بين كل سؤال وآخر وكذاك زمن الوميض"]
[null,null,"الاجوابة الخاطئة",0,null,"عدد الأسئلة لكل طالب",3,"عدد الأسئلة لكل طالب وبعد الانتهاء سيتم ترحيل النتيجة"]
[null,null,null,null,null,"نتيجة السؤال الحالي",{"$f":"IF(D10=K2,\"إجابة صحيحة\",\"إجابة خاطئة\")","v":"إجابة خاطئة"}]
[null,null,{"$f":"\"السؤال رقم  : \"&D9+1","v":"السؤال رقم  : 1"},{"$f":"VLOOKUP(C9,الاسئلة!$A$2:$G$16,2,0)","v":"حِبُ رسول الله"}]
[null,null,10,0]
[null,null,"الإجابة","حفصة بنت عمر"]
[]
[null,{"$f":"VLOOKUP(C9,الاسئلة!$A$2:$G$16,3,0)","v":"خبيب بن عدي"},null,null,{"$f":"VLOOKUP(C9,الاسئلة!$A$2:$G$16,4,0)","v":"عكرمة بن أبي جهل"}]
[]
[null,{"$f":"VLOOKUP(C9,الاسئلة!$A$2:$G$16,5,0)","v":"عمرو بن العاص"},null,null,{"$f":"VLOOKUP(C9,الاسئلة!$A$2:$G$16,6,0)","v":"زيد بن حارثة"}]
[]
[null,null,null,null,"هذه الخلية الصفراء فيها ترقيم لعدد الأسئلة التي تعطى لكل طالب يعني أذا وصل الرقم إلى 3 سينتهي الاختبار"]
[]
[null,null,null,"هذه الخلية الصفراء فيها رقم السؤال في ورقة الاسئلة ولك الخيار إما أن تغيرها يدويا أو تترك تغييرها للبرنامج "]
[null,null,null,"يعني إذا وصل العدد لى 15 سيتم إعادة الترقيم لأن عدد الأسئلة كلها هو 15"]

{"sheet":"اسماء المتسابقين","index":2,"n_rows":103,"n_cols":14,"rows_kept":103,"cut":false,"hidden":false,"merged":[[2,8,2,9],[2,10,2,11],[1,8,1,11]]}
[]
[null,null,null,null,null,null,null,null,"جدول التوزيع"]
["اسم المتسابق","الصف الذى به الطالب","الاجوابة الصحيحة","الاجوابة الخاطئة","رقم الجلوس","رقم السرى",null,null,"رقم الجلوس",null,"الرقم السرى"]
["مهند الزبيدي","العاشر",3,10,1,236,null,null,"من","الى","من","الى"]
["محمد المحمدي","الأول",0,2,2,237,"اضغط الزر ويستم التوزيع",null,1,10,236,{"$f":"IF(K5=\"\",\"\",K5+(J5-I5))","v":245}]
[null,null,null,null,3,238,null,null,{"$f":"IF(J6=\"\",\"\",J5+1)","v":11},15,1,5]
[null,null,null,null,4,239,null,null,{"$f":"IF(J7=\"\",\"\",J6+1)","v":16},20,30,34]
[null,null,null,null,5,240,null,null,21,100,4,83]
[null,null,null,null,6,241,null,null,"",null,null,{"$f":"IF(K9=\"\",\"\",K9+(J9-I9))","v":""},"ملاحظات"]
[null,null,null,null,7,242,null,null,null,null,null,null,null,"إذا ظهر اللون البرتقالي فهذا يعني أنه يوجد أرقام مكررة"]
[null,null,null,null,8,243,null,null,null,null,null,null,null,"اللون الرمادي يعني ان الخلية فيها معادلات"]
[null,null,null,null,9,244,null,null,null,null,null,null,null,"عندما تفتح ورقة الاختبارات سيظهر لك الفورم"]
[null,null,null,null,10,245]
[null,null,null,null,11,1,null,"إذا رغبت في التعديل على أي شيء في الملف فلن نبخل عليكم فيما نعلمه  .... زكاة العلم نشره"]
[null,null,null,null,12,2]
[null,null,null,null,13,3]
[null,null,null,null,14,4]
[null,null,null,null,15,5]
[null,null,null,null,16,30]
[null,null,null,null,17,31]
[null,null,null,null,18,32]
[null,null,null,null,19,33]
[null,null,null,null,20,34]
[null,null,null,null,21,4]
[null,null,null,null,22,5]
[null,null,null,null,23,6]
[null,null,null,null,24,7]
[null,null,null,null,25,8]
[null,null,null,null,26,9]
[null,null,null,null,27,10]
[null,null,null,null,28,11]
[null,null,null,null,29,12]
[null,null,null,null,30,13]
[null,null,null,null,31,14]
[null,null,null,null,32,15]
[null,null,null,null,33,16]
[null,null,null,null,34,17]
[null,null,null,null,35,18]
[null,null,null,null,36,19]
[null,null,null,null,37,20]
[null,null,null,null,38,21]
[null,null,null,null,39,22]
[null,null,null,null,40,23]
[null,null,null,null,41,24]
[null,null,null,null,42,25]
[null,null,null,null,43,26]
[null,null,null,null,44,27]
[null,null,null,null,45,28]
[null,null,null,null,46,29]
[null,null,null,null,47,30]
[null,null,null,null,48,31]
[null,null,null,null,49,32]
[null,null,null,null,50,33]
[null,null,null,null,51,34]
[null,null,null,null,52,35]
[null,null,null,null,53,36]
[null,null,null,null,54,37]
[null,null,null,null,55,38]
[null,null,null,null,56,39]
[null,null,null,null,57,40]
[null,null,null,null,58,41]
[null,null,null,null,59,42]
[null,null,null,null,60,43]
[null,null,null,null,61,44]
[null,null,null,null,62,45]
[null,null,null,null,63,46]
[null,null,null,null,64,47]
[null,null,null,null,65,48]
[null,null,null,null,66,49]
[null,null,null,null,67,50]
[null,null,null,null,68,51]
[null,null,null,null,69,52]
[null,null,null,null,70,53]
[null,null,null,null,71,54]
[null,null,null,null,72,55]
[null,null,null,null,73,56]
[null,null,null,null,74,57]
[null,null,null,null,75,58]
[null,null,null,null,76,59]
[null,null,null,null,77,60]
[null,null,null,null,78,61]
[null,null,null,null,79,62]
[null,null,null,null,80,63]
[null,null,null,null,81,64]
[null,null,null,null,82,65]
[null,null,null,null,83,66]
[null,null,null,null,84,67]
[null,null,null,null,85,68]
[null,null,null,null,86,69]
[null,null,null,null,87,70]
[null,null,null,null,88,71]
[null,null,null,null,89,72]
[null,null,null,null,90,73]
[null,null,null,null,91,74]
[null,null,null,null,92,75]
[null,null,null,null,93,76]
[null,null,null,null,94,77]
[null,null,null,null,95,78]
[null,null,null,null,96,79]
[null,null,null,null,97,80]
[null,null,null,null,98,81]
[null,null,null,null,99,82]
[null,null,null,null,100,83]