{"text_format":"1","workbook":"xlsx","n_sheets":2,"sheets":["اسماء الكتاب النهائية ","استمارة متابعة"],"not_rendered":{"charts":0,"images":0,"macros":1,"external_links":0,"defined_names":2,"comments":0,"pivot_tables":0},"unopened":[],"bounds":{"document_bytes":16777216,"sheet_cells":100000,"rows_first":2000,"rows_last":500,"rows_between":2000,"halvings":0,"cell_chars":16384,"cell_head_chars":4096},"cells_cut":0,"cells_raw":0,"read":"whole","date_system":"1900"}

{"sheet":"اسماء الكتاب النهائية ","index":0,"n_rows":78,"n_cols":6,"rows_kept":78,"cut":false,"hidden":false,"merged":[]}
[null,"أسماء طلاب وطالبات مكتب تحفيظ القرآن الكريم بمسجد خلوصي "]
["م","الاسم","طالب/\nطالبة","طريقة الحفظ","أسم الحلقة/","مُحفّظ /\n مُحفّظة "]
[1,"محمد ربيع عبدالجواد ","طالب","عدد الأوجه","أبو بكر الصديق","الشيخ حسين "]
[2,"احمد سلامه عوض ","طالب","عدد الأوجه","أبو بكر الصديق","الشيخ حسين "]
[3,"محمد احمد ثابت ","طالب","عدد الأوجه","أبو بكر الصديق","الشيخ حسين "]
[4,"محمد فضل خميس","طالب","عدد الأوجه","أبو بكر الصديق","الشيخ حسين "]
[5,"يوسف خالد صلاح ","طالب","عدد الأوجه","أبو بكر الصديق","الشيخ حسين "]
[6,"عبدالرحمن احمد صلاح ","طالب","عدد الأوجه","أبو بكر الصديق","الشيخ حسين "]
[7,"على ثروت ","طالب","عدد الأوجه","أبو بكر الصديق","الشيخ حسين "]
[8,"عبدالرحمن رمضان احمد توفيق ","طالب","عدد الأوجه","أبو بكر الصديق","الشيخ حسين "]
[9,"محمود محمد جاد","طالب","عدد الأوجه","أبو بكر الصديق","الشيخ حسين "]
[10,"يوسف عبد الجيد","طالب","عدد الأوجه","أبو بكر الصديق","الشيخ حسين "]
[11,"عبد الله حسين احمد","طالب","عدد الأوجه","أبو بكر الصديق","الشيخ حسين "]
[12,"عمر خميس سيد","طالب","عدد الأوجه","الزبير بن العوام","الشيخ حسين "]
[13,"محمد اكرامي بخيت ","طالب","عدد الأوجه","الزبير بن العوام","الشيخ محمد عبد المنعم"]
[14,"يوسف ياسر علي","طالب","عدد الأوجه","الزبير بن العوام","الشيخ محمد عبد المنعم"]
[15,"يوسف جمعة عبد الرازق","طالب","عدد الأوجه","الزبير بن العوام","الشيخ محمد عبد المنعم"]
[16,"عبد الرحمن محمد عبد الرازق","طالب","عدد الأوجه","الزبير بن العوام","الشيخ محمد عبد المنعم"]
[17,"محمود حمودة قرني","طالب","عدد الأوجه","الزبير بن العوام","الشيخ محمد عبد المنعم"]
[18,"حسام علي عبد التواب","طالب","عدد الأوجه","الزبير بن العوام","الشيخ محمد عبد المنعم"]
[19,"اسامة كرم بخيت","طالب","عدد الأوجه","الزبير بن العوام","الشيخ محمد عبد المنعم"]
[20,"عبد الرحمن محمود عبد الجواد","طالب","عدد الأوجه","الزبير بن العوام","الشيخ محمد عبد المنعم"]
[21,"محمد هاني حمدي","طالب","عدد الأوجه","الزبير بن العوام","الشيخ محمد عبد المنعم"]
[22,"علي حسام محمد","طالب","عدد الأوجه","الزبير بن العوام","الشيخ محمد عبد المنعم"]
[23,"يوسف اسحاق محمد","طالب","عدد الأوجه","الزبير بن العوام","الشيخ محمد عبد المنعم"]
[24,"محمد خالد صلاح","طالب","عدد الأوجه","الزبير بن العوام","الشيخ محمد عبد المنعم"]
[25,"ادهم سلامة حمدي","طالب","عدد الأوجه","الزبير بن العوام","الشيخ محمد عبد المنعم"]
[26,"يوسف محروس رمضان","طالب","عدد الأوجه","الزبير بن العوام","الشيخ محمد عبد المنعم"]
[27,"يوسف ابراهيم محمد","طالب","عدد الأوجه","الزبير بن العوام","الشيخ محمد عبد المنعم"]
[28,"محمد جمال يونس","طالب","عدد الأوجه","الزبير بن العوام","الشيخ محمد عبد المنعم"]
[29,"محمد محسن محمد عبد الحميد","طالب","عدد الأوجه","الزبير بن العوام","الشيخ محمد عبد المنعم"]
[30,"سهيل وجية معوض","طالب","عدد الأوجه","الزبير بن العوام","الشيخ محمد عبد المنعم"]
[31,"طلحة وجية معوض","طالب","عدد الأوجه","الزبير بن العوام","الشيخ محمد عبد المنعم"]
[32,"عمار فرحات رمضان","طالب","عدد الأوجه","الزبير بن العوام","الشيخ محمد عبد المنعم"]
[33,"غلاب ربيع غلاب","طالب","عدد الأوجه","الزبير بن العوام","الشيخ محمد عبد المنعم"]
[34,"عبد الرحمن حدوت","طالب","عدد الأوجه","الزبير بن العوام","الشيخ محمد عبد المنعم"]
[35,"شهد شعبان","طالبة","عدد الأوجه","عائشة بنت أبي بكر ","ام عبد الله"]
[36,"سارة سعيد","طالبة","عدد الأوجه","عائشة بنت أبي بكر ","ام عبد الله"]
[37,"اسماء ربيع عبود","طالبة","عدد الأوجه","عائشة بنت أبي بكر ","ام عبد الله"]
[38,"اسماء ربيع عمار","طالبة","عدد الأوجه","عائشة بنت أبي بكر ","ام عبد الله"]
[39,"ياسمين محمد","طالبة","عدد الأوجه","عائشة بنت أبي بكر ","ام عبد الله"]
[40,"رانيا ربيع","طالبة","عدد الأوجه","عائشة بنت أبي بكر ","ام عبد الله"]
[41,"شهد ايمن","طالبة","عدد الأوجه","عائشة بنت أبي بكر ","ام عبد الله"]
[42,"ايمان محمود","طالبة","عدد الأوجه","عائشة بنت أبي بكر ","ام عبد الله"]
[43,"ياسمين شعبان","طالبة","عدد الأوجه","عائشة بنت أبي بكر ","ام عبد الله"]
[44,"ايمان عشري","طالبة","عدد الأوجه","عائشة بنت أبي بكر ","ام عبد الله"]
[45,"حنين خليل","طالبة","عدد الأوجه","عائشة بنت أبي بكر ","ام عبد الله"]
[46,"هدير شعبان","طالبة","عدد الأوجه","عائشة بنت أبي بكر ","ام عبد الله"]
[47,"اية هاني","طالبة","عدد الأوجه","عائشة بنت أبي بكر ","ام عبد الله"]
[48,"فاطمة أسامة عويس","طالبة","عدد الأوجه","عائشة بنت أبي بكر ","ام عبد الله"]
[49,"سما سلومة","طالبة","عدد الأوجه","عائشة بنت أبي بكر ","ام عبد الله"]
[50,"شهد مسعود","طالبة","عدد الأوجه","عائشة بنت أبي بكر ","ام عبد الله"]
[51,"فاطمة معوض احمد","طالبة","عدد الأوجه","عائشة بنت أبي بكر ","ام عبد الله"]
[52,"ندي بدوي سيد","طالبة","عدد الأوجه","عائشة بنت أبي بكر ","ام عبد الله"]
[53,"يارا محروس سيد","طالبة","عدد الأوجه","أبو عبيدة بن الجراح","ام نسيبه"]
[54,"مريم عيد عبد الله","طالبة","عدد الأوجه","أبو عبيدة بن الجراح","ام نسيبه"]
[55,"شهد علي يحي","طالبة","عدد الأوجه","أبو عبيدة بن الجراح","ام نسيبه"]
[56,"بسمله ماهر محمد","طالبة","عدد الأوجه","أبو عبيدة بن الجراح","ام نسيبه"]
[57,"زينب مسعد احمد","طالبة","عدد الأوجه","أبو عبيدة بن الجراح","ام نسيبه"]
[58,"فاطمة محمد خميس","طالبة","عدد الأوجه","أبو عبيدة بن الجراح","ام نسيبه"]
[59,"هاجر مسعد","طالبة","عدد الأوجه","أبو عبيدة بن الجراح","ام نسيبه"]
[60,"نسيبة ساهر","طالبة","عدد الأوجه","أبو عبيدة بن الجراح","ام نسيبه"]
[61,"سما ايهاب حسن","طالبة","عدد الأوجه","أبو عبيدة بن الجراح","ام نسيبه"]
[62,"بسملة سيد","طالبة","عدد الأوجه","أبو عبيدة بن الجراح","ام نسيبه"]
[63,"شيماء طارق ","طالبة","عدد الأوجه","أبو عبيدة بن الجراح","ام نسيبه"]
[64,"لبني محمد شحات","طالبة","عدد الأوجه","أبو عبيدة بن الجراح","ام نسيبه"]
[65,"منة محسن","طالبة","عدد الأوجه","أبو عبيدة بن الجراح","ام نسيبه"]
[66,"ولاء محسن عبد التواب عبد العاطي","طالبة","عدد الأوجه","أبو عبيدة بن الجراح","ام نسيبه"]
[67,"امنية هاني كامل","طالبة","عدد الأوجه","أبو عبيدة بن الجراح","ام نسيبه"]
[68,"نيجار فرحات","طالبة","عدد الأوجه","أبو عبيدة بن الجراح","ام نسيبه"]
[69,"فاطمة رجب محمد","طالبة","عدد الأوجه","أبو عبيدة بن الجراح","ام نسيبه"]
[70,"رغد رمضان احمد","طالبة","عدد الأوجه","أبو عبيدة بن الجراح","ام نسيبه"]
[71,"سما كرم شحات","طالبة","عدد الأوجه","أبو عبيدة بن الجراح","ام نسيبه"]
[72,"هاجر صبحي يس","طالبة","عدد الأوجه","أبو عبيدة بن الجراح","ام نسيبه"]
[73,"خلود ربيع رمضان","طالبة","عدد الأوجه","أبو عبيدة بن الجراح","ام نسيبه"]
[74,"مريم رجب محمد","طالبة","عدد الأوجه","أبو عبيدة بن الجراح","ام نسيبه"]
[75,"ملك شعبان عبد الله","طالبة","عدد الأوجه","أبو عبيدة بن الجراح","ام نسيبه"]
[76,"فاطمه علاء ربيع","طالبة","عدد الأوجه","أبو عبيدة بن الجراح","ام نسيبه"]

{"sheet":"استمارة متابعة","index":1,"n_rows":34,"n_cols":24,"rows_kept":34,"cut":false,"hidden":false,"merged":[[2,11,2,13],[33,3,33,4],[33,9,33,10],[30,9,30,10],[31,3,31,4],[31,9,31,10],[3,14,4,14],[3,7,4,7],[3,3,4,3],[3,8,4,8],[3,0,4,0],[3,13,4,13],[3,6,4,6],[3,11,4,11],[3,9,3,10],[3,4,3,5],[3,1,4,1],[3,2,4,2],[3,12,4,12]]}
[null,null,null,null,null,"مكتب تحفيظ القرآن الكريم بمسجد خلوصي "]
[null,"     إستمارة متابعة لشهر / ",null,"يناير",null,null,null,1,"عام / 2020",null,"أسم الحلقة/",{"$f":"VLOOKUP(H2,'اسماء الكتاب النهائية '!A:F,5,0)","v":"أبو بكر الصديق"},null,null,null,null,null,null,null,null,null,null,null,{"$f":"COUNTA('اسماء الكتاب النهائية '!A3:A1000)-1","v":75}]
[null,"    اسم الطالب / ",{"$f":"VLOOKUP(H2,'اسماء الكتاب النهائية '!A:F,2,0)","v":"محمد ربيع عبدالجواد "},null,null,null,null,null,null,"المُحفّظ / المُحفّظة / ",null,{"$f":"VLOOKUP(H2,'اسماء الكتاب النهائية '!A:F,6,0)","v":"الشيخ حسين "}]
["م","الأيـــام","التاريخ","السورة","مراجعة",null,"عدد اوجه المراجعة","المستوى","السورة","حـفـظ",null,"عدد اوجه الحفظ","المستوى","حضور","ملاحظات"]
[null,null,null,null,"من الآية","إلى الآية",null,null,null,"من الآية","إلى الآية"]
[1,"السبت","2020-01-04"]
[2,"الأحد","2020-01-05"]
[3,"الاثنين","2020-01-06",null,null,null,null,null," "]
[4,"الثلاثاء","2020-01-07"]
[5,"الأربعاء","2020-01-08"]
[1,"السبت","2020-01-11"]
[2,"الأحد","2020-01-12"]
[3,"الاثنين","2020-01-13"]
[4,"الثلاثاء","2020-01-14"]
[5,"الأربعاء","2020-01-15"]
[1,"السبت","2020-01-18"]
[2,"الأحد","2020-01-18"]
[3,"الاثنين","2020-01-19"]
[4,"الثلاثاء","2020-01-20"]
[5,"الأربعاء","2020-01-21"]
[1,"السبت","2020-01-25"]
[2,"الأحد","2020-01-26"]
[3,"الاثنين","2020-01-27"]
[4,"الثلاثاء","2020-01-28"]
[5,"الأربعاء","2020-01-29"]
[1,"السبت","2020-01-31"]
[2,"الأحد"]
[3,"الاثنين"]
[4,"الثلاثاء"]
[5,"الأربعاء"]
[null,"المستوي /","ممتاز = 100 %\n",null,"جيد جداً = 90 %\n","جيد = 80 % \n",null,"مقبول = 70 %\n",null,"غير مرضي = 60%\n",null,null,null,"حضور= 1\nغياب = غ","يعتمد /"]
[null,"عدد أوجه المراجعة",{"$f":"SUM(G6:G30)","v":0},"متوسط مستوي المراجعة ",null,{"$f":"AVERAGE(H6:H25)","v":{"$error":"#DIV/0!"}},null,null,null,"متوسط مستوي الحفظ ",null,null,{"$f":"AVERAGE(M6:M25)","v":{"$error":"#DIV/0!"}}]
[]
[null,"عدد أوجه الحفظ",{"$f":"SUM(L6:L30)","v":0}," عدد أيام الحضور",null,{"$f":"COUNT(N6:N25)","v":0},null,null,null," عدد أيام الغياب",null,null,{"$f":"COUNT(#REF!)","v":0}]