{"text_format":"1","workbook":"xlsx","n_sheets":4,"sheets":["LIVRAISON","LIVRAISONS","SOLDE","BDD"],"not_rendered":{"charts":0,"images":5,"macros":1,"external_links":0,"defined_names":27,"comments":0,"pivot_tables":0},"unopened":[],"bounds":{"document_bytes":16777216,"sheet_cells":100000,"rows_first":2000,"rows_last":500,"rows_between":2000,"halvings":0,"cell_chars":16384,"cell_head_chars":4096},"cells_cut":0,"cells_raw":0,"read":"whole","date_system":"1900"}

{"sheet":"LIVRAISON","index":0,"n_rows":44,"n_cols":33,"rows_kept":44,"cut":false,"hidden":false,"merged":[[4,1,4,4],[4,6,4,7],[34,13,40,15],[29,6,29,9],[28,5,28,8],[25,5,25,8],[27,5,27,8],[26,5,26,8],[17,5,17,6],[18,5,18,6],[19,5,19,6]]}
[{"$f":"I4","v":15},null,null,null,null,{"$f":"COUNTA(T_LIVRAISON_Livraison[[  Référence]])","v":0},{"$f":"IF(X1>0,\"Attention\",\"\")","v":""},{"$f":"IF(I2=\"N° Bon Livr\",1,\"\")","v":1},{"$f":"IF(G4=LIVRAISONS_N°BON,\"ATTENTION\",\"\")","v":""},null,"STOCK","HAY SINAII","D HAMM","G ALLAL","VIDE2","VIDE3","STOCK",{"$f":"IF(C4=\"\",\"CLIENT\",C4)","v":"CLIENT"},null,null,null,1,{"$f":"IF(V1=1,\"Paye\",IF(V1=2,\"Non Paye\",IF(V1=3,\"Avance\")))","v":"Paye"},{"$f":"SUMIFS(LIVRAISONS_MONTANT,LIVRAISONS_N°BON,LIVRAISON!H4,LIVRAISONS_CLIENTS,LIVRAISON!C4)","v":0},null,null,null,null,null,null,null,null,"N° Bon Livr"]
[null,null,"Nom Client",null,{"$f":"$R$2","v":0},"Date",null,"N° Bon Cmd","N° Bon Livr",{"$f":"IFERROR(LOOKUP(\"ZZZZ\",T_LIVRAISON_Livraison[[  Référence]]),\"\")","v":""},{"$f":"IFERROR(INDEX(#REF!,MATCH($J2,#REF!,0),8),\"\")","v":""},{"$f":"IFERROR(INDEX(#REF!,MATCH($J2,#REF!,0),3),\"\")","v":""},{"$f":"IFERROR(INDEX(#REF!,MATCH($J2,#REF!,0),4),\"\")","v":""},{"$f":"IFERROR(INDEX(#REF!,MATCH($J2,#REF!,0),5),\"\")","v":""},{"$f":"IFERROR(INDEX(#REF!,MATCH($J2,#REF!,0),6),\"\")","v":""},{"$f":"IFERROR(INDEX(#REF!,MATCH($J2,#REF!,0),7),\"\")","v":""},null,{"$f":"IFERROR(INDEX(T_SOLDE_Solde[Solde],MATCH(C4,T_SOLDE_Solde[Nom  Clients],0),FALSE),\"\")","v":0},null,null,null,null,null,null,null,null,null,null,null,null,null,null,"N° Bon Avoir"]
[]
[7,null,null,null,{"$f":"(I23+E2)-SUM(T_LIVRAISON_Encaissement[[Montant]:[Remise]])","v":0},null,null,null,15,null,"/2020",{"$f":"I4&K4","v":"15/2020"},{"$f":"I4&K5","v":"15/Avoir"},{"$f":"IF(I2=\"N° Bon Avoir\",\"1\",\"1\")","v":"1"}]
[null,{"$f":"IFERROR(VLOOKUP(C4,T_BDD_Clients[],3,FALSE),\"\")","v":""},null,null,null,"Tel",{"$f":"IFERROR(VLOOKUP(C4,T_BDD_Clients[],4,FALSE),\"\")","v":""},null,null,null,"/Avoir",null,null,null,"        ENCAISSEMENTS"]
[null,"N°","  Référence","  D","Désignation","Unite","Prix","Carton","Montant","1","2","Mode","Bnq","N° Cheq","tireur","Echéance","Montant","Remise"]
["HAY SINAII",{"$f":"IF(T_LIVRAISON_Livraison[[#This Row],[  Référence]]=\"\",\"\",ROW()-6)","v":""},null,null,{"$f":"IFERROR(INDEX(T_BDD_Références[DESIGNATION],MATCH(T_LIVRAISON_Livraison[[#This Row],[  Référence]],T_BDD_Références[REFERENCE],0),FALSE),\"\")","v":""},{"$f":"IFERROR(INDEX(T_BDD_Références[[UNITE ]],MATCH(T_LIVRAISON_Livraison[[#This Row],[  Référence]],T_BDD_Références[REFERENCE],0),FALSE),\"\")","v":""},{"$f":"IFERROR(INDEX(T_BDD_Références[PRIX],MATCH(T_LIVRAISON_Livraison[[#This Row],[  Référence]],T_BDD_Références[REFERENCE],0),FALSE),\"\")","v":""},null,{"$f":"IFERROR(T_LIVRAISON_Livraison[[#This Row],[Unite]]*T_LIVRAISON_Livraison[[#This Row],[Prix]]*T_LIVRAISON_Livraison[[#This Row],[Carton]]*N$4,\"\")","v":""},{"$f":"IF(I$7:I$15=0,\"\",IF(I$7:I$15<1,M$4,L$4))","v":"15/2020"},{"$f":"IF(I$2=\"N° Bon Avoir\",\"\",IF(T_LIVRAISON_Encaissement[[#This Row],[Montant]]=0,\"Non Paye\",\"Paye\"))","v":"Non Paye"}]
[null,{"$f":"IF(T_LIVRAISON_Livraison[[#This Row],[  Référence]]=\"\",\"\",ROW()-6)","v":""},null,null,{"$f":"IFERROR(INDEX(T_BDD_Références[DESIGNATION],MATCH(T_LIVRAISON_Livraison[[#This Row],[  Référence]],T_BDD_Références[REFERENCE],0),FALSE),\"\")","v":""},{"$f":"IFERROR(INDEX(T_BDD_Références[[UNITE ]],MATCH(T_LIVRAISON_Livraison[[#This Row],[  Référence]],T_BDD_Références[REFERENCE],0),FALSE),\"\")","v":""},{"$f":"IFERROR(INDEX(T_BDD_Références[PRIX],MATCH(T_LIVRAISON_Livraison[[#This Row],[  Référence]],T_BDD_Références[REFERENCE],0),FALSE),\"\")","v":""},null,{"$f":"IFERROR(T_LIVRAISON_Livraison[[#This Row],[Unite]]*T_LIVRAISON_Livraison[[#This Row],[Prix]]*T_LIVRAISON_Livraison[[#This Row],[Carton]]*N$4,\"\")","v":""},"15/2020"]
[null,{"$f":"IF(T_LIVRAISON_Livraison[[#This Row],[  Référence]]=\"\",\"\",ROW()-6)","v":""},null,null,{"$f":"IFERROR(INDEX(T_BDD_Références[DESIGNATION],MATCH(T_LIVRAISON_Livraison[[#This Row],[  Référence]],T_BDD_Références[REFERENCE],0),FALSE),\"\")","v":""},{"$f":"IFERROR(INDEX(T_BDD_Références[[UNITE ]],MATCH(T_LIVRAISON_Livraison[[#This Row],[  Référence]],T_BDD_Références[REFERENCE],0),FALSE),\"\")","v":""},{"$f":"IFERROR(INDEX(T_BDD_Références[PRIX],MATCH(T_LIVRAISON_Livraison[[#This Row],[  Référence]],T_BDD_Références[REFERENCE],0),FALSE),\"\")","v":""},null,{"$f":"IFERROR(T_LIVRAISON_Livraison[[#This Row],[Unite]]*T_LIVRAISON_Livraison[[#This Row],[Prix]]*T_LIVRAISON_Livraison[[#This Row],[Carton]]*N$4,\"\")","v":""},"15/2020"]
[null,{"$f":"IF(T_LIVRAISON_Livraison[[#This Row],[  Référence]]=\"\",\"\",ROW()-6)","v":""},null,null,{"$f":"IFERROR(INDEX(T_BDD_Références[DESIGNATION],MATCH(T_LIVRAISON_Livraison[[#This Row],[  Référence]],T_BDD_Références[REFERENCE],0),FALSE),\"\")","v":""},{"$f":"IFERROR(INDEX(T_BDD_Références[[UNITE ]],MATCH(T_LIVRAISON_Livraison[[#This Row],[  Référence]],T_BDD_Références[REFERENCE],0),FALSE),\"\")","v":""},{"$f":"IFERROR(INDEX(T_BDD_Références[PRIX],MATCH(T_LIVRAISON_Livraison[[#This Row],[  Référence]],T_BDD_Références[REFERENCE],0),FALSE),\"\")","v":""},null,{"$f":"IFERROR(T_LIVRAISON_Livraison[[#This Row],[Unite]]*T_LIVRAISON_Livraison[[#This Row],[Prix]]*T_LIVRAISON_Livraison[[#This Row],[Carton]]*N$4,\"\")","v":""},"15/2020"]
[null,{"$f":"IF(T_LIVRAISON_Livraison[[#This Row],[  Référence]]=\"\",\"\",ROW()-6)","v":""},null,null,{"$f":"IFERROR(INDEX(T_BDD_Références[DESIGNATION],MATCH(T_LIVRAISON_Livraison[[#This Row],[  Référence]],T_BDD_Références[REFERENCE],0),FALSE),\"\")","v":""},{"$f":"IFERROR(INDEX(T_BDD_Références[[UNITE ]],MATCH(T_LIVRAISON_Livraison[[#This Row],[  Référence]],T_BDD_Références[REFERENCE],0),FALSE),\"\")","v":""},{"$f":"IFERROR(INDEX(T_BDD_Références[PRIX],MATCH(T_LIVRAISON_Livraison[[#This Row],[  Référence]],T_BDD_Références[REFERENCE],0),FALSE),\"\")","v":""},null,{"$f":"IFERROR(T_LIVRAISON_Livraison[[#This Row],[Unite]]*T_LIVRAISON_Livraison[[#This Row],[Prix]]*T_LIVRAISON_Livraison[[#This Row],[Carton]]*N$4,\"\")","v":""},"15/2020"]
[null,{"$f":"IF(T_LIVRAISON_Livraison[[#This Row],[  Référence]]=\"\",\"\",ROW()-6)","v":""},null,null,{"$f":"IFERROR(INDEX(T_BDD_Références[DESIGNATION],MATCH(T_LIVRAISON_Livraison[[#This Row],[  Référence]],T_BDD_Références[REFERENCE],0),FALSE),\"\")","v":""},{"$f":"IFERROR(INDEX(T_BDD_Références[[UNITE ]],MATCH(T_LIVRAISON_Livraison[[#This Row],[  Référence]],T_BDD_Références[REFERENCE],0),FALSE),\"\")","v":""},{"$f":"IFERROR(INDEX(T_BDD_Références[PRIX],MATCH(T_LIVRAISON_Livraison[[#This Row],[  Référence]],T_BDD_Références[REFERENCE],0),FALSE),\"\")","v":""},null,{"$f":"IFERROR(T_LIVRAISON_Livraison[[#This Row],[Unite]]*T_LIVRAISON_Livraison[[#This Row],[Prix]]*T_LIVRAISON_Livraison[[#This Row],[Carton]]*N$4,\"\")","v":""},"15/2020"]
[null,{"$f":"IF(T_LIVRAISON_Livraison[[#This Row],[  Référence]]=\"\",\"\",ROW()-6)","v":""},null,null,{"$f":"IFERROR(INDEX(T_BDD_Références[DESIGNATION],MATCH(T_LIVRAISON_Livraison[[#This Row],[  Référence]],T_BDD_Références[REFERENCE],0),FALSE),\"\")","v":""},{"$f":"IFERROR(INDEX(T_BDD_Références[[UNITE ]],MATCH(T_LIVRAISON_Livraison[[#This Row],[  Référence]],T_BDD_Références[REFERENCE],0),FALSE),\"\")","v":""},{"$f":"IFERROR(INDEX(T_BDD_Références[PRIX],MATCH(T_LIVRAISON_Livraison[[#This Row],[  Référence]],T_BDD_Références[REFERENCE],0),FALSE),\"\")","v":""},null,{"$f":"IFERROR(T_LIVRAISON_Livraison[[#This Row],[Unite]]*T_LIVRAISON_Livraison[[#This Row],[Prix]]*T_LIVRAISON_Livraison[[#This Row],[Carton]]*N$4,\"\")","v":""},"15/2020"]
[null,{"$f":"IF(T_LIVRAISON_Livraison[[#This Row],[  Référence]]=\"\",\"\",ROW()-6)","v":""},null,null,{"$f":"IFERROR(INDEX(T_BDD_Références[DESIGNATION],MATCH(T_LIVRAISON_Livraison[[#This Row],[  Référence]],T_BDD_Références[REFERENCE],0),FALSE),\"\")","v":""},{"$f":"IFERROR(INDEX(T_BDD_Références[[UNITE ]],MATCH(T_LIVRAISON_Livraison[[#This Row],[  Référence]],T_BDD_Références[REFERENCE],0),FALSE),\"\")","v":""},{"$f":"IFERROR(INDEX(T_BDD_Références[PRIX],MATCH(T_LIVRAISON_Livraison[[#This Row],[  Référence]],T_BDD_Références[REFERENCE],0),FALSE),\"\")","v":""},null,{"$f":"IFERROR(T_LIVRAISON_Livraison[[#This Row],[Unite]]*T_LIVRAISON_Livraison[[#This Row],[Prix]]*T_LIVRAISON_Livraison[[#This Row],[Carton]]*N$4,\"\")","v":""},"15/2020"]
[null,{"$f":"IF(T_LIVRAISON_Livraison[[#This Row],[  Référence]]=\"\",\"\",ROW()-6)","v":""},null,null,{"$f":"IFERROR(INDEX(T_BDD_Références[DESIGNATION],MATCH(T_LIVRAISON_Livraison[[#This Row],[  Référence]],T_BDD_Références[REFERENCE],0),FALSE),\"\")","v":""},{"$f":"IFERROR(INDEX(T_BDD_Références[[UNITE ]],MATCH(T_LIVRAISON_Livraison[[#This Row],[  Référence]],T_BDD_Références[REFERENCE],0),FALSE),\"\")","v":""},{"$f":"IFERROR(INDEX(T_BDD_Références[PRIX],MATCH(T_LIVRAISON_Livraison[[#This Row],[  Référence]],T_BDD_Références[REFERENCE],0),FALSE),\"\")","v":""},null,{"$f":"IFERROR(T_LIVRAISON_Livraison[[#This Row],[Unite]]*T_LIVRAISON_Livraison[[#This Row],[Prix]]*T_LIVRAISON_Livraison[[#This Row],[Carton]]*N$4,\"\")","v":""},"15/2020"]
{"$rows_left_out":30}
{"sheet":"LIVRAISONS","index":1,"n_rows":21,"n_cols":23,"rows_kept":21,"cut":false,"hidden":false,"merged":[]}
["Nom de clients","Date bon","N° Bon Comd","Référence","Désignation","Unit","Prix","Dépôt","Quantité","Montant","Bon Livr","Paye/Non","Mode","Bnq","N° Cheq","tireur","Echéance","Encaisst","Remise","MONTANT GLB","DAT/ENCAIS","COMMANTAIRE","Colonne1"]
[null,null,null,null,null,null,null,null,null,null,null,null,null,null,null,null,null,null,null,null,null,null,{"$f":"IF(AND(T_LIVRAISONS_Livraisons[[#This Row],[Bon Livr]]=#REF!,T_LIVRAISONS_Livraisons[[#This Row],[Nom de clients]]=#REF!),ROW(),\"\")","v":{"$error":"#REF!"}}]
["ABDELMALEK FES","2015-01-01","05/09COM","J 12094","VOITURE PM",720,2,"G ALLAL",2,2880,"001/2015","Paye","VIRMENT","CDM",null,null,null,12679,173,null,"2015-02-19",null,{"$f":"IF(AND(T_LIVRAISONS_Livraisons[[#This Row],[Bon Livr]]=#REF!,T_LIVRAISONS_Livraisons[[#This Row],[Nom de clients]]=#REF!),ROW(),\"\")","v":{"$error":"#REF!"}}]
["ABDELMALEK FES","2015-01-01","05/09COM","J 20353","VOITURE PM",720,2,"G ALLAL",2,2880,"001/2015",null,null,null,null,null,null,null,null,null,null,null,{"$f":"IF(AND(T_LIVRAISONS_Livraisons[[#This Row],[Bon Livr]]=#REF!,T_LIVRAISONS_Livraisons[[#This Row],[Nom de clients]]=#REF!),ROW(),\"\")","v":{"$error":"#REF!"}}]
["ABDELMALEK FES","2015-01-01","05/09COM","J 54562","VOITURE PM",960,2,"G ALLAL",2,3840,"001/2015",null,null,null,null,null,null,null,null,null,null,null,{"$f":"IF(AND(T_LIVRAISONS_Livraisons[[#This Row],[Bon Livr]]=#REF!,T_LIVRAISONS_Livraisons[[#This Row],[Nom de clients]]=#REF!),ROW(),\"\")","v":{"$error":"#REF!"}}]
["ABDELMALEK FES","2015-01-01","05/09COM","BT 115584","YOUYOU PLASTIQUE PM",480,1.25,"G ALLAL",1,600,"001/2015",null,null,null,null,null,null,null,null,null,null,null,{"$f":"IF(AND(T_LIVRAISONS_Livraisons[[#This Row],[Bon Livr]]=#REF!,T_LIVRAISONS_Livraisons[[#This Row],[Nom de clients]]=#REF!),ROW(),\"\")","v":{"$error":"#REF!"}}]
["ABDELMALEK FES","2015-01-01","05/09COM","B 8907","MOTO BEN 10 ",168,5.5,"HAY SINAII",1,924,"001/2015",null,null,null,null,null,null,null,null,null,null,null,{"$f":"IF(AND(T_LIVRAISONS_Livraisons[[#This Row],[Bon Livr]]=#REF!,T_LIVRAISONS_Livraisons[[#This Row],[Nom de clients]]=#REF!),ROW(),\"\")","v":{"$error":"#REF!"}}]
["ABDELMALEK FES","2015-01-01","05/09COM","J 2196","TELEJEUX EAU NOIRE",768,2.25,"G ALLAL",1,1728,"001/2015",null,null,null,null,null,null,null,null,null,null,null,{"$f":"IF(AND(T_LIVRAISONS_Livraisons[[#This Row],[Bon Livr]]=#REF!,T_LIVRAISONS_Livraisons[[#This Row],[Nom de clients]]=#REF!),ROW(),\"\")","v":{"$error":"#REF!"}}]
["ABDELHADI FES","2020-01-03",null,"VO","VOITURE",36,87,"MAGASIN",5,15660,null,"Non Paye",null,null,null,null,null,null,null,null,null,null,{"$f":"IF(AND(T_LIVRAISONS_Livraisons[[#This Row],[Bon Livr]]=#REF!,T_LIVRAISONS_Livraisons[[#This Row],[Nom de clients]]=#REF!),ROW(),\"\")","v":{"$error":"#REF!"}}]
["ABDELKRIM KISSARIYA",null,null,"VO","VOITURE",36,87,"VIDE 1",3,9396,3.9603960396039604E-3,"Non Paye",null,null,null,null,null,null,null,null,null,null,{"$f":"IF(AND(T_LIVRAISONS_Livraisons[[#This Row],[Bon Livr]]=#REF!,T_LIVRAISONS_Livraisons[[#This Row],[Nom de clients]]=#REF!),ROW(),\"\")","v":{"$error":"#REF!"}}]
["ABDELHADI FES",null,null,"VO","VOITURE",36,87,"VIDE 1",3,9396,4.4554455445544551E-3,"Paye","ESPECES",null,null,null,null,24586,null,null,null,null,{"$f":"IF(AND(T_LIVRAISONS_Livraisons[[#This Row],[Bon Livr]]=#REF!,T_LIVRAISONS_Livraisons[[#This Row],[Nom de clients]]=#REF!),ROW(),\"\")","v":{"$error":"#REF!"}}]
["ABDOU",null,null,"VO","VOITURE",36,87,"MAGASIN",12,37584,4.9504950495049506E-3,"Paye","ESPECES",null,null,null,null,33825.599999999999,null,null,null,null,{"$f":"IF(AND(T_LIVRAISONS_Livraisons[[#This Row],[Bon Livr]]=#REF!,T_LIVRAISONS_Livraisons[[#This Row],[Nom de clients]]=#REF!),ROW(),\"\")","v":{"$error":"#REF!"}}]
["ABDOU",null,null,"PS","PISTOLET SIMPLE",60,68,"MAGASIN",5,20400,5.4455445544554452E-3,"Paye","ESPECES",null,null,null,null,22118.400000000001,null,null,null,null,{"$f":"IF(AND(T_LIVRAISONS_Livraisons[[#This Row],[Bon Livr]]=#REF!,T_LIVRAISONS_Livraisons[[#This Row],[Nom de clients]]=#REF!),ROW(),\"\")","v":{"$error":"#REF!"}}]
["ABDOU","2020-01-03",null,"PS","PISTOLET SIMPLE",60,68,"VIDE 1",2,8160,5.9405940594059407E-3,"Paye","ESPECES",null,null,null,null,9384,null,null,null,null,{"$f":"IF(AND(T_LIVRAISONS_Livraisons[[#This Row],[Bon Livr]]=#REF!,T_LIVRAISONS_Livraisons[[#This Row],[Nom de clients]]=#REF!),ROW(),\"\")","v":{"$error":"#REF!"}}]
["ABDELHADI FES","2020-01-03",null,"PS","PISTOLET SIMPLE",60,68,"STOCKS",4,16320,6.4356435643564353E-3,"Non Paye",null,null,null,null,null,null,null,null,null,null,{"$f":"IF(AND(T_LIVRAISONS_Livraisons[[#This Row],[Bon Livr]]=#REF!,T_LIVRAISONS_Livraisons[[#This Row],[Nom de clients]]=#REF!),ROW(),\"\")","v":{"$error":"#REF!"}}]
{"$rows_left_out":7}
{"sheet":"SOLDE","index":2,"n_rows":60,"n_cols":6,"rows_kept":60,"cut":false,"hidden":false,"merged":[]}
[]
[null,null,null,"SOLDE FINAL"]
[null,"Nom  Clients","Solde","Total Bons ","Total Versement","Remise"]
[null,{"$f":"IFERROR(T_BDD_Clients[[#This Row],[Clients]],\"\")","v":"ABDELGHNI Marrakech"},{"$f":"IFERROR(T_SOLDE_Solde[[#This Row],[Total Bons ]]-(T_SOLDE_Solde[[#This Row],[Total Versement]]+T_SOLDE_Solde[[#This Row],[Remise]]),\"\")","v":0},{"$f":"SUMIF(T_LIVRAISONS_Livraisons[Nom de clients],T_SOLDE_Solde[[#This Row],[Nom  Clients]],T_LIVRAISONS_Livraisons[Montant])","v":0},{"$f":"SUMIF(T_LIVRAISONS_Livraisons[Nom de clients],T_SOLDE_Solde[[#This Row],[Nom  Clients]],T_LIVRAISONS_Livraisons[Encaisst])","v":0},{"$f":"SUMIF(T_LIVRAISONS_Livraisons[Nom de clients],T_SOLDE_Solde[[#This Row],[Nom  Clients]],T_LIVRAISONS_Livraisons[Remise])","v":0}]
[null,{"$f":"IFERROR(T_BDD_Clients[[#This Row],[Clients]],\"\")","v":"ABDELHADI FES"},{"$f":"IFERROR(T_SOLDE_Solde[[#This Row],[Total Bons ]]-(T_SOLDE_Solde[[#This Row],[Total Versement]]+T_SOLDE_Solde[[#This Row],[Remise]]),\"\")","v":16790},{"$f":"SUMIF(T_LIVRAISONS_Livraisons[Nom de clients],T_SOLDE_Solde[[#This Row],[Nom  Clients]],T_LIVRAISONS_Livraisons[Montant])","v":41376},{"$f":"SUMIF(T_LIVRAISONS_Livraisons[Nom de clients],T_SOLDE_Solde[[#This Row],[Nom  Clients]],T_LIVRAISONS_Livraisons[Encaisst])","v":24586},{"$f":"SUMIF(T_LIVRAISONS_Livraisons[Nom de clients],T_SOLDE_Solde[[#This Row],[Nom  Clients]],T_LIVRAISONS_Livraisons[Remise])","v":0}]
[null,{"$f":"IFERROR(T_BDD_Clients[[#This Row],[Clients]],\"\")","v":"ABDELKRIM KISSARIYA"},{"$f":"IFERROR(T_SOLDE_Solde[[#This Row],[Total Bons ]]-(T_SOLDE_Solde[[#This Row],[Total Versement]]+T_SOLDE_Solde[[#This Row],[Remise]]),\"\")","v":9396},{"$f":"SUMIF(T_LIVRAISONS_Livraisons[Nom de clients],T_SOLDE_Solde[[#This Row],[Nom  Clients]],T_LIVRAISONS_Livraisons[Montant])","v":9396},{"$f":"SUMIF(T_LIVRAISONS_Livraisons[Nom de clients],T_SOLDE_Solde[[#This Row],[Nom  Clients]],T_LIVRAISONS_Livraisons[Encaisst])","v":0},{"$f":"SUMIF(T_LIVRAISONS_Livraisons[Nom de clients],T_SOLDE_Solde[[#This Row],[Nom  Clients]],T_LIVRAISONS_Livraisons[Remise])","v":0}]
[null,{"$f":"IFERROR(T_BDD_Clients[[#This Row],[Clients]],\"\")","v":"ABDELMALEK FES"},{"$f":"IFERROR(T_SOLDE_Solde[[#This Row],[Total Bons ]]-(T_SOLDE_Solde[[#This Row],[Total Versement]]+T_SOLDE_Solde[[#This Row],[Remise]]),\"\")","v":0},{"$f":"SUMIF(T_LIVRAISONS_Livraisons[Nom de clients],T_SOLDE_Solde[[#This Row],[Nom  Clients]],T_LIVRAISONS_Livraisons[Montant])","v":12852},{"$f":"SUMIF(T_LIVRAISONS_Livraisons[Nom de clients],T_SOLDE_Solde[[#This Row],[Nom  Clients]],T_LIVRAISONS_Livraisons[Encaisst])","v":12679},{"$f":"SUMIF(T_LIVRAISONS_Livraisons[Nom de clients],T_SOLDE_Solde[[#This Row],[Nom  Clients]],T_LIVRAISONS_Livraisons[Remise])","v":173}]
[null,{"$f":"IFERROR(T_BDD_Clients[[#This Row],[Clients]],\"\")","v":"ABDOU"},{"$f":"IFERROR(T_SOLDE_Solde[[#This Row],[Total Bons ]]-(T_SOLDE_Solde[[#This Row],[Total Versement]]+T_SOLDE_Solde[[#This Row],[Remise]]),\"\")","v":816},{"$f":"SUMIF(T_LIVRAISONS_Livraisons[Nom de clients],T_SOLDE_Solde[[#This Row],[Nom  Clients]],T_LIVRAISONS_Livraisons[Montant])","v":66144},{"$f":"SUMIF(T_LIVRAISONS_Livraisons[Nom de clients],T_SOLDE_Solde[[#This Row],[Nom  Clients]],T_LIVRAISONS_Livraisons[Encaisst])","v":65328},{"$f":"SUMIF(T_LIVRAISONS_Livraisons[Nom de clients],T_SOLDE_Solde[[#This Row],[Nom  Clients]],T_LIVRAISONS_Livraisons[Remise])","v":0}]
[null,{"$f":"IFERROR(T_BDD_Clients[[#This Row],[Clients]],\"\")","v":0},{"$f":"IFERROR(T_SOLDE_Solde[[#This Row],[Total Bons ]]-(T_SOLDE_Solde[[#This Row],[Total Versement]]+T_SOLDE_Solde[[#This Row],[Remise]]),\"\")","v":0},{"$f":"SUMIF(T_LIVRAISONS_Livraisons[Nom de clients],T_SOLDE_Solde[[#This Row],[Nom  Clients]],T_LIVRAISONS_Livraisons[Montant])","v":0},{"$f":"SUMIF(T_LIVRAISONS_Livraisons[Nom de clients],T_SOLDE_Solde[[#This Row],[Nom  Clients]],T_LIVRAISONS_Livraisons[Encaisst])","v":0},{"$f":"SUMIF(T_LIVRAISONS_Livraisons[Nom de clients],T_SOLDE_Solde[[#This Row],[Nom  Clients]],T_LIVRAISONS_Livraisons[Remise])","v":0}]
[null,{"$f":"IFERROR(T_BDD_Clients[[#This Row],[Clients]],\"\")","v":0},{"$f":"IFERROR(T_SOLDE_Solde[[#This Row],[Total Bons ]]-(T_SOLDE_Solde[[#This Row],[Total Versement]]+T_SOLDE_Solde[[#This Row],[Remise]]),\"\")","v":0},{"$f":"SUMIF(T_LIVRAISONS_Livraisons[Nom de clients],T_SOLDE_Solde[[#This Row],[Nom  Clients]],T_LIVRAISONS_Livraisons[Montant])","v":0},{"$f":"SUMIF(T_LIVRAISONS_Livraisons[Nom de clients],T_SOLDE_Solde[[#This Row],[Nom  Clients]],T_LIVRAISONS_Livraisons[Encaisst])","v":0},{"$f":"SUMIF(T_LIVRAISONS_Livraisons[Nom de clients],T_SOLDE_Solde[[#This Row],[Nom  Clients]],T_LIVRAISONS_Livraisons[Remise])","v":0}]
[null,{"$f":"IFERROR(T_BDD_Clients[[#This Row],[Clients]],\"\")","v":0},{"$f":"IFERROR(T_SOLDE_Solde[[#This Row],[Total Bons ]]-(T_SOLDE_Solde[[#This Row],[Total Versement]]+T_SOLDE_Solde[[#This Row],[Remise]]),\"\")","v":0},{"$f":"SUMIF(T_LIVRAISONS_Livraisons[Nom de clients],T_SOLDE_Solde[[#This Row],[Nom  Clients]],T_LIVRAISONS_Livraisons[Montant])","v":0},{"$f":"SUMIF(T_LIVRAISONS_Livraisons[Nom de clients],T_SOLDE_Solde[[#This Row],[Nom  Clients]],T_LIVRAISONS_Livraisons[Encaisst])","v":0},{"$f":"SUMIF(T_LIVRAISONS_Livraisons[Nom de clients],T_SOLDE_Solde[[#This Row],[Nom  Clients]],T_LIVRAISONS_Livraisons[Remise])","v":0}]
[null,{"$f":"IFERROR(T_BDD_Clients[[#This Row],[Clients]],\"\")","v":0},{"$f":"IFERROR(T_SOLDE_Solde[[#This Row],[Total Bons ]]-(T_SOLDE_Solde[[#This Row],[Total Versement]]+T_SOLDE_Solde[[#This Row],[Remise]]),\"\")","v":0},{"$f":"SUMIF(T_LIVRAISONS_Livraisons[Nom de clients],T_SOLDE_Solde[[#This Row],[Nom  Clients]],T_LIVRAISONS_Livraisons[Montant])","v":0},{"$f":"SUMIF(T_LIVRAISONS_Livraisons[Nom de clients],T_SOLDE_Solde[[#This Row],[Nom  Clients]],T_LIVRAISONS_Livraisons[Encaisst])","v":0},{"$f":"SUMIF(T_LIVRAISONS_Livraisons[Nom de clients],T_SOLDE_Solde[[#This Row],[Nom  Clients]],T_LIVRAISONS_Livraisons[Remise])","v":0}]
[null,{"$f":"IFERROR(T_BDD_Clients[[#This Row],[Clients]],\"\")","v":0},{"$f":"IFERROR(T_SOLDE_Solde[[#This Row],[Total Bons ]]-(T_SOLDE_Solde[[#This Row],[Total Versement]]+T_SOLDE_Solde[[#This Row],[Remise]]),\"\")","v":0},{"$f":"SUMIF(T_LIVRAISONS_Livraisons[Nom de clients],T_SOLDE_Solde[[#This Row],[Nom  Clients]],T_LIVRAISONS_Livraisons[Montant])","v":0},{"$f":"SUMIF(T_LIVRAISONS_Livraisons[Nom de clients],T_SOLDE_Solde[[#This Row],[Nom  Clients]],T_LIVRAISONS_Livraisons[Encaisst])","v":0},{"$f":"SUMIF(T_LIVRAISONS_Livraisons[Nom de clients],T_SOLDE_Solde[[#This Row],[Nom  Clients]],T_LIVRAISONS_Livraisons[Remise])","v":0}]
[null,{"$f":"IFERROR(T_BDD_Clients[[#This Row],[Clients]],\"\")","v":0},{"$f":"IFERROR(T_SOLDE_Solde[[#This Row],[Total Bons ]]-(T_SOLDE_Solde[[#This Row],[Total Versement]]+T_SOLDE_Solde[[#This Row],[Remise]]),\"\")","v":0},{"$f":"SUMIF(T_LIVRAISONS_Livraisons[Nom de clients],T_SOLDE_Solde[[#This Row],[Nom  Clients]],T_LIVRAISONS_Livraisons[Montant])","v":0},{"$f":"SUMIF(T_LIVRAISONS_Livraisons[Nom de clients],T_SOLDE_Solde[[#This Row],[Nom  Clients]],T_LIVRAISONS_Livraisons[Encaisst])","v":0},{"$f":"SUMIF(T_LIVRAISONS_Livraisons[Nom de clients],T_SOLDE_Solde[[#This Row],[Nom  Clients]],T_LIVRAISONS_Livraisons[Remise])","v":0}]
[null,{"$f":"IFERROR(T_BDD_Clients[[#This Row],[Clients]],\"\")","v":0},{"$f":"IFERROR(T_SOLDE_Solde[[#This Row],[Total Bons ]]-(T_SOLDE_Solde[[#This Row],[Total Versement]]+T_SOLDE_Solde[[#This Row],[Remise]]),\"\")","v":0},{"$f":"SUMIF(T_LIVRAISONS_Livraisons[Nom de clients],T_SOLDE_Solde[[#This Row],[Nom  Clients]],T_LIVRAISONS_Livraisons[Montant])","v":0},{"$f":"SUMIF(T_LIVRAISONS_Livraisons[Nom de clients],T_SOLDE_Solde[[#This Row],[Nom  Clients]],T_LIVRAISONS_Livraisons[Encaisst])","v":0},{"$f":"SUMIF(T_LIVRAISONS_Livraisons[Nom de clients],T_SOLDE_Solde[[#This Row],[Nom  Clients]],T_LIVRAISONS_Livraisons[Remise])","v":0}]
{"$rows_left_out":46}
{"sheet":"BDD","index":3,"n_rows":282,"n_cols":14,"rows_kept":282,"cut":false,"hidden":false,"merged":[]}
[]
[]
[null,"Clients","Remise","Adress","Tel",null,"REFERENCE","DESIGNATION","UNITE ","PRIX",null,"MODE / REGLM",null,"MOUVEMENTS"]
[null,"ABDELGHNI Marrakech",0.1,"GARAGE ALGER",663636363,null,"PL","PISTOLET LUXE",40,90,null,"ESPECES",null,"ENTREE"]
[null,"ABDELHADI FES",0.05,null,999999999,null,"PS","PISTOLET SIMPLE",60,68,null,"CHEQUE",null,"TRANSFERT"]
[null,"ABDELKRIM KISSARIYA",null,null,555555555,null,"VO","VOITURE",36,87,null,"EFFET"]
[null,"ABDELMALEK FES",null,"MARSSA ALGER",null,null,null,null,null,null,null,"VIRMENT"]
[null,"ABDOU",0.1,"MARSSA ALGER",988776655,null,null,null,null,null,null,"AVOIR"]
[]
[]
[]
[]
[]
[]
[]
{"$rows_left_out":267}