{"text_format":"1","workbook":"xlsx","n_sheets":3,"sheets":["Sheet1","Sheet2","Sheet3"],"not_rendered":{"charts":0,"images":0,"macros":1,"external_links":0,"defined_names":0,"comments":0,"pivot_tables":0},"unopened":[],"bounds":{"document_bytes":16777216,"sheet_cells":100000,"rows_first":2000,"rows_last":500,"rows_between":2000,"halvings":0,"cell_chars":16384,"cell_head_chars":4096},"cells_cut":0,"cells_raw":0,"read":"whole","date_system":"1900"}

{"sheet":"Sheet1","index":0,"n_rows":250,"n_cols":12,"rows_kept":250,"cut":false,"hidden":false,"merged":[]}
[null,null,"اسم الطالب","العلامة",null,"ترتيب الأسماء\n حسب العلامات","العلامات","المرتبة\n بالأرقام","المرتبة\n بالحروف",null,null,"عدد الطلاب الأوائل\nالمطلوب"]
[1,{"$f":"OrdeUP100(A2)","v":"الأوّل"},"A1",50,{"$f":"IF(OR(C2=\"\",D2=\"\"),\"\",RANK(D2,$D$2:$D$250)+(ROWS($A$1:A1)-1)/100)","v":13},{"$f":"IF(OR(C2=\"\",D2=\"\",ROWS($F$2:F2)>$L$2),\"\",INDEX($C$2:$C$250,MATCH(SMALL($E$2:$E$250,ROWS($F$2:F2)),$E$2:$E$250,0)))","v":"A6"},{"$f":"IF(OR(C2=\"\",D2=\"\",ROWS($G$2:G2)>$L$2),\"\",IF(OR(C2=\"\",D2=\"\"),\"\",INDEX($D$2:$D$250,MATCH(F2,$C$2:$C$250,0))))","v":95},{"$f":"IF(OR(C2=\"\",D2=\"\",ROWS($H$2:H2)>$L$2),\"\",IF(OR(C2=\"\",D2=\"\"),\"\",SMALL($J$2:$J$250,ROWS($H$2:H2))))","v":1},{"$f":"IF(OR(C2=\"\",D2=\"\",ROWS($F$2:F2)>$L$2),\"\",IF(OR(C2=\"\",D2=\"\"),\"\",OrdeUP100(H2)))","v":"الأوّل"},{"$f":"IF(OR(C2=\"\",D2=\"\"),\"\",RANK(D2,$D$2:$D$250))","v":13},null,10]
[2,{"$f":"OrdeUP100(A3)","v":"الثّاني"},"A2",51,{"$f":"IF(OR(C3=\"\",D3=\"\"),\"\",RANK(D3,$D$2:$D$250)+(ROWS($A$1:A2)-1)/100)","v":12.01},{"$f":"IF(OR(C3=\"\",D3=\"\",ROWS($F$2:F3)>$L$2),\"\",INDEX($C$2:$C$250,MATCH(SMALL($E$2:$E$250,ROWS($F$2:F3)),$E$2:$E$250,0)))","v":"A11"},{"$f":"IF(OR(C3=\"\",D3=\"\",ROWS($G$2:G3)>$L$2),\"\",IF(OR(C3=\"\",D3=\"\"),\"\",INDEX($D$2:$D$250,MATCH(F3,$C$2:$C$250,0))))","v":95},{"$f":"IF(OR(C3=\"\",D3=\"\",ROWS($H$2:H3)>$L$2),\"\",IF(OR(C3=\"\",D3=\"\"),\"\",SMALL($J$2:$J$250,ROWS($H$2:H3))))","v":1},{"$f":"IF(OR(C3=\"\",D3=\"\",ROWS($F$2:F3)>$L$2),\"\",IF(OR(C3=\"\",D3=\"\"),\"\",OrdeUP100(H3)))","v":"الأوّل"},{"$f":"IF(OR(C3=\"\",D3=\"\"),\"\",RANK(D3,$D$2:$D$250))","v":12}]
[3,"الثّالث","A3",65,{"$f":"IF(OR(C4=\"\",D4=\"\"),\"\",RANK(D4,$D$2:$D$250)+(ROWS($A$1:A3)-1)/100)","v":6.02},{"$f":"IF(OR(C4=\"\",D4=\"\",ROWS($F$2:F4)>$L$2),\"\",INDEX($C$2:$C$250,MATCH(SMALL($E$2:$E$250,ROWS($F$2:F4)),$E$2:$E$250,0)))","v":"A13"},{"$f":"IF(OR(C4=\"\",D4=\"\",ROWS($G$2:G4)>$L$2),\"\",IF(OR(C4=\"\",D4=\"\"),\"\",INDEX($D$2:$D$250,MATCH(F4,$C$2:$C$250,0))))","v":90},{"$f":"IF(OR(C4=\"\",D4=\"\",ROWS($H$2:H4)>$L$2),\"\",IF(OR(C4=\"\",D4=\"\"),\"\",SMALL($J$2:$J$250,ROWS($H$2:H4))))","v":3},{"$f":"IF(OR(C4=\"\",D4=\"\",ROWS($F$2:F4)>$L$2),\"\",IF(OR(C4=\"\",D4=\"\"),\"\",OrdeUP100(H4)))","v":"الثّالث"},6]
[4,"الرّابع","A4",56,{"$f":"IF(OR(C5=\"\",D5=\"\"),\"\",RANK(D5,$D$2:$D$250)+(ROWS($A$1:A4)-1)/100)","v":9.0299999999999994},{"$f":"IF(OR(C5=\"\",D5=\"\",ROWS($F$2:F5)>$L$2),\"\",INDEX($C$2:$C$250,MATCH(SMALL($E$2:$E$250,ROWS($F$2:F5)),$E$2:$E$250,0)))","v":"A5"},{"$f":"IF(OR(C5=\"\",D5=\"\",ROWS($G$2:G5)>$L$2),\"\",IF(OR(C5=\"\",D5=\"\"),\"\",INDEX($D$2:$D$250,MATCH(F5,$C$2:$C$250,0))))","v":70},{"$f":"IF(OR(C5=\"\",D5=\"\",ROWS($H$2:H5)>$L$2),\"\",IF(OR(C5=\"\",D5=\"\"),\"\",SMALL($J$2:$J$250,ROWS($H$2:H5))))","v":4},{"$f":"IF(OR(C5=\"\",D5=\"\",ROWS($F$2:F5)>$L$2),\"\",IF(OR(C5=\"\",D5=\"\"),\"\",OrdeUP100(H5)))","v":"الرّابع"},9,"  "]
[5,"الخامس","A5",70,{"$f":"IF(OR(C6=\"\",D6=\"\"),\"\",RANK(D6,$D$2:$D$250)+(ROWS($A$1:A5)-1)/100)","v":4.04},{"$f":"IF(OR(C6=\"\",D6=\"\",ROWS($F$2:F6)>$L$2),\"\",INDEX($C$2:$C$250,MATCH(SMALL($E$2:$E$250,ROWS($F$2:F6)),$E$2:$E$250,0)))","v":"A9"},{"$f":"IF(OR(C6=\"\",D6=\"\",ROWS($G$2:G6)>$L$2),\"\",IF(OR(C6=\"\",D6=\"\"),\"\",INDEX($D$2:$D$250,MATCH(F6,$C$2:$C$250,0))))","v":70},{"$f":"IF(OR(C6=\"\",D6=\"\",ROWS($H$2:H6)>$L$2),\"\",IF(OR(C6=\"\",D6=\"\"),\"\",SMALL($J$2:$J$250,ROWS($H$2:H6))))","v":4},{"$f":"IF(OR(C6=\"\",D6=\"\",ROWS($F$2:F6)>$L$2),\"\",IF(OR(C6=\"\",D6=\"\"),\"\",OrdeUP100(H6)))","v":"الرّابع"},4]
[6,"السّادس","A6",95,{"$f":"IF(OR(C7=\"\",D7=\"\"),\"\",RANK(D7,$D$2:$D$250)+(ROWS($A$1:A6)-1)/100)","v":1.05},{"$f":"IF(OR(C7=\"\",D7=\"\",ROWS($F$2:F7)>$L$2),\"\",INDEX($C$2:$C$250,MATCH(SMALL($E$2:$E$250,ROWS($F$2:F7)),$E$2:$E$250,0)))","v":"A3"},{"$f":"IF(OR(C7=\"\",D7=\"\",ROWS($G$2:G7)>$L$2),\"\",IF(OR(C7=\"\",D7=\"\"),\"\",INDEX($D$2:$D$250,MATCH(F7,$C$2:$C$250,0))))","v":65},{"$f":"IF(OR(C7=\"\",D7=\"\",ROWS($H$2:H7)>$L$2),\"\",IF(OR(C7=\"\",D7=\"\"),\"\",SMALL($J$2:$J$250,ROWS($H$2:H7))))","v":6},{"$f":"IF(OR(C7=\"\",D7=\"\",ROWS($F$2:F7)>$L$2),\"\",IF(OR(C7=\"\",D7=\"\"),\"\",OrdeUP100(H7)))","v":"السّادس"},1]
[7,"السّابع","A7",56,{"$f":"IF(OR(C8=\"\",D8=\"\"),\"\",RANK(D8,$D$2:$D$250)+(ROWS($A$1:A7)-1)/100)","v":9.06},{"$f":"IF(OR(C8=\"\",D8=\"\",ROWS($F$2:F8)>$L$2),\"\",INDEX($C$2:$C$250,MATCH(SMALL($E$2:$E$250,ROWS($F$2:F8)),$E$2:$E$250,0)))","v":"A10"},{"$f":"IF(OR(C8=\"\",D8=\"\",ROWS($G$2:G8)>$L$2),\"\",IF(OR(C8=\"\",D8=\"\"),\"\",INDEX($D$2:$D$250,MATCH(F8,$C$2:$C$250,0))))","v":59},{"$f":"IF(OR(C8=\"\",D8=\"\",ROWS($H$2:H8)>$L$2),\"\",IF(OR(C8=\"\",D8=\"\"),\"\",SMALL($J$2:$J$250,ROWS($H$2:H8))))","v":7},{"$f":"IF(OR(C8=\"\",D8=\"\",ROWS($F$2:F8)>$L$2),\"\",IF(OR(C8=\"\",D8=\"\"),\"\",OrdeUP100(H8)))","v":"السّابع"},9]
[8,"الثّامن","A8",57,{"$f":"IF(OR(C9=\"\",D9=\"\"),\"\",RANK(D9,$D$2:$D$250)+(ROWS($A$1:A8)-1)/100)","v":8.07},{"$f":"IF(OR(C9=\"\",D9=\"\",ROWS($F$2:F9)>$L$2),\"\",INDEX($C$2:$C$250,MATCH(SMALL($E$2:$E$250,ROWS($F$2:F9)),$E$2:$E$250,0)))","v":"A8"},{"$f":"IF(OR(C9=\"\",D9=\"\",ROWS($G$2:G9)>$L$2),\"\",IF(OR(C9=\"\",D9=\"\"),\"\",INDEX($D$2:$D$250,MATCH(F9,$C$2:$C$250,0))))","v":57},{"$f":"IF(OR(C9=\"\",D9=\"\",ROWS($H$2:H9)>$L$2),\"\",IF(OR(C9=\"\",D9=\"\"),\"\",SMALL($J$2:$J$250,ROWS($H$2:H9))))","v":8},{"$f":"IF(OR(C9=\"\",D9=\"\",ROWS($F$2:F9)>$L$2),\"\",IF(OR(C9=\"\",D9=\"\"),\"\",OrdeUP100(H9)))","v":"الثّامن"},8]
[9,"التّاسع","A9",70,{"$f":"IF(OR(C10=\"\",D10=\"\"),\"\",RANK(D10,$D$2:$D$250)+(ROWS($A$1:A9)-1)/100)","v":4.08},{"$f":"IF(OR(C10=\"\",D10=\"\",ROWS($F$2:F10)>$L$2),\"\",INDEX($C$2:$C$250,MATCH(SMALL($E$2:$E$250,ROWS($F$2:F10)),$E$2:$E$250,0)))","v":"A4"},{"$f":"IF(OR(C10=\"\",D10=\"\",ROWS($G$2:G10)>$L$2),\"\",IF(OR(C10=\"\",D10=\"\"),\"\",INDEX($D$2:$D$250,MATCH(F10,$C$2:$C$250,0))))","v":56},{"$f":"IF(OR(C10=\"\",D10=\"\",ROWS($H$2:H10)>$L$2),\"\",IF(OR(C10=\"\",D10=\"\"),\"\",SMALL($J$2:$J$250,ROWS($H$2:H10))))","v":9},{"$f":"IF(OR(C10=\"\",D10=\"\",ROWS($F$2:F10)>$L$2),\"\",IF(OR(C10=\"\",D10=\"\"),\"\",OrdeUP100(H10)))","v":"التّاسع"},4]
[10,"العاشر","A10",59,{"$f":"IF(OR(C11=\"\",D11=\"\"),\"\",RANK(D11,$D$2:$D$250)+(ROWS($A$1:A10)-1)/100)","v":7.09},{"$f":"IF(OR(C11=\"\",D11=\"\",ROWS($F$2:F11)>$L$2),\"\",INDEX($C$2:$C$250,MATCH(SMALL($E$2:$E$250,ROWS($F$2:F11)),$E$2:$E$250,0)))","v":"A7"},{"$f":"IF(OR(C11=\"\",D11=\"\",ROWS($G$2:G11)>$L$2),\"\",IF(OR(C11=\"\",D11=\"\"),\"\",INDEX($D$2:$D$250,MATCH(F11,$C$2:$C$250,0))))","v":56},{"$f":"IF(OR(C11=\"\",D11=\"\",ROWS($H$2:H11)>$L$2),\"\",IF(OR(C11=\"\",D11=\"\"),\"\",SMALL($J$2:$J$250,ROWS($H$2:H11))))","v":9},{"$f":"IF(OR(C11=\"\",D11=\"\",ROWS($F$2:F11)>$L$2),\"\",IF(OR(C11=\"\",D11=\"\"),\"\",OrdeUP100(H11)))","v":"التّاسع"},7]
[11,"الحادي عشر","A11",95,{"$f":"IF(OR(C12=\"\",D12=\"\"),\"\",RANK(D12,$D$2:$D$250)+(ROWS($A$1:A11)-1)/100)","v":1.1000000000000001},{"$f":"IF(OR(C12=\"\",D12=\"\",ROWS($F$2:F12)>$L$2),\"\",INDEX($C$2:$C$250,MATCH(SMALL($E$2:$E$250,ROWS($F$2:F12)),$E$2:$E$250,0)))","v":""},{"$f":"IF(OR(C12=\"\",D12=\"\",ROWS($G$2:G12)>$L$2),\"\",IF(OR(C12=\"\",D12=\"\"),\"\",INDEX($D$2:$D$250,MATCH(F12,$C$2:$C$250,0))))","v":""},{"$f":"IF(OR(C12=\"\",D12=\"\",ROWS($H$2:H12)>$L$2),\"\",IF(OR(C12=\"\",D12=\"\"),\"\",SMALL($J$2:$J$250,ROWS($H$2:H12))))","v":""},{"$f":"IF(OR(C12=\"\",D12=\"\",ROWS($F$2:F12)>$L$2),\"\",IF(OR(C12=\"\",D12=\"\"),\"\",OrdeUP100(H12)))","v":""},1]
[12,"الثّاني عشر","A12",56,{"$f":"IF(OR(C13=\"\",D13=\"\"),\"\",RANK(D13,$D$2:$D$250)+(ROWS($A$1:A12)-1)/100)","v":9.11},{"$f":"IF(OR(C13=\"\",D13=\"\",ROWS($F$2:F13)>$L$2),\"\",INDEX($C$2:$C$250,MATCH(SMALL($E$2:$E$250,ROWS($F$2:F13)),$E$2:$E$250,0)))","v":""},{"$f":"IF(OR(C13=\"\",D13=\"\",ROWS($G$2:G13)>$L$2),\"\",IF(OR(C13=\"\",D13=\"\"),\"\",INDEX($D$2:$D$250,MATCH(F13,$C$2:$C$250,0))))","v":""},{"$f":"IF(OR(C13=\"\",D13=\"\",ROWS($H$2:H13)>$L$2),\"\",IF(OR(C13=\"\",D13=\"\"),\"\",SMALL($J$2:$J$250,ROWS($H$2:H13))))","v":""},{"$f":"IF(OR(C13=\"\",D13=\"\",ROWS($F$2:F13)>$L$2),\"\",IF(OR(C13=\"\",D13=\"\"),\"\",OrdeUP100(H13)))","v":""},9]
[null,null,"A13",90,{"$f":"IF(OR(C14=\"\",D14=\"\"),\"\",RANK(D14,$D$2:$D$250)+(ROWS($A$1:A13)-1)/100)","v":3.12},{"$f":"IF(OR(C14=\"\",D14=\"\",ROWS($F$2:F14)>$L$2),\"\",INDEX($C$2:$C$250,MATCH(SMALL($E$2:$E$250,ROWS($F$2:F14)),$E$2:$E$250,0)))","v":""},{"$f":"IF(OR(C14=\"\",D14=\"\",ROWS($G$2:G14)>$L$2),\"\",IF(OR(C14=\"\",D14=\"\"),\"\",INDEX($D$2:$D$250,MATCH(F14,$C$2:$C$250,0))))","v":""},{"$f":"IF(OR(C14=\"\",D14=\"\",ROWS($H$2:H14)>$L$2),\"\",IF(OR(C14=\"\",D14=\"\"),\"\",SMALL($J$2:$J$250,ROWS($H$2:H14))))","v":""},{"$f":"IF(OR(C14=\"\",D14=\"\",ROWS($F$2:F14)>$L$2),\"\",IF(OR(C14=\"\",D14=\"\"),\"\",OrdeUP100(H14)))","v":""},3]
[null,null,null,null,{"$f":"IF(OR(C15=\"\",D15=\"\"),\"\",RANK(D15,$D$2:$D$250)+(ROWS($A$1:A14)-1)/100)","v":""},{"$f":"IF(OR(C15=\"\",D15=\"\",ROWS($F$2:F15)>$L$2),\"\",INDEX($C$2:$C$250,MATCH(SMALL($E$2:$E$250,ROWS($F$2:F15)),$E$2:$E$250,0)))","v":""},{"$f":"IF(OR(C15=\"\",D15=\"\",ROWS($G$2:G15)>$L$2),\"\",IF(OR(C15=\"\",D15=\"\"),\"\",INDEX($D$2:$D$250,MATCH(F15,$C$2:$C$250,0))))","v":""},{"$f":"IF(OR(C15=\"\",D15=\"\",ROWS($H$2:H15)>$L$2),\"\",IF(OR(C15=\"\",D15=\"\"),\"\",SMALL($J$2:$J$250,ROWS($H$2:H15))))","v":""},{"$f":"IF(OR(C15=\"\",D15=\"\",ROWS($F$2:F15)>$L$2),\"\",IF(OR(C15=\"\",D15=\"\"),\"\",OrdeUP100(H15)))","v":""},""]
[null,null,null,null,{"$f":"IF(OR(C16=\"\",D16=\"\"),\"\",RANK(D16,$D$2:$D$250)+(ROWS($A$1:A15)-1)/100)","v":""},{"$f":"IF(OR(C16=\"\",D16=\"\",ROWS($F$2:F16)>$L$2),\"\",INDEX($C$2:$C$250,MATCH(SMALL($E$2:$E$250,ROWS($F$2:F16)),$E$2:$E$250,0)))","v":""},{"$f":"IF(OR(C16=\"\",D16=\"\",ROWS($G$2:G16)>$L$2),\"\",IF(OR(C16=\"\",D16=\"\"),\"\",INDEX($D$2:$D$250,MATCH(F16,$C$2:$C$250,0))))","v":""},{"$f":"IF(OR(C16=\"\",D16=\"\",ROWS($H$2:H16)>$L$2),\"\",IF(OR(C16=\"\",D16=\"\"),\"\",SMALL($J$2:$J$250,ROWS($H$2:H16))))","v":""},{"$f":"IF(OR(C16=\"\",D16=\"\",ROWS($F$2:F16)>$L$2),\"\",IF(OR(C16=\"\",D16=\"\"),\"\",OrdeUP100(H16)))","v":""},""]
[null,null,null,null,{"$f":"IF(OR(C17=\"\",D17=\"\"),\"\",RANK(D17,$D$2:$D$250)+(ROWS($A$1:A16)-1)/100)","v":""},{"$f":"IF(OR(C17=\"\",D17=\"\",ROWS($F$2:F17)>$L$2),\"\",INDEX($C$2:$C$250,MATCH(SMALL($E$2:$E$250,ROWS($F$2:F17)),$E$2:$E$250,0)))","v":""},{"$f":"IF(OR(C17=\"\",D17=\"\",ROWS($G$2:G17)>$L$2),\"\",IF(OR(C17=\"\",D17=\"\"),\"\",INDEX($D$2:$D$250,MATCH(F17,$C$2:$C$250,0))))","v":""},{"$f":"IF(OR(C17=\"\",D17=\"\",ROWS($H$2:H17)>$L$2),\"\",IF(OR(C17=\"\",D17=\"\"),\"\",SMALL($J$2:$J$250,ROWS($H$2:H17))))","v":""},{"$f":"IF(OR(C17=\"\",D17=\"\",ROWS($F$2:F17)>$L$2),\"\",IF(OR(C17=\"\",D17=\"\"),\"\",OrdeUP100(H17)))","v":""},""]
[null,null,null,null,{"$f":"IF(OR(C18=\"\",D18=\"\"),\"\",RANK(D18,$D$2:$D$250)+(ROWS($A$1:A17)-1)/100)","v":""},{"$f":"IF(OR(C18=\"\",D18=\"\",ROWS($F$2:F18)>$L$2),\"\",INDEX($C$2:$C$250,MATCH(SMALL($E$2:$E$250,ROWS($F$2:F18)),$E$2:$E$250,0)))","v":""},{"$f":"IF(OR(C18=\"\",D18=\"\",ROWS($G$2:G18)>$L$2),\"\",IF(OR(C18=\"\",D18=\"\"),\"\",INDEX($D$2:$D$250,MATCH(F18,$C$2:$C$250,0))))","v":""},{"$f":"IF(OR(C18=\"\",D18=\"\",ROWS($H$2:H18)>$L$2),\"\",IF(OR(C18=\"\",D18=\"\"),\"\",SMALL($J$2:$J$250,ROWS($H$2:H18))))","v":""},{"$f":"IF(OR(C18=\"\",D18=\"\",ROWS($F$2:F18)>$L$2),\"\",IF(OR(C18=\"\",D18=\"\"),\"\",OrdeUP100(H18)))","v":""},""]
[null,null,null,null,{"$f":"IF(OR(C19=\"\",D19=\"\"),\"\",RANK(D19,$D$2:$D$250)+(ROWS($A$1:A18)-1)/100)","v":""},{"$f":"IF(OR(C19=\"\",D19=\"\",ROWS($F$2:F19)>$L$2),\"\",INDEX($C$2:$C$250,MATCH(SMALL($E$2:$E$250,ROWS($F$2:F19)),$E$2:$E$250,0)))","v":""},{"$f":"IF(OR(C19=\"\",D19=\"\",ROWS($G$2:G19)>$L$2),\"\",IF(OR(C19=\"\",D19=\"\"),\"\",INDEX($D$2:$D$250,MATCH(F19,$C$2:$C$250,0))))","v":""},{"$f":"IF(OR(C19=\"\",D19=\"\",ROWS($H$2:H19)>$L$2),\"\",IF(OR(C19=\"\",D19=\"\"),\"\",SMALL($J$2:$J$250,ROWS($H$2:H19))))","v":""},{"$f":"IF(OR(C19=\"\",D19=\"\",ROWS($F$2:F19)>$L$2),\"\",IF(OR(C19=\"\",D19=\"\"),\"\",OrdeUP100(H19)))","v":""},""]
[null,null,null,null,{"$f":"IF(OR(C20=\"\",D20=\"\"),\"\",RANK(D20,$D$2:$D$250)+(ROWS($A$1:A19)-1)/100)","v":""},{"$f":"IF(OR(C20=\"\",D20=\"\",ROWS($F$2:F20)>$L$2),\"\",INDEX($C$2:$C$250,MATCH(SMALL($E$2:$E$250,ROWS($F$2:F20)),$E$2:$E$250,0)))","v":""},{"$f":"IF(OR(C20=\"\",D20=\"\",ROWS($G$2:G20)>$L$2),\"\",IF(OR(C20=\"\",D20=\"\"),\"\",INDEX($D$2:$D$250,MATCH(F20,$C$2:$C$250,0))))","v":""},{"$f":"IF(OR(C20=\"\",D20=\"\",ROWS($H$2:H20)>$L$2),\"\",IF(OR(C20=\"\",D20=\"\"),\"\",SMALL($J$2:$J$250,ROWS($H$2:H20))))","v":""},{"$f":"IF(OR(C20=\"\",D20=\"\",ROWS($F$2:F20)>$L$2),\"\",IF(OR(C20=\"\",D20=\"\"),\"\",OrdeUP100(H20)))","v":""},""]
[null,null,null,null,{"$f":"IF(OR(C21=\"\",D21=\"\"),\"\",RANK(D21,$D$2:$D$250)+(ROWS($A$1:A20)-1)/100)","v":""},{"$f":"IF(OR(C21=\"\",D21=\"\",ROWS($F$2:F21)>$L$2),\"\",INDEX($C$2:$C$250,MATCH(SMALL($E$2:$E$250,ROWS($F$2:F21)),$E$2:$E$250,0)))","v":""},{"$f":"IF(OR(C21=\"\",D21=\"\",ROWS($G$2:G21)>$L$2),\"\",IF(OR(C21=\"\",D21=\"\"),\"\",INDEX($D$2:$D$250,MATCH(F21,$C$2:$C$250,0))))","v":""},{"$f":"IF(OR(C21=\"\",D21=\"\",ROWS($H$2:H21)>$L$2),\"\",IF(OR(C21=\"\",D21=\"\"),\"\",SMALL($J$2:$J$250,ROWS($H$2:H21))))","v":""},{"$f":"IF(OR(C21=\"\",D21=\"\",ROWS($F$2:F21)>$L$2),\"\",IF(OR(C21=\"\",D21=\"\"),\"\",OrdeUP100(H21)))","v":""},""]
[null,null,null,null,{"$f":"IF(OR(C22=\"\",D22=\"\"),\"\",RANK(D22,$D$2:$D$250)+(ROWS($A$1:A21)-1)/100)","v":""},{"$f":"IF(OR(C22=\"\",D22=\"\",ROWS($F$2:F22)>$L$2),\"\",INDEX($C$2:$C$250,MATCH(SMALL($E$2:$E$250,ROWS($F$2:F22)),$E$2:$E$250,0)))","v":""},{"$f":"IF(OR(C22=\"\",D22=\"\",ROWS($G$2:G22)>$L$2),\"\",IF(OR(C22=\"\",D22=\"\"),\"\",INDEX($D$2:$D$250,MATCH(F22,$C$2:$C$250,0))))","v":""},{"$f":"IF(OR(C22=\"\",D22=\"\",ROWS($H$2:H22)>$L$2),\"\",IF(OR(C22=\"\",D22=\"\"),\"\",SMALL($J$2:$J$250,ROWS($H$2:H22))))","v":""},{"$f":"IF(OR(C22=\"\",D22=\"\",ROWS($F$2:F22)>$L$2),\"\",IF(OR(C22=\"\",D22=\"\"),\"\",OrdeUP100(H22)))","v":""},""]
[null,null,null,null,{"$f":"IF(OR(C23=\"\",D23=\"\"),\"\",RANK(D23,$D$2:$D$250)+(ROWS($A$1:A22)-1)/100)","v":""},{"$f":"IF(OR(C23=\"\",D23=\"\",ROWS($F$2:F23)>$L$2),\"\",INDEX($C$2:$C$250,MATCH(SMALL($E$2:$E$250,ROWS($F$2:F23)),$E$2:$E$250,0)))","v":""},{"$f":"IF(OR(C23=\"\",D23=\"\",ROWS($G$2:G23)>$L$2),\"\",IF(OR(C23=\"\",D23=\"\"),\"\",INDEX($D$2:$D$250,MATCH(F23,$C$2:$C$250,0))))","v":""},{"$f":"IF(OR(C23=\"\",D23=\"\",ROWS($H$2:H23)>$L$2),\"\",IF(OR(C23=\"\",D23=\"\"),\"\",SMALL($J$2:$J$250,ROWS($H$2:H23))))","v":""},{"$f":"IF(OR(C23=\"\",D23=\"\",ROWS($F$2:F23)>$L$2),\"\",IF(OR(C23=\"\",D23=\"\"),\"\",OrdeUP100(H23)))","v":""},""]
[null,null,null,null,{"$f":"IF(OR(C24=\"\",D24=\"\"),\"\",RANK(D24,$D$2:$D$250)+(ROWS($A$1:A23)-1)/100)","v":""},{"$f":"IF(OR(C24=\"\",D24=\"\",ROWS($F$2:F24)>$L$2),\"\",INDEX($C$2:$C$250,MATCH(SMALL($E$2:$E$250,ROWS($F$2:F24)),$E$2:$E$250,0)))","v":""},{"$f":"IF(OR(C24=\"\",D24=\"\",ROWS($G$2:G24)>$L$2),\"\",IF(OR(C24=\"\",D24=\"\"),\"\",INDEX($D$2:$D$250,MATCH(F24,$C$2:$C$250,0))))","v":""},{"$f":"IF(OR(C24=\"\",D24=\"\",ROWS($H$2:H24)>$L$2),\"\",IF(OR(C24=\"\",D24=\"\"),\"\",SMALL($J$2:$J$250,ROWS($H$2:H24))))","v":""},{"$f":"IF(OR(C24=\"\",D24=\"\",ROWS($F$2:F24)>$L$2),\"\",IF(OR(C24=\"\",D24=\"\"),\"\",OrdeUP100(H24)))","v":""},""]
[null,null,null,null,{"$f":"IF(OR(C25=\"\",D25=\"\"),\"\",RANK(D25,$D$2:$D$250)+(ROWS($A$1:A24)-1)/100)","v":""},{"$f":"IF(OR(C25=\"\",D25=\"\",ROWS($F$2:F25)>$L$2),\"\",INDEX($C$2:$C$250,MATCH(SMALL($E$2:$E$250,ROWS($F$2:F25)),$E$2:$E$250,0)))","v":""},{"$f":"IF(OR(C25=\"\",D25=\"\",ROWS($G$2:G25)>$L$2),\"\",IF(OR(C25=\"\",D25=\"\"),\"\",INDEX($D$2:$D$250,MATCH(F25,$C$2:$C$250,0))))","v":""},{"$f":"IF(OR(C25=\"\",D25=\"\",ROWS($H$2:H25)>$L$2),\"\",IF(OR(C25=\"\",D25=\"\"),\"\",SMALL($J$2:$J$250,ROWS($H$2:H25))))","v":""},{"$f":"IF(OR(C25=\"\",D25=\"\",ROWS($F$2:F25)>$L$2),\"\",IF(OR(C25=\"\",D25=\"\"),\"\",OrdeUP100(H25)))","v":""},""]
[null,null,null,null,{"$f":"IF(OR(C26=\"\",D26=\"\"),\"\",RANK(D26,$D$2:$D$250)+(ROWS($A$1:A25)-1)/100)","v":""},{"$f":"IF(OR(C26=\"\",D26=\"\",ROWS($F$2:F26)>$L$2),\"\",INDEX($C$2:$C$250,MATCH(SMALL($E$2:$E$250,ROWS($F$2:F26)),$E$2:$E$250,0)))","v":""},{"$f":"IF(OR(C26=\"\",D26=\"\",ROWS($G$2:G26)>$L$2),\"\",IF(OR(C26=\"\",D26=\"\"),\"\",INDEX($D$2:$D$250,MATCH(F26,$C$2:$C$250,0))))","v":""},{"$f":"IF(OR(C26=\"\",D26=\"\",ROWS($H$2:H26)>$L$2),\"\",IF(OR(C26=\"\",D26=\"\"),\"\",SMALL($J$2:$J$250,ROWS($H$2:H26))))","v":""},{"$f":"IF(OR(C26=\"\",D26=\"\",ROWS($F$2:F26)>$L$2),\"\",IF(OR(C26=\"\",D26=\"\"),\"\",OrdeUP100(H26)))","v":""},""]
[null,null,null,null,{"$f":"IF(OR(C27=\"\",D27=\"\"),\"\",RANK(D27,$D$2:$D$250)+(ROWS($A$1:A26)-1)/100)","v":""},{"$f":"IF(OR(C27=\"\",D27=\"\",ROWS($F$2:F27)>$L$2),\"\",INDEX($C$2:$C$250,MATCH(SMALL($E$2:$E$250,ROWS($F$2:F27)),$E$2:$E$250,0)))","v":""},{"$f":"IF(OR(C27=\"\",D27=\"\",ROWS($G$2:G27)>$L$2),\"\",IF(OR(C27=\"\",D27=\"\"),\"\",INDEX($D$2:$D$250,MATCH(F27,$C$2:$C$250,0))))","v":""},{"$f":"IF(OR(C27=\"\",D27=\"\",ROWS($H$2:H27)>$L$2),\"\",IF(OR(C27=\"\",D27=\"\"),\"\",SMALL($J$2:$J$250,ROWS($H$2:H27))))","v":""},{"$f":"IF(OR(C27=\"\",D27=\"\",ROWS($F$2:F27)>$L$2),\"\",IF(OR(C27=\"\",D27=\"\"),\"\",OrdeUP100(H27)))","v":""},""]
[null,null,null,null,{"$f":"IF(OR(C28=\"\",D28=\"\"),\"\",RANK(D28,$D$2:$D$250)+(ROWS($A$1:A27)-1)/100)","v":""},{"$f":"IF(OR(C28=\"\",D28=\"\",ROWS($F$2:F28)>$L$2),\"\",INDEX($C$2:$C$250,MATCH(SMALL($E$2:$E$250,ROWS($F$2:F28)),$E$2:$E$250,0)))","v":""},{"$f":"IF(OR(C28=\"\",D28=\"\",ROWS($G$2:G28)>$L$2),\"\",IF(OR(C28=\"\",D28=\"\"),\"\",INDEX($D$2:$D$250,MATCH(F28,$C$2:$C$250,0))))","v":""},{"$f":"IF(OR(C28=\"\",D28=\"\",ROWS($H$2:H28)>$L$2),\"\",IF(OR(C28=\"\",D28=\"\"),\"\",SMALL($J$2:$J$250,ROWS($H$2:H28))))","v":""},{"$f":"IF(OR(C28=\"\",D28=\"\",ROWS($F$2:F28)>$L$2),\"\",IF(OR(C28=\"\",D28=\"\"),\"\",OrdeUP100(H28)))","v":""},""]
[null,null,null,null,{"$f":"IF(OR(C29=\"\",D29=\"\"),\"\",RANK(D29,$D$2:$D$250)+(ROWS($A$1:A28)-1)/100)","v":""},{"$f":"IF(OR(C29=\"\",D29=\"\",ROWS($F$2:F29)>$L$2),\"\",INDEX($C$2:$C$250,MATCH(SMALL($E$2:$E$250,ROWS($F$2:F29)),$E$2:$E$250,0)))","v":""},{"$f":"IF(OR(C29=\"\",D29=\"\",ROWS($G$2:G29)>$L$2),\"\",IF(OR(C29=\"\",D29=\"\"),\"\",INDEX($D$2:$D$250,MATCH(F29,$C$2:$C$250,0))))","v":""},{"$f":"IF(OR(C29=\"\",D29=\"\",ROWS($H$2:H29)>$L$2),\"\",IF(OR(C29=\"\",D29=\"\"),\"\",SMALL($J$2:$J$250,ROWS($H$2:H29))))","v":""},{"$f":"IF(OR(C29=\"\",D29=\"\",ROWS($F$2:F29)>$L$2),\"\",IF(OR(C29=\"\",D29=\"\"),\"\",OrdeUP100(H29)))","v":""},""]
[null,null,null,null,{"$f":"IF(OR(C30=\"\",D30=\"\"),\"\",RANK(D30,$D$2:$D$250)+(ROWS($A$1:A29)-1)/100)","v":""},{"$f":"IF(OR(C30=\"\",D30=\"\",ROWS($F$2:F30)>$L$2),\"\",INDEX($C$2:$C$250,MATCH(SMALL($E$2:$E$250,ROWS($F$2:F30)),$E$2:$E$250,0)))","v":""},{"$f":"IF(OR(C30=\"\",D30=\"\",ROWS($G$2:G30)>$L$2),\"\",IF(OR(C30=\"\",D30=\"\"),\"\",INDEX($D$2:$D$250,MATCH(F30,$C$2:$C$250,0))))","v":""},{"$f":"IF(OR(C30=\"\",D30=\"\",ROWS($H$2:H30)>$L$2),\"\",IF(OR(C30=\"\",D30=\"\"),\"\",SMALL($J$2:$J$250,ROWS($H$2:H30))))","v":""},{"$f":"IF(OR(C30=\"\",D30=\"\",ROWS($F$2:F30)>$L$2),\"\",IF(OR(C30=\"\",D30=\"\"),\"\",OrdeUP100(H30)))","v":""},""]
[null,null,null,null,{"$f":"IF(OR(C31=\"\",D31=\"\"),\"\",RANK(D31,$D$2:$D$250)+(ROWS($A$1:A30)-1)/100)","v":""},{"$f":"IF(OR(C31=\"\",D31=\"\",ROWS($F$2:F31)>$L$2),\"\",INDEX($C$2:$C$250,MATCH(SMALL($E$2:$E$250,ROWS($F$2:F31)),$E$2:$E$250,0)))","v":""},{"$f":"IF(OR(C31=\"\",D31=\"\",ROWS($G$2:G31)>$L$2),\"\",IF(OR(C31=\"\",D31=\"\"),\"\",INDEX($D$2:$D$250,MATCH(F31,$C$2:$C$250,0))))","v":""},{"$f":"IF(OR(C31=\"\",D31=\"\",ROWS($H$2:H31)>$L$2),\"\",IF(OR(C31=\"\",D31=\"\"),\"\",SMALL($J$2:$J$250,ROWS($H$2:H31))))","v":""},{"$f":"IF(OR(C31=\"\",D31=\"\",ROWS($F$2:F31)>$L$2),\"\",IF(OR(C31=\"\",D31=\"\"),\"\",OrdeUP100(H31)))","v":""},""]
[null,null,null,null,{"$f":"IF(OR(C32=\"\",D32=\"\"),\"\",RANK(D32,$D$2:$D$250)+(ROWS($A$1:A31)-1)/100)","v":""},{"$f":"IF(OR(C32=\"\",D32=\"\",ROWS($F$2:F32)>$L$2),\"\",INDEX($C$2:$C$250,MATCH(SMALL($E$2:$E$250,ROWS($F$2:F32)),$E$2:$E$250,0)))","v":""},{"$f":"IF(OR(C32=\"\",D32=\"\",ROWS($G$2:G32)>$L$2),\"\",IF(OR(C32=\"\",D32=\"\"),\"\",INDEX($D$2:$D$250,MATCH(F32,$C$2:$C$250,0))))","v":""},{"$f":"IF(OR(C32=\"\",D32=\"\",ROWS($H$2:H32)>$L$2),\"\",IF(OR(C32=\"\",D32=\"\"),\"\",SMALL($J$2:$J$250,ROWS($H$2:H32))))","v":""},{"$f":"IF(OR(C32=\"\",D32=\"\",ROWS($F$2:F32)>$L$2),\"\",IF(OR(C32=\"\",D32=\"\"),\"\",OrdeUP100(H32)))","v":""},""]
[null,null,null,null,{"$f":"IF(OR(C33=\"\",D33=\"\"),\"\",RANK(D33,$D$2:$D$250)+(ROWS($A$1:A32)-1)/100)","v":""},{"$f":"IF(OR(C33=\"\",D33=\"\",ROWS($F$2:F33)>$L$2),\"\",INDEX($C$2:$C$250,MATCH(SMALL($E$2:$E$250,ROWS($F$2:F33)),$E$2:$E$250,0)))","v":""},{"$f":"IF(OR(C33=\"\",D33=\"\",ROWS($G$2:G33)>$L$2),\"\",IF(OR(C33=\"\",D33=\"\"),\"\",INDEX($D$2:$D$250,MATCH(F33,$C$2:$C$250,0))))","v":""},{"$f":"IF(OR(C33=\"\",D33=\"\",ROWS($H$2:H33)>$L$2),\"\",IF(OR(C33=\"\",D33=\"\"),\"\",SMALL($J$2:$J$250,ROWS($H$2:H33))))","v":""},{"$f":"IF(OR(C33=\"\",D33=\"\",ROWS($F$2:F33)>$L$2),\"\",IF(OR(C33=\"\",D33=\"\"),\"\",OrdeUP100(H33)))","v":""},""]
[null,null,null,null,{"$f":"IF(OR(C34=\"\",D34=\"\"),\"\",RANK(D34,$D$2:$D$250)+(ROWS($A$1:A33)-1)/100)","v":""},{"$f":"IF(OR(C34=\"\",D34=\"\",ROWS($F$2:F34)>$L$2),\"\",INDEX($C$2:$C$250,MATCH(SMALL($E$2:$E$250,ROWS($F$2:F34)),$E$2:$E$250,0)))","v":""},{"$f":"IF(OR(C34=\"\",D34=\"\",ROWS($G$2:G34)>$L$2),\"\",IF(OR(C34=\"\",D34=\"\"),\"\",INDEX($D$2:$D$250,MATCH(F34,$C$2:$C$250,0))))","v":""},{"$f":"IF(OR(C34=\"\",D34=\"\",ROWS($H$2:H34)>$L$2),\"\",IF(OR(C34=\"\",D34=\"\"),\"\",SMALL($J$2:$J$250,ROWS($H$2:H34))))","v":""},{"$f":"IF(OR(C34=\"\",D34=\"\",ROWS($F$2:F34)>$L$2),\"\",IF(OR(C34=\"\",D34=\"\"),\"\",OrdeUP100(H34)))","v":""},""]
[null,null,null,null,{"$f":"IF(OR(C35=\"\",D35=\"\"),\"\",RANK(D35,$D$2:$D$250)+(ROWS($A$1:A34)-1)/100)","v":""},{"$f":"IF(OR(C35=\"\",D35=\"\",ROWS($F$2:F35)>$L$2),\"\",INDEX($C$2:$C$250,MATCH(SMALL($E$2:$E$250,ROWS($F$2:F35)),$E$2:$E$250,0)))","v":""},{"$f":"IF(OR(C35=\"\",D35=\"\",ROWS($G$2:G35)>$L$2),\"\",IF(OR(C35=\"\",D35=\"\"),\"\",INDEX($D$2:$D$250,MATCH(F35,$C$2:$C$250,0))))","v":""},{"$f":"IF(OR(C35=\"\",D35=\"\",ROWS($H$2:H35)>$L$2),\"\",IF(OR(C35=\"\",D35=\"\"),\"\",SMALL($J$2:$J$250,ROWS($H$2:H35))))","v":""},{"$f":"IF(OR(C35=\"\",D35=\"\",ROWS($F$2:F35)>$L$2),\"\",IF(OR(C35=\"\",D35=\"\"),\"\",OrdeUP100(H35)))","v":""},""]
[null,null,null,null,{"$f":"IF(OR(C36=\"\",D36=\"\"),\"\",RANK(D36,$D$2:$D$250)+(ROWS($A$1:A35)-1)/100)","v":""},{"$f":"IF(OR(C36=\"\",D36=\"\",ROWS($F$2:F36)>$L$2),\"\",INDEX($C$2:$C$250,MATCH(SMALL($E$2:$E$250,ROWS($F$2:F36)),$E$2:$E$250,0)))","v":""},{"$f":"IF(OR(C36=\"\",D36=\"\",ROWS($G$2:G36)>$L$2),\"\",IF(OR(C36=\"\",D36=\"\"),\"\",INDEX($D$2:$D$250,MATCH(F36,$C$2:$C$250,0))))","v":""},{"$f":"IF(OR(C36=\"\",D36=\"\",ROWS($H$2:H36)>$L$2),\"\",IF(OR(C36=\"\",D36=\"\"),\"\",SMALL($J$2:$J$250,ROWS($H$2:H36))))","v":""},{"$f":"IF(OR(C36=\"\",D36=\"\",ROWS($F$2:F36)>$L$2),\"\",IF(OR(C36=\"\",D36=\"\"),\"\",OrdeUP100(H36)))","v":""},""]
[null,null,null,null,{"$f":"IF(OR(C37=\"\",D37=\"\"),\"\",RANK(D37,$D$2:$D$250)+(ROWS($A$1:A36)-1)/100)","v":""},{"$f":"IF(OR(C37=\"\",D37=\"\",ROWS($F$2:F37)>$L$2),\"\",INDEX($C$2:$C$250,MATCH(SMALL($E$2:$E$250,ROWS($F$2:F37)),$E$2:$E$250,0)))","v":""},{"$f":"IF(OR(C37=\"\",D37=\"\",ROWS($G$2:G37)>$L$2),\"\",IF(OR(C37=\"\",D37=\"\"),\"\",INDEX($D$2:$D$250,MATCH(F37,$C$2:$C$250,0))))","v":""},{"$f":"IF(OR(C37=\"\",D37=\"\",ROWS($H$2:H37)>$L$2),\"\",IF(OR(C37=\"\",D37=\"\"),\"\",SMALL($J$2:$J$250,ROWS($H$2:H37))))","v":""},{"$f":"IF(OR(C37=\"\",D37=\"\",ROWS($F$2:F37)>$L$2),\"\",IF(OR(C37=\"\",D37=\"\"),\"\",OrdeUP100(H37)))","v":""},""]
[null,null,null,null,{"$f":"IF(OR(C38=\"\",D38=\"\"),\"\",RANK(D38,$D$2:$D$250)+(ROWS($A$1:A37)-1)/100)","v":""},{"$f":"IF(OR(C38=\"\",D38=\"\",ROWS($F$2:F38)>$L$2),\"\",INDEX($C$2:$C$250,MATCH(SMALL($E$2:$E$250,ROWS($F$2:F38)),$E$2:$E$250,0)))","v":""},{"$f":"IF(OR(C38=\"\",D38=\"\",ROWS($G$2:G38)>$L$2),\"\",IF(OR(C38=\"\",D38=\"\"),\"\",INDEX($D$2:$D$250,MATCH(F38,$C$2:$C$250,0))))","v":""},{"$f":"IF(OR(C38=\"\",D38=\"\",ROWS($H$2:H38)>$L$2),\"\",IF(OR(C38=\"\",D38=\"\"),\"\",SMALL($J$2:$J$250,ROWS($H$2:H38))))","v":""},{"$f":"IF(OR(C38=\"\",D38=\"\",ROWS($F$2:F38)>$L$2),\"\",IF(OR(C38=\"\",D38=\"\"),\"\",OrdeUP100(H38)))","v":""},""]
[null,null,null,null,{"$f":"IF(OR(C39=\"\",D39=\"\"),\"\",RANK(D39,$D$2:$D$250)+(ROWS($A$1:A38)-1)/100)","v":""},{"$f":"IF(OR(C39=\"\",D39=\"\",ROWS($F$2:F39)>$L$2),\"\",INDEX($C$2:$C$250,MATCH(SMALL($E$2:$E$250,ROWS($F$2:F39)),$E$2:$E$250,0)))","v":""},{"$f":"IF(OR(C39=\"\",D39=\"\",ROWS($G$2:G39)>$L$2),\"\",IF(OR(C39=\"\",D39=\"\"),\"\",INDEX($D$2:$D$250,MATCH(F39,$C$2:$C$250,0))))","v":""},{"$f":"IF(OR(C39=\"\",D39=\"\",ROWS($H$2:H39)>$L$2),\"\",IF(OR(C39=\"\",D39=\"\"),\"\",SMALL($J$2:$J$250,ROWS($H$2:H39))))","v":""},{"$f":"IF(OR(C39=\"\",D39=\"\",ROWS($F$2:F39)>$L$2),\"\",IF(OR(C39=\"\",D39=\"\"),\"\",OrdeUP100(H39)))","v":""},""]
[null,null,null,null,{"$f":"IF(OR(C40=\"\",D40=\"\"),\"\",RANK(D40,$D$2:$D$250)+(ROWS($A$1:A39)-1)/100)","v":""},{"$f":"IF(OR(C40=\"\",D40=\"\",ROWS($F$2:F40)>$L$2),\"\",INDEX($C$2:$C$250,MATCH(SMALL($E$2:$E$250,ROWS($F$2:F40)),$E$2:$E$250,0)))","v":""},{"$f":"IF(OR(C40=\"\",D40=\"\",ROWS($G$2:G40)>$L$2),\"\",IF(OR(C40=\"\",D40=\"\"),\"\",INDEX($D$2:$D$250,MATCH(F40,$C$2:$C$250,0))))","v":""},{"$f":"IF(OR(C40=\"\",D40=\"\",ROWS($H$2:H40)>$L$2),\"\",IF(OR(C40=\"\",D40=\"\"),\"\",SMALL($J$2:$J$250,ROWS($H$2:H40))))","v":""},{"$f":"IF(OR(C40=\"\",D40=\"\",ROWS($F$2:F40)>$L$2),\"\",IF(OR(C40=\"\",D40=\"\"),\"\",OrdeUP100(H40)))","v":""},""]
[null,null,null,null,{"$f":"IF(OR(C41=\"\",D41=\"\"),\"\",RANK(D41,$D$2:$D$250)+(ROWS($A$1:A40)-1)/100)","v":""},{"$f":"IF(OR(C41=\"\",D41=\"\",ROWS($F$2:F41)>$L$2),\"\",INDEX($C$2:$C$250,MATCH(SMALL($E$2:$E$250,ROWS($F$2:F41)),$E$2:$E$250,0)))","v":""},{"$f":"IF(OR(C41=\"\",D41=\"\",ROWS($G$2:G41)>$L$2),\"\",IF(OR(C41=\"\",D41=\"\"),\"\",INDEX($D$2:$D$250,MATCH(F41,$C$2:$C$250,0))))","v":""},{"$f":"IF(OR(C41=\"\",D41=\"\",ROWS($H$2:H41)>$L$2),\"\",IF(OR(C41=\"\",D41=\"\"),\"\",SMALL($J$2:$J$250,ROWS($H$2:H41))))","v":""},{"$f":"IF(OR(C41=\"\",D41=\"\",ROWS($F$2:F41)>$L$2),\"\",IF(OR(C41=\"\",D41=\"\"),\"\",OrdeUP100(H41)))","v":""},""]
[null,null,null,null,{"$f":"IF(OR(C42=\"\",D42=\"\"),\"\",RANK(D42,$D$2:$D$250)+(ROWS($A$1:A41)-1)/100)","v":""},{"$f":"IF(OR(C42=\"\",D42=\"\",ROWS($F$2:F42)>$L$2),\"\",INDEX($C$2:$C$250,MATCH(SMALL($E$2:$E$250,ROWS($F$2:F42)),$E$2:$E$250,0)))","v":""},{"$f":"IF(OR(C42=\"\",D42=\"\",ROWS($G$2:G42)>$L$2),\"\",IF(OR(C42=\"\",D42=\"\"),\"\",INDEX($D$2:$D$250,MATCH(F42,$C$2:$C$250,0))))","v":""},{"$f":"IF(OR(C42=\"\",D42=\"\",ROWS($H$2:H42)>$L$2),\"\",IF(OR(C42=\"\",D42=\"\"),\"\",SMALL($J$2:$J$250,ROWS($H$2:H42))))","v":""},{"$f":"IF(OR(C42=\"\",D42=\"\",ROWS($F$2:F42)>$L$2),\"\",IF(OR(C42=\"\",D42=\"\"),\"\",OrdeUP100(H42)))","v":""},""]
[null,null,null,null,{"$f":"IF(OR(C43=\"\",D43=\"\"),\"\",RANK(D43,$D$2:$D$250)+(ROWS($A$1:A42)-1)/100)","v":""},{"$f":"IF(OR(C43=\"\",D43=\"\",ROWS($F$2:F43)>$L$2),\"\",INDEX($C$2:$C$250,MATCH(SMALL($E$2:$E$250,ROWS($F$2:F43)),$E$2:$E$250,0)))","v":""},{"$f":"IF(OR(C43=\"\",D43=\"\",ROWS($G$2:G43)>$L$2),\"\",IF(OR(C43=\"\",D43=\"\"),\"\",INDEX($D$2:$D$250,MATCH(F43,$C$2:$C$250,0))))","v":""},{"$f":"IF(OR(C43=\"\",D43=\"\",ROWS($H$2:H43)>$L$2),\"\",IF(OR(C43=\"\",D43=\"\"),\"\",SMALL($J$2:$J$250,ROWS($H$2:H43))))","v":""},{"$f":"IF(OR(C43=\"\",D43=\"\",ROWS($F$2:F43)>$L$2),\"\",IF(OR(C43=\"\",D43=\"\"),\"\",OrdeUP100(H43)))","v":""},""]
[null,null,null,null,{"$f":"IF(OR(C44=\"\",D44=\"\"),\"\",RANK(D44,$D$2:$D$250)+(ROWS($A$1:A43)-1)/100)","v":""},{"$f":"IF(OR(C44=\"\",D44=\"\",ROWS($F$2:F44)>$L$2),\"\",INDEX($C$2:$C$250,MATCH(SMALL($E$2:$E$250,ROWS($F$2:F44)),$E$2:$E$250,0)))","v":""},{"$f":"IF(OR(C44=\"\",D44=\"\",ROWS($G$2:G44)>$L$2),\"\",IF(OR(C44=\"\",D44=\"\"),\"\",INDEX($D$2:$D$250,MATCH(F44,$C$2:$C$250,0))))","v":""},{"$f":"IF(OR(C44=\"\",D44=\"\",ROWS($H$2:H44)>$L$2),\"\",IF(OR(C44=\"\",D44=\"\"),\"\",SMALL($J$2:$J$250,ROWS($H$2:H44))))","v":""},{"$f":"IF(OR(C44=\"\",D44=\"\",ROWS($F$2:F44)>$L$2),\"\",IF(OR(C44=\"\",D44=\"\"),\"\",OrdeUP100(H44)))","v":""},""]
[null,null,null,null,{"$f":"IF(OR(C45=\"\",D45=\"\"),\"\",RANK(D45,$D$2:$D$250)+(ROWS($A$1:A44)-1)/100)","v":""},{"$f":"IF(OR(C45=\"\",D45=\"\",ROWS($F$2:F45)>$L$2),\"\",INDEX($C$2:$C$250,MATCH(SMALL($E$2:$E$250,ROWS($F$2:F45)),$E$2:$E$250,0)))","v":""},{"$f":"IF(OR(C45=\"\",D45=\"\",ROWS($G$2:G45)>$L$2),\"\",IF(OR(C45=\"\",D45=\"\"),\"\",INDEX($D$2:$D$250,MATCH(F45,$C$2:$C$250,0))))","v":""},{"$f":"IF(OR(C45=\"\",D45=\"\",ROWS($H$2:H45)>$L$2),\"\",IF(OR(C45=\"\",D45=\"\"),\"\",SMALL($J$2:$J$250,ROWS($H$2:H45))))","v":""},{"$f":"IF(OR(C45=\"\",D45=\"\",ROWS($F$2:F45)>$L$2),\"\",IF(OR(C45=\"\",D45=\"\"),\"\",OrdeUP100(H45)))","v":""},""]
[null,null,null,null,{"$f":"IF(OR(C46=\"\",D46=\"\"),\"\",RANK(D46,$D$2:$D$250)+(ROWS($A$1:A45)-1)/100)","v":""},{"$f":"IF(OR(C46=\"\",D46=\"\",ROWS($F$2:F46)>$L$2),\"\",INDEX($C$2:$C$250,MATCH(SMALL($E$2:$E$250,ROWS($F$2:F46)),$E$2:$E$250,0)))","v":""},{"$f":"IF(OR(C46=\"\",D46=\"\",ROWS($G$2:G46)>$L$2),\"\",IF(OR(C46=\"\",D46=\"\"),\"\",INDEX($D$2:$D$250,MATCH(F46,$C$2:$C$250,0))))","v":""},{"$f":"IF(OR(C46=\"\",D46=\"\",ROWS($H$2:H46)>$L$2),\"\",IF(OR(C46=\"\",D46=\"\"),\"\",SMALL($J$2:$J$250,ROWS($H$2:H46))))","v":""},{"$f":"IF(OR(C46=\"\",D46=\"\",ROWS($F$2:F46)>$L$2),\"\",IF(OR(C46=\"\",D46=\"\"),\"\",OrdeUP100(H46)))","v":""},""]
[null,null,null,null,{"$f":"IF(OR(C47=\"\",D47=\"\"),\"\",RANK(D47,$D$2:$D$250)+(ROWS($A$1:A46)-1)/100)","v":""},{"$f":"IF(OR(C47=\"\",D47=\"\",ROWS($F$2:F47)>$L$2),\"\",INDEX($C$2:$C$250,MATCH(SMALL($E$2:$E$250,ROWS($F$2:F47)),$E$2:$E$250,0)))","v":""},{"$f":"IF(OR(C47=\"\",D47=\"\",ROWS($G$2:G47)>$L$2),\"\",IF(OR(C47=\"\",D47=\"\"),\"\",INDEX($D$2:$D$250,MATCH(F47,$C$2:$C$250,0))))","v":""},{"$f":"IF(OR(C47=\"\",D47=\"\",ROWS($H$2:H47)>$L$2),\"\",IF(OR(C47=\"\",D47=\"\"),\"\",SMALL($J$2:$J$250,ROWS($H$2:H47))))","v":""},{"$f":"IF(OR(C47=\"\",D47=\"\",ROWS($F$2:F47)>$L$2),\"\",IF(OR(C47=\"\",D47=\"\"),\"\",OrdeUP100(H47)))","v":""},""]
[null,null,null,null,{"$f":"IF(OR(C48=\"\",D48=\"\"),\"\",RANK(D48,$D$2:$D$250)+(ROWS($A$1:A47)-1)/100)","v":""},{"$f":"IF(OR(C48=\"\",D48=\"\",ROWS($F$2:F48)>$L$2),\"\",INDEX($C$2:$C$250,MATCH(SMALL($E$2:$E$250,ROWS($F$2:F48)),$E$2:$E$250,0)))","v":""},{"$f":"IF(OR(C48=\"\",D48=\"\",ROWS($G$2:G48)>$L$2),\"\",IF(OR(C48=\"\",D48=\"\"),\"\",INDEX($D$2:$D$250,MATCH(F48,$C$2:$C$250,0))))","v":""},{"$f":"IF(OR(C48=\"\",D48=\"\",ROWS($H$2:H48)>$L$2),\"\",IF(OR(C48=\"\",D48=\"\"),\"\",SMALL($J$2:$J$250,ROWS($H$2:H48))))","v":""},{"$f":"IF(OR(C48=\"\",D48=\"\",ROWS($F$2:F48)>$L$2),\"\",IF(OR(C48=\"\",D48=\"\"),\"\",OrdeUP100(H48)))","v":""},""]
[null,null,null,null,{"$f":"IF(OR(C49=\"\",D49=\"\"),\"\",RANK(D49,$D$2:$D$250)+(ROWS($A$1:A48)-1)/100)","v":""},{"$f":"IF(OR(C49=\"\",D49=\"\",ROWS($F$2:F49)>$L$2),\"\",INDEX($C$2:$C$250,MATCH(SMALL($E$2:$E$250,ROWS($F$2:F49)),$E$2:$E$250,0)))","v":""},{"$f":"IF(OR(C49=\"\",D49=\"\",ROWS($G$2:G49)>$L$2),\"\",IF(OR(C49=\"\",D49=\"\"),\"\",INDEX($D$2:$D$250,MATCH(F49,$C$2:$C$250,0))))","v":""},{"$f":"IF(OR(C49=\"\",D49=\"\",ROWS($H$2:H49)>$L$2),\"\",IF(OR(C49=\"\",D49=\"\"),\"\",SMALL($J$2:$J$250,ROWS($H$2:H49))))","v":""},{"$f":"IF(OR(C49=\"\",D49=\"\",ROWS($F$2:F49)>$L$2),\"\",IF(OR(C49=\"\",D49=\"\"),\"\",OrdeUP100(H49)))","v":""},""]
[null,null,null,null,{"$f":"IF(OR(C50=\"\",D50=\"\"),\"\",RANK(D50,$D$2:$D$250)+(ROWS($A$1:A49)-1)/100)","v":""},{"$f":"IF(OR(C50=\"\",D50=\"\",ROWS($F$2:F50)>$L$2),\"\",INDEX($C$2:$C$250,MATCH(SMALL($E$2:$E$250,ROWS($F$2:F50)),$E$2:$E$250,0)))","v":""},{"$f":"IF(OR(C50=\"\",D50=\"\",ROWS($G$2:G50)>$L$2),\"\",IF(OR(C50=\"\",D50=\"\"),\"\",INDEX($D$2:$D$250,MATCH(F50,$C$2:$C$250,0))))","v":""},{"$f":"IF(OR(C50=\"\",D50=\"\",ROWS($H$2:H50)>$L$2),\"\",IF(OR(C50=\"\",D50=\"\"),\"\",SMALL($J$2:$J$250,ROWS($H$2:H50))))","v":""},{"$f":"IF(OR(C50=\"\",D50=\"\",ROWS($F$2:F50)>$L$2),\"\",IF(OR(C50=\"\",D50=\"\"),\"\",OrdeUP100(H50)))","v":""},""]
[null,null,null,null,{"$f":"IF(OR(C51=\"\",D51=\"\"),\"\",RANK(D51,$D$2:$D$250)+(ROWS($A$1:A50)-1)/100)","v":""},{"$f":"IF(OR(C51=\"\",D51=\"\",ROWS($F$2:F51)>$L$2),\"\",INDEX($C$2:$C$250,MATCH(SMALL($E$2:$E$250,ROWS($F$2:F51)),$E$2:$E$250,0)))","v":""},{"$f":"IF(OR(C51=\"\",D51=\"\",ROWS($G$2:G51)>$L$2),\"\",IF(OR(C51=\"\",D51=\"\"),\"\",INDEX($D$2:$D$250,MATCH(F51,$C$2:$C$250,0))))","v":""},{"$f":"IF(OR(C51=\"\",D51=\"\",ROWS($H$2:H51)>$L$2),\"\",IF(OR(C51=\"\",D51=\"\"),\"\",SMALL($J$2:$J$250,ROWS($H$2:H51))))","v":""},{"$f":"IF(OR(C51=\"\",D51=\"\",ROWS($F$2:F51)>$L$2),\"\",IF(OR(C51=\"\",D51=\"\"),\"\",OrdeUP100(H51)))","v":""},""]
[null,null,null,null,{"$f":"IF(OR(C52=\"\",D52=\"\"),\"\",RANK(D52,$D$2:$D$250)+(ROWS($A$1:A51)-1)/100)","v":""},{"$f":"IF(OR(C52=\"\",D52=\"\",ROWS($F$2:F52)>$L$2),\"\",INDEX($C$2:$C$250,MATCH(SMALL($E$2:$E$250,ROWS($F$2:F52)),$E$2:$E$250,0)))","v":""},{"$f":"IF(OR(C52=\"\",D52=\"\",ROWS($G$2:G52)>$L$2),\"\",IF(OR(C52=\"\",D52=\"\"),\"\",INDEX($D$2:$D$250,MATCH(F52,$C$2:$C$250,0))))","v":""},{"$f":"IF(OR(C52=\"\",D52=\"\",ROWS($H$2:H52)>$L$2),\"\",IF(OR(C52=\"\",D52=\"\"),\"\",SMALL($J$2:$J$250,ROWS($H$2:H52))))","v":""},{"$f":"IF(OR(C52=\"\",D52=\"\",ROWS($F$2:F52)>$L$2),\"\",IF(OR(C52=\"\",D52=\"\"),\"\",OrdeUP100(H52)))","v":""},""]
[null,null,null,null,{"$f":"IF(OR(C53=\"\",D53=\"\"),\"\",RANK(D53,$D$2:$D$250)+(ROWS($A$1:A52)-1)/100)","v":""},{"$f":"IF(OR(C53=\"\",D53=\"\",ROWS($F$2:F53)>$L$2),\"\",INDEX($C$2:$C$250,MATCH(SMALL($E$2:$E$250,ROWS($F$2:F53)),$E$2:$E$250,0)))","v":""},{"$f":"IF(OR(C53=\"\",D53=\"\",ROWS($G$2:G53)>$L$2),\"\",IF(OR(C53=\"\",D53=\"\"),\"\",INDEX($D$2:$D$250,MATCH(F53,$C$2:$C$250,0))))","v":""},{"$f":"IF(OR(C53=\"\",D53=\"\",ROWS($H$2:H53)>$L$2),\"\",IF(OR(C53=\"\",D53=\"\"),\"\",SMALL($J$2:$J$250,ROWS($H$2:H53))))","v":""},{"$f":"IF(OR(C53=\"\",D53=\"\",ROWS($F$2:F53)>$L$2),\"\",IF(OR(C53=\"\",D53=\"\"),\"\",OrdeUP100(H53)))","v":""},""]
[null,null,null,null,{"$f":"IF(OR(C54=\"\",D54=\"\"),\"\",RANK(D54,$D$2:$D$250)+(ROWS($A$1:A53)-1)/100)","v":""},{"$f":"IF(OR(C54=\"\",D54=\"\",ROWS($F$2:F54)>$L$2),\"\",INDEX($C$2:$C$250,MATCH(SMALL($E$2:$E$250,ROWS($F$2:F54)),$E$2:$E$250,0)))","v":""},{"$f":"IF(OR(C54=\"\",D54=\"\",ROWS($G$2:G54)>$L$2),\"\",IF(OR(C54=\"\",D54=\"\"),\"\",INDEX($D$2:$D$250,MATCH(F54,$C$2:$C$250,0))))","v":""},{"$f":"IF(OR(C54=\"\",D54=\"\",ROWS($H$2:H54)>$L$2),\"\",IF(OR(C54=\"\",D54=\"\"),\"\",SMALL($J$2:$J$250,ROWS($H$2:H54))))","v":""},{"$f":"IF(OR(C54=\"\",D54=\"\",ROWS($F$2:F54)>$L$2),\"\",IF(OR(C54=\"\",D54=\"\"),\"\",OrdeUP100(H54)))","v":""},""]
[null,null,null,null,{"$f":"IF(OR(C55=\"\",D55=\"\"),\"\",RANK(D55,$D$2:$D$250)+(ROWS($A$1:A54)-1)/100)","v":""},{"$f":"IF(OR(C55=\"\",D55=\"\",ROWS($F$2:F55)>$L$2),\"\",INDEX($C$2:$C$250,MATCH(SMALL($E$2:$E$250,ROWS($F$2:F55)),$E$2:$E$250,0)))","v":""},{"$f":"IF(OR(C55=\"\",D55=\"\",ROWS($G$2:G55)>$L$2),\"\",IF(OR(C55=\"\",D55=\"\"),\"\",INDEX($D$2:$D$250,MATCH(F55,$C$2:$C$250,0))))","v":""},{"$f":"IF(OR(C55=\"\",D55=\"\",ROWS($H$2:H55)>$L$2),\"\",IF(OR(C55=\"\",D55=\"\"),\"\",SMALL($J$2:$J$250,ROWS($H$2:H55))))","v":""},{"$f":"IF(OR(C55=\"\",D55=\"\",ROWS($F$2:F55)>$L$2),\"\",IF(OR(C55=\"\",D55=\"\"),\"\",OrdeUP100(H55)))","v":""},""]
[null,null,null,null,{"$f":"IF(OR(C56=\"\",D56=\"\"),\"\",RANK(D56,$D$2:$D$250)+(ROWS($A$1:A55)-1)/100)","v":""},{"$f":"IF(OR(C56=\"\",D56=\"\",ROWS($F$2:F56)>$L$2),\"\",INDEX($C$2:$C$250,MATCH(SMALL($E$2:$E$250,ROWS($F$2:F56)),$E$2:$E$250,0)))","v":""},{"$f":"IF(OR(C56=\"\",D56=\"\",ROWS($G$2:G56)>$L$2),\"\",IF(OR(C56=\"\",D56=\"\"),\"\",INDEX($D$2:$D$250,MATCH(F56,$C$2:$C$250,0))))","v":""},{"$f":"IF(OR(C56=\"\",D56=\"\",ROWS($H$2:H56)>$L$2),\"\",IF(OR(C56=\"\",D56=\"\"),\"\",SMALL($J$2:$J$250,ROWS($H$2:H56))))","v":""},{"$f":"IF(OR(C56=\"\",D56=\"\",ROWS($F$2:F56)>$L$2),\"\",IF(OR(C56=\"\",D56=\"\"),\"\",OrdeUP100(H56)))","v":""},""]
[null,null,null,null,{"$f":"IF(OR(C57=\"\",D57=\"\"),\"\",RANK(D57,$D$2:$D$250)+(ROWS($A$1:A56)-1)/100)","v":""},{"$f":"IF(OR(C57=\"\",D57=\"\",ROWS($F$2:F57)>$L$2),\"\",INDEX($C$2:$C$250,MATCH(SMALL($E$2:$E$250,ROWS($F$2:F57)),$E$2:$E$250,0)))","v":""},{"$f":"IF(OR(C57=\"\",D57=\"\",ROWS($G$2:G57)>$L$2),\"\",IF(OR(C57=\"\",D57=\"\"),\"\",INDEX($D$2:$D$250,MATCH(F57,$C$2:$C$250,0))))","v":""},{"$f":"IF(OR(C57=\"\",D57=\"\",ROWS($H$2:H57)>$L$2),\"\",IF(OR(C57=\"\",D57=\"\"),\"\",SMALL($J$2:$J$250,ROWS($H$2:H57))))","v":""},{"$f":"IF(OR(C57=\"\",D57=\"\",ROWS($F$2:F57)>$L$2),\"\",IF(OR(C57=\"\",D57=\"\"),\"\",OrdeUP100(H57)))","v":""},""]
[null,null,null,null,{"$f":"IF(OR(C58=\"\",D58=\"\"),\"\",RANK(D58,$D$2:$D$250)+(ROWS($A$1:A57)-1)/100)","v":""},{"$f":"IF(OR(C58=\"\",D58=\"\",ROWS($F$2:F58)>$L$2),\"\",INDEX($C$2:$C$250,MATCH(SMALL($E$2:$E$250,ROWS($F$2:F58)),$E$2:$E$250,0)))","v":""},{"$f":"IF(OR(C58=\"\",D58=\"\",ROWS($G$2:G58)>$L$2),\"\",IF(OR(C58=\"\",D58=\"\"),\"\",INDEX($D$2:$D$250,MATCH(F58,$C$2:$C$250,0))))","v":""},{"$f":"IF(OR(C58=\"\",D58=\"\",ROWS($H$2:H58)>$L$2),\"\",IF(OR(C58=\"\",D58=\"\"),\"\",SMALL($J$2:$J$250,ROWS($H$2:H58))))","v":""},{"$f":"IF(OR(C58=\"\",D58=\"\",ROWS($F$2:F58)>$L$2),\"\",IF(OR(C58=\"\",D58=\"\"),\"\",OrdeUP100(H58)))","v":""},""]
[null,null,null,null,{"$f":"IF(OR(C59=\"\",D59=\"\"),\"\",RANK(D59,$D$2:$D$250)+(ROWS($A$1:A58)-1)/100)","v":""},{"$f":"IF(OR(C59=\"\",D59=\"\",ROWS($F$2:F59)>$L$2),\"\",INDEX($C$2:$C$250,MATCH(SMALL($E$2:$E$250,ROWS($F$2:F59)),$E$2:$E$250,0)))","v":""},{"$f":"IF(OR(C59=\"\",D59=\"\",ROWS($G$2:G59)>$L$2),\"\",IF(OR(C59=\"\",D59=\"\"),\"\",INDEX($D$2:$D$250,MATCH(F59,$C$2:$C$250,0))))","v":""},{"$f":"IF(OR(C59=\"\",D59=\"\",ROWS($H$2:H59)>$L$2),\"\",IF(OR(C59=\"\",D59=\"\"),\"\",SMALL($J$2:$J$250,ROWS($H$2:H59))))","v":""},{"$f":"IF(OR(C59=\"\",D59=\"\",ROWS($F$2:F59)>$L$2),\"\",IF(OR(C59=\"\",D59=\"\"),\"\",OrdeUP100(H59)))","v":""},""]
[null,null,null,null,{"$f":"IF(OR(C60=\"\",D60=\"\"),\"\",RANK(D60,$D$2:$D$250)+(ROWS($A$1:A59)-1)/100)","v":""},{"$f":"IF(OR(C60=\"\",D60=\"\",ROWS($F$2:F60)>$L$2),\"\",INDEX($C$2:$C$250,MATCH(SMALL($E$2:$E$250,ROWS($F$2:F60)),$E$2:$E$250,0)))","v":""},{"$f":"IF(OR(C60=\"\",D60=\"\",ROWS($G$2:G60)>$L$2),\"\",IF(OR(C60=\"\",D60=\"\"),\"\",INDEX($D$2:$D$250,MATCH(F60,$C$2:$C$250,0))))","v":""},{"$f":"IF(OR(C60=\"\",D60=\"\",ROWS($H$2:H60)>$L$2),\"\",IF(OR(C60=\"\",D60=\"\"),\"\",SMALL($J$2:$J$250,ROWS($H$2:H60))))","v":""},{"$f":"IF(OR(C60=\"\",D60=\"\",ROWS($F$2:F60)>$L$2),\"\",IF(OR(C60=\"\",D60=\"\"),\"\",OrdeUP100(H60)))","v":""},""]
[null,null,null,null,{"$f":"IF(OR(C61=\"\",D61=\"\"),\"\",RANK(D61,$D$2:$D$250)+(ROWS($A$1:A60)-1)/100)","v":""},{"$f":"IF(OR(C61=\"\",D61=\"\",ROWS($F$2:F61)>$L$2),\"\",INDEX($C$2:$C$250,MATCH(SMALL($E$2:$E$250,ROWS($F$2:F61)),$E$2:$E$250,0)))","v":""},{"$f":"IF(OR(C61=\"\",D61=\"\",ROWS($G$2:G61)>$L$2),\"\",IF(OR(C61=\"\",D61=\"\"),\"\",INDEX($D$2:$D$250,MATCH(F61,$C$2:$C$250,0))))","v":""},{"$f":"IF(OR(C61=\"\",D61=\"\",ROWS($H$2:H61)>$L$2),\"\",IF(OR(C61=\"\",D61=\"\"),\"\",SMALL($J$2:$J$250,ROWS($H$2:H61))))","v":""},{"$f":"IF(OR(C61=\"\",D61=\"\",ROWS($F$2:F61)>$L$2),\"\",IF(OR(C61=\"\",D61=\"\"),\"\",OrdeUP100(H61)))","v":""},""]
[null,null,null,null,{"$f":"IF(OR(C62=\"\",D62=\"\"),\"\",RANK(D62,$D$2:$D$250)+(ROWS($A$1:A61)-1)/100)","v":""},{"$f":"IF(OR(C62=\"\",D62=\"\",ROWS($F$2:F62)>$L$2),\"\",INDEX($C$2:$C$250,MATCH(SMALL($E$2:$E$250,ROWS($F$2:F62)),$E$2:$E$250,0)))","v":""},{"$f":"IF(OR(C62=\"\",D62=\"\",ROWS($G$2:G62)>$L$2),\"\",IF(OR(C62=\"\",D62=\"\"),\"\",INDEX($D$2:$D$250,MATCH(F62,$C$2:$C$250,0))))","v":""},{"$f":"IF(OR(C62=\"\",D62=\"\",ROWS($H$2:H62)>$L$2),\"\",IF(OR(C62=\"\",D62=\"\"),\"\",SMALL($J$2:$J$250,ROWS($H$2:H62))))","v":""},{"$f":"IF(OR(C62=\"\",D62=\"\",ROWS($F$2:F62)>$L$2),\"\",IF(OR(C62=\"\",D62=\"\"),\"\",OrdeUP100(H62)))","v":""},""]
[null,null,null,null,{"$f":"IF(OR(C63=\"\",D63=\"\"),\"\",RANK(D63,$D$2:$D$250)+(ROWS($A$1:A62)-1)/100)","v":""},{"$f":"IF(OR(C63=\"\",D63=\"\",ROWS($F$2:F63)>$L$2),\"\",INDEX($C$2:$C$250,MATCH(SMALL($E$2:$E$250,ROWS($F$2:F63)),$E$2:$E$250,0)))","v":""},{"$f":"IF(OR(C63=\"\",D63=\"\",ROWS($G$2:G63)>$L$2),\"\",IF(OR(C63=\"\",D63=\"\"),\"\",INDEX($D$2:$D$250,MATCH(F63,$C$2:$C$250,0))))","v":""},{"$f":"IF(OR(C63=\"\",D63=\"\",ROWS($H$2:H63)>$L$2),\"\",IF(OR(C63=\"\",D63=\"\"),\"\",SMALL($J$2:$J$250,ROWS($H$2:H63))))","v":""},{"$f":"IF(OR(C63=\"\",D63=\"\",ROWS($F$2:F63)>$L$2),\"\",IF(OR(C63=\"\",D63=\"\"),\"\",OrdeUP100(H63)))","v":""},""]
[null,null,null,null,{"$f":"IF(OR(C64=\"\",D64=\"\"),\"\",RANK(D64,$D$2:$D$250)+(ROWS($A$1:A63)-1)/100)","v":""},{"$f":"IF(OR(C64=\"\",D64=\"\",ROWS($F$2:F64)>$L$2),\"\",INDEX($C$2:$C$250,MATCH(SMALL($E$2:$E$250,ROWS($F$2:F64)),$E$2:$E$250,0)))","v":""},{"$f":"IF(OR(C64=\"\",D64=\"\",ROWS($G$2:G64)>$L$2),\"\",IF(OR(C64=\"\",D64=\"\"),\"\",INDEX($D$2:$D$250,MATCH(F64,$C$2:$C$250,0))))","v":""},{"$f":"IF(OR(C64=\"\",D64=\"\",ROWS($H$2:H64)>$L$2),\"\",IF(OR(C64=\"\",D64=\"\"),\"\",SMALL($J$2:$J$250,ROWS($H$2:H64))))","v":""},{"$f":"IF(OR(C64=\"\",D64=\"\",ROWS($F$2:F64)>$L$2),\"\",IF(OR(C64=\"\",D64=\"\"),\"\",OrdeUP100(H64)))","v":""},""]
[null,null,null,null,{"$f":"IF(OR(C65=\"\",D65=\"\"),\"\",RANK(D65,$D$2:$D$250)+(ROWS($A$1:A64)-1)/100)","v":""},{"$f":"IF(OR(C65=\"\",D65=\"\",ROWS($F$2:F65)>$L$2),\"\",INDEX($C$2:$C$250,MATCH(SMALL($E$2:$E$250,ROWS($F$2:F65)),$E$2:$E$250,0)))","v":""},{"$f":"IF(OR(C65=\"\",D65=\"\",ROWS($G$2:G65)>$L$2),\"\",IF(OR(C65=\"\",D65=\"\"),\"\",INDEX($D$2:$D$250,MATCH(F65,$C$2:$C$250,0))))","v":""},{"$f":"IF(OR(C65=\"\",D65=\"\",ROWS($H$2:H65)>$L$2),\"\",IF(OR(C65=\"\",D65=\"\"),\"\",SMALL($J$2:$J$250,ROWS($H$2:H65))))","v":""},{"$f":"IF(OR(C65=\"\",D65=\"\",ROWS($F$2:F65)>$L$2),\"\",IF(OR(C65=\"\",D65=\"\"),\"\",OrdeUP100(H65)))","v":""},""]
[null,null,null,null,{"$f":"IF(OR(C66=\"\",D66=\"\"),\"\",RANK(D66,$D$2:$D$250)+(ROWS($A$1:A65)-1)/100)","v":""},{"$f":"IF(OR(C66=\"\",D66=\"\",ROWS($F$2:F66)>$L$2),\"\",INDEX($C$2:$C$250,MATCH(SMALL($E$2:$E$250,ROWS($F$2:F66)),$E$2:$E$250,0)))","v":""},{"$f":"IF(OR(C66=\"\",D66=\"\",ROWS($G$2:G66)>$L$2),\"\",IF(OR(C66=\"\",D66=\"\"),\"\",INDEX($D$2:$D$250,MATCH(F66,$C$2:$C$250,0))))","v":""},{"$f":"IF(OR(C66=\"\",D66=\"\",ROWS($H$2:H66)>$L$2),\"\",IF(OR(C66=\"\",D66=\"\"),\"\",SMALL($J$2:$J$250,ROWS($H$2:H66))))","v":""},{"$f":"IF(OR(C66=\"\",D66=\"\",ROWS($F$2:F66)>$L$2),\"\",IF(OR(C66=\"\",D66=\"\"),\"\",OrdeUP100(H66)))","v":""},""]
[null,null,null,null,{"$f":"IF(OR(C67=\"\",D67=\"\"),\"\",RANK(D67,$D$2:$D$250)+(ROWS($A$1:A66)-1)/100)","v":""},{"$f":"IF(OR(C67=\"\",D67=\"\",ROWS($F$2:F67)>$L$2),\"\",INDEX($C$2:$C$250,MATCH(SMALL($E$2:$E$250,ROWS($F$2:F67)),$E$2:$E$250,0)))","v":""},{"$f":"IF(OR(C67=\"\",D67=\"\",ROWS($G$2:G67)>$L$2),\"\",IF(OR(C67=\"\",D67=\"\"),\"\",INDEX($D$2:$D$250,MATCH(F67,$C$2:$C$250,0))))","v":""},{"$f":"IF(OR(C67=\"\",D67=\"\",ROWS($H$2:H67)>$L$2),\"\",IF(OR(C67=\"\",D67=\"\"),\"\",SMALL($J$2:$J$250,ROWS($H$2:H67))))","v":""},{"$f":"IF(OR(C67=\"\",D67=\"\",ROWS($F$2:F67)>$L$2),\"\",IF(OR(C67=\"\",D67=\"\"),\"\",OrdeUP100(H67)))","v":""},{"$f":"IF(OR(C67=\"\",D67=\"\"),\"\",RANK(D67,$D$2:$D$250))","v":""}]
[null,null,null,null,{"$f":"IF(OR(C68=\"\",D68=\"\"),\"\",RANK(D68,$D$2:$D$250)+(ROWS($A$1:A67)-1)/100)","v":""},{"$f":"IF(OR(C68=\"\",D68=\"\",ROWS($F$2:F68)>$L$2),\"\",INDEX($C$2:$C$250,MATCH(SMALL($E$2:$E$250,ROWS($F$2:F68)),$E$2:$E$250,0)))","v":""},{"$f":"IF(OR(C68=\"\",D68=\"\",ROWS($G$2:G68)>$L$2),\"\",IF(OR(C68=\"\",D68=\"\"),\"\",INDEX($D$2:$D$250,MATCH(F68,$C$2:$C$250,0))))","v":""},{"$f":"IF(OR(C68=\"\",D68=\"\",ROWS($H$2:H68)>$L$2),\"\",IF(OR(C68=\"\",D68=\"\"),\"\",SMALL($J$2:$J$250,ROWS($H$2:H68))))","v":""},{"$f":"IF(OR(C68=\"\",D68=\"\",ROWS($F$2:F68)>$L$2),\"\",IF(OR(C68=\"\",D68=\"\"),\"\",OrdeUP100(H68)))","v":""},""]
[null,null,null,null,{"$f":"IF(OR(C69=\"\",D69=\"\"),\"\",RANK(D69,$D$2:$D$250)+(ROWS($A$1:A68)-1)/100)","v":""},{"$f":"IF(OR(C69=\"\",D69=\"\",ROWS($F$2:F69)>$L$2),\"\",INDEX($C$2:$C$250,MATCH(SMALL($E$2:$E$250,ROWS($F$2:F69)),$E$2:$E$250,0)))","v":""},{"$f":"IF(OR(C69=\"\",D69=\"\",ROWS($G$2:G69)>$L$2),\"\",IF(OR(C69=\"\",D69=\"\"),\"\",INDEX($D$2:$D$250,MATCH(F69,$C$2:$C$250,0))))","v":""},{"$f":"IF(OR(C69=\"\",D69=\"\",ROWS($H$2:H69)>$L$2),\"\",IF(OR(C69=\"\",D69=\"\"),\"\",SMALL($J$2:$J$250,ROWS($H$2:H69))))","v":""},{"$f":"IF(OR(C69=\"\",D69=\"\",ROWS($F$2:F69)>$L$2),\"\",IF(OR(C69=\"\",D69=\"\"),\"\",OrdeUP100(H69)))","v":""},""]
[null,null,null,null,{"$f":"IF(OR(C70=\"\",D70=\"\"),\"\",RANK(D70,$D$2:$D$250)+(ROWS($A$1:A69)-1)/100)","v":""},{"$f":"IF(OR(C70=\"\",D70=\"\",ROWS($F$2:F70)>$L$2),\"\",INDEX($C$2:$C$250,MATCH(SMALL($E$2:$E$250,ROWS($F$2:F70)),$E$2:$E$250,0)))","v":""},{"$f":"IF(OR(C70=\"\",D70=\"\",ROWS($G$2:G70)>$L$2),\"\",IF(OR(C70=\"\",D70=\"\"),\"\",INDEX($D$2:$D$250,MATCH(F70,$C$2:$C$250,0))))","v":""},{"$f":"IF(OR(C70=\"\",D70=\"\",ROWS($H$2:H70)>$L$2),\"\",IF(OR(C70=\"\",D70=\"\"),\"\",SMALL($J$2:$J$250,ROWS($H$2:H70))))","v":""},{"$f":"IF(OR(C70=\"\",D70=\"\",ROWS($F$2:F70)>$L$2),\"\",IF(OR(C70=\"\",D70=\"\"),\"\",OrdeUP100(H70)))","v":""},""]
[null,null,null,null,{"$f":"IF(OR(C71=\"\",D71=\"\"),\"\",RANK(D71,$D$2:$D$250)+(ROWS($A$1:A70)-1)/100)","v":""},{"$f":"IF(OR(C71=\"\",D71=\"\",ROWS($F$2:F71)>$L$2),\"\",INDEX($C$2:$C$250,MATCH(SMALL($E$2:$E$250,ROWS($F$2:F71)),$E$2:$E$250,0)))","v":""},{"$f":"IF(OR(C71=\"\",D71=\"\",ROWS($G$2:G71)>$L$2),\"\",IF(OR(C71=\"\",D71=\"\"),\"\",INDEX($D$2:$D$250,MATCH(F71,$C$2:$C$250,0))))","v":""},{"$f":"IF(OR(C71=\"\",D71=\"\",ROWS($H$2:H71)>$L$2),\"\",IF(OR(C71=\"\",D71=\"\"),\"\",SMALL($J$2:$J$250,ROWS($H$2:H71))))","v":""},{"$f":"IF(OR(C71=\"\",D71=\"\",ROWS($F$2:F71)>$L$2),\"\",IF(OR(C71=\"\",D71=\"\"),\"\",OrdeUP100(H71)))","v":""},""]
[null,null,null,null,{"$f":"IF(OR(C72=\"\",D72=\"\"),\"\",RANK(D72,$D$2:$D$250)+(ROWS($A$1:A71)-1)/100)","v":""},{"$f":"IF(OR(C72=\"\",D72=\"\",ROWS($F$2:F72)>$L$2),\"\",INDEX($C$2:$C$250,MATCH(SMALL($E$2:$E$250,ROWS($F$2:F72)),$E$2:$E$250,0)))","v":""},{"$f":"IF(OR(C72=\"\",D72=\"\",ROWS($G$2:G72)>$L$2),\"\",IF(OR(C72=\"\",D72=\"\"),\"\",INDEX($D$2:$D$250,MATCH(F72,$C$2:$C$250,0))))","v":""},{"$f":"IF(OR(C72=\"\",D72=\"\",ROWS($H$2:H72)>$L$2),\"\",IF(OR(C72=\"\",D72=\"\"),\"\",SMALL($J$2:$J$250,ROWS($H$2:H72))))","v":""},{"$f":"IF(OR(C72=\"\",D72=\"\",ROWS($F$2:F72)>$L$2),\"\",IF(OR(C72=\"\",D72=\"\"),\"\",OrdeUP100(H72)))","v":""},""]
[null,null,null,null,{"$f":"IF(OR(C73=\"\",D73=\"\"),\"\",RANK(D73,$D$2:$D$250)+(ROWS($A$1:A72)-1)/100)","v":""},{"$f":"IF(OR(C73=\"\",D73=\"\",ROWS($F$2:F73)>$L$2),\"\",INDEX($C$2:$C$250,MATCH(SMALL($E$2:$E$250,ROWS($F$2:F73)),$E$2:$E$250,0)))","v":""},{"$f":"IF(OR(C73=\"\",D73=\"\",ROWS($G$2:G73)>$L$2),\"\",IF(OR(C73=\"\",D73=\"\"),\"\",INDEX($D$2:$D$250,MATCH(F73,$C$2:$C$250,0))))","v":""},{"$f":"IF(OR(C73=\"\",D73=\"\",ROWS($H$2:H73)>$L$2),\"\",IF(OR(C73=\"\",D73=\"\"),\"\",SMALL($J$2:$J$250,ROWS($H$2:H73))))","v":""},{"$f":"IF(OR(C73=\"\",D73=\"\",ROWS($F$2:F73)>$L$2),\"\",IF(OR(C73=\"\",D73=\"\"),\"\",OrdeUP100(H73)))","v":""},""]
[null,null,null,null,{"$f":"IF(OR(C74=\"\",D74=\"\"),\"\",RANK(D74,$D$2:$D$250)+(ROWS($A$1:A73)-1)/100)","v":""},{"$f":"IF(OR(C74=\"\",D74=\"\",ROWS($F$2:F74)>$L$2),\"\",INDEX($C$2:$C$250,MATCH(SMALL($E$2:$E$250,ROWS($F$2:F74)),$E$2:$E$250,0)))","v":""},{"$f":"IF(OR(C74=\"\",D74=\"\",ROWS($G$2:G74)>$L$2),\"\",IF(OR(C74=\"\",D74=\"\"),\"\",INDEX($D$2:$D$250,MATCH(F74,$C$2:$C$250,0))))","v":""},{"$f":"IF(OR(C74=\"\",D74=\"\",ROWS($H$2:H74)>$L$2),\"\",IF(OR(C74=\"\",D74=\"\"),\"\",SMALL($J$2:$J$250,ROWS($H$2:H74))))","v":""},{"$f":"IF(OR(C74=\"\",D74=\"\",ROWS($F$2:F74)>$L$2),\"\",IF(OR(C74=\"\",D74=\"\"),\"\",OrdeUP100(H74)))","v":""},""]
[null,null,null,null,{"$f":"IF(OR(C75=\"\",D75=\"\"),\"\",RANK(D75,$D$2:$D$250)+(ROWS($A$1:A74)-1)/100)","v":""},{"$f":"IF(OR(C75=\"\",D75=\"\",ROWS($F$2:F75)>$L$2),\"\",INDEX($C$2:$C$250,MATCH(SMALL($E$2:$E$250,ROWS($F$2:F75)),$E$2:$E$250,0)))","v":""},{"$f":"IF(OR(C75=\"\",D75=\"\",ROWS($G$2:G75)>$L$2),\"\",IF(OR(C75=\"\",D75=\"\"),\"\",INDEX($D$2:$D$250,MATCH(F75,$C$2:$C$250,0))))","v":""},{"$f":"IF(OR(C75=\"\",D75=\"\",ROWS($H$2:H75)>$L$2),\"\",IF(OR(C75=\"\",D75=\"\"),\"\",SMALL($J$2:$J$250,ROWS($H$2:H75))))","v":""},{"$f":"IF(OR(C75=\"\",D75=\"\",ROWS($F$2:F75)>$L$2),\"\",IF(OR(C75=\"\",D75=\"\"),\"\",OrdeUP100(H75)))","v":""},""]
[null,null,null,null,{"$f":"IF(OR(C76=\"\",D76=\"\"),\"\",RANK(D76,$D$2:$D$250)+(ROWS($A$1:A75)-1)/100)","v":""},{"$f":"IF(OR(C76=\"\",D76=\"\",ROWS($F$2:F76)>$L$2),\"\",INDEX($C$2:$C$250,MATCH(SMALL($E$2:$E$250,ROWS($F$2:F76)),$E$2:$E$250,0)))","v":""},{"$f":"IF(OR(C76=\"\",D76=\"\",ROWS($G$2:G76)>$L$2),\"\",IF(OR(C76=\"\",D76=\"\"),\"\",INDEX($D$2:$D$250,MATCH(F76,$C$2:$C$250,0))))","v":""},{"$f":"IF(OR(C76=\"\",D76=\"\",ROWS($H$2:H76)>$L$2),\"\",IF(OR(C76=\"\",D76=\"\"),\"\",SMALL($J$2:$J$250,ROWS($H$2:H76))))","v":""},{"$f":"IF(OR(C76=\"\",D76=\"\",ROWS($F$2:F76)>$L$2),\"\",IF(OR(C76=\"\",D76=\"\"),\"\",OrdeUP100(H76)))","v":""},""]
[null,null,null,null,{"$f":"IF(OR(C77=\"\",D77=\"\"),\"\",RANK(D77,$D$2:$D$250)+(ROWS($A$1:A76)-1)/100)","v":""},{"$f":"IF(OR(C77=\"\",D77=\"\",ROWS($F$2:F77)>$L$2),\"\",INDEX($C$2:$C$250,MATCH(SMALL($E$2:$E$250,ROWS($F$2:F77)),$E$2:$E$250,0)))","v":""},{"$f":"IF(OR(C77=\"\",D77=\"\",ROWS($G$2:G77)>$L$2),\"\",IF(OR(C77=\"\",D77=\"\"),\"\",INDEX($D$2:$D$250,MATCH(F77,$C$2:$C$250,0))))","v":""},{"$f":"IF(OR(C77=\"\",D77=\"\",ROWS($H$2:H77)>$L$2),\"\",IF(OR(C77=\"\",D77=\"\"),\"\",SMALL($J$2:$J$250,ROWS($H$2:H77))))","v":""},{"$f":"IF(OR(C77=\"\",D77=\"\",ROWS($F$2:F77)>$L$2),\"\",IF(OR(C77=\"\",D77=\"\"),\"\",OrdeUP100(H77)))","v":""},""]
[null,null,null,null,{"$f":"IF(OR(C78=\"\",D78=\"\"),\"\",RANK(D78,$D$2:$D$250)+(ROWS($A$1:A77)-1)/100)","v":""},{"$f":"IF(OR(C78=\"\",D78=\"\",ROWS($F$2:F78)>$L$2),\"\",INDEX($C$2:$C$250,MATCH(SMALL($E$2:$E$250,ROWS($F$2:F78)),$E$2:$E$250,0)))","v":""},{"$f":"IF(OR(C78=\"\",D78=\"\",ROWS($G$2:G78)>$L$2),\"\",IF(OR(C78=\"\",D78=\"\"),\"\",INDEX($D$2:$D$250,MATCH(F78,$C$2:$C$250,0))))","v":""},{"$f":"IF(OR(C78=\"\",D78=\"\",ROWS($H$2:H78)>$L$2),\"\",IF(OR(C78=\"\",D78=\"\"),\"\",SMALL($J$2:$J$250,ROWS($H$2:H78))))","v":""},{"$f":"IF(OR(C78=\"\",D78=\"\",ROWS($F$2:F78)>$L$2),\"\",IF(OR(C78=\"\",D78=\"\"),\"\",OrdeUP100(H78)))","v":""},""]
[null,null,null,null,{"$f":"IF(OR(C79=\"\",D79=\"\"),\"\",RANK(D79,$D$2:$D$250)+(ROWS($A$1:A78)-1)/100)","v":""},{"$f":"IF(OR(C79=\"\",D79=\"\",ROWS($F$2:F79)>$L$2),\"\",INDEX($C$2:$C$250,MATCH(SMALL($E$2:$E$250,ROWS($F$2:F79)),$E$2:$E$250,0)))","v":""},{"$f":"IF(OR(C79=\"\",D79=\"\",ROWS($G$2:G79)>$L$2),\"\",IF(OR(C79=\"\",D79=\"\"),\"\",INDEX($D$2:$D$250,MATCH(F79,$C$2:$C$250,0))))","v":""},{"$f":"IF(OR(C79=\"\",D79=\"\",ROWS($H$2:H79)>$L$2),\"\",IF(OR(C79=\"\",D79=\"\"),\"\",SMALL($J$2:$J$250,ROWS($H$2:H79))))","v":""},{"$f":"IF(OR(C79=\"\",D79=\"\",ROWS($F$2:F79)>$L$2),\"\",IF(OR(C79=\"\",D79=\"\"),\"\",OrdeUP100(H79)))","v":""},""]
[null,null,null,null,{"$f":"IF(OR(C80=\"\",D80=\"\"),\"\",RANK(D80,$D$2:$D$250)+(ROWS($A$1:A79)-1)/100)","v":""},{"$f":"IF(OR(C80=\"\",D80=\"\",ROWS($F$2:F80)>$L$2),\"\",INDEX($C$2:$C$250,MATCH(SMALL($E$2:$E$250,ROWS($F$2:F80)),$E$2:$E$250,0)))","v":""},{"$f":"IF(OR(C80=\"\",D80=\"\",ROWS($G$2:G80)>$L$2),\"\",IF(OR(C80=\"\",D80=\"\"),\"\",INDEX($D$2:$D$250,MATCH(F80,$C$2:$C$250,0))))","v":""},{"$f":"IF(OR(C80=\"\",D80=\"\",ROWS($H$2:H80)>$L$2),\"\",IF(OR(C80=\"\",D80=\"\"),\"\",SMALL($J$2:$J$250,ROWS($H$2:H80))))","v":""},{"$f":"IF(OR(C80=\"\",D80=\"\",ROWS($F$2:F80)>$L$2),\"\",IF(OR(C80=\"\",D80=\"\"),\"\",OrdeUP100(H80)))","v":""},""]
[null,null,null,null,{"$f":"IF(OR(C81=\"\",D81=\"\"),\"\",RANK(D81,$D$2:$D$250)+(ROWS($A$1:A80)-1)/100)","v":""},{"$f":"IF(OR(C81=\"\",D81=\"\",ROWS($F$2:F81)>$L$2),\"\",INDEX($C$2:$C$250,MATCH(SMALL($E$2:$E$250,ROWS($F$2:F81)),$E$2:$E$250,0)))","v":""},{"$f":"IF(OR(C81=\"\",D81=\"\",ROWS($G$2:G81)>$L$2),\"\",IF(OR(C81=\"\",D81=\"\"),\"\",INDEX($D$2:$D$250,MATCH(F81,$C$2:$C$250,0))))","v":""},{"$f":"IF(OR(C81=\"\",D81=\"\",ROWS($H$2:H81)>$L$2),\"\",IF(OR(C81=\"\",D81=\"\"),\"\",SMALL($J$2:$J$250,ROWS($H$2:H81))))","v":""},{"$f":"IF(OR(C81=\"\",D81=\"\",ROWS($F$2:F81)>$L$2),\"\",IF(OR(C81=\"\",D81=\"\"),\"\",OrdeUP100(H81)))","v":""},""]
[null,null,null,null,{"$f":"IF(OR(C82=\"\",D82=\"\"),\"\",RANK(D82,$D$2:$D$250)+(ROWS($A$1:A81)-1)/100)","v":""},{"$f":"IF(OR(C82=\"\",D82=\"\",ROWS($F$2:F82)>$L$2),\"\",INDEX($C$2:$C$250,MATCH(SMALL($E$2:$E$250,ROWS($F$2:F82)),$E$2:$E$250,0)))","v":""},{"$f":"IF(OR(C82=\"\",D82=\"\",ROWS($G$2:G82)>$L$2),\"\",IF(OR(C82=\"\",D82=\"\"),\"\",INDEX($D$2:$D$250,MATCH(F82,$C$2:$C$250,0))))","v":""},{"$f":"IF(OR(C82=\"\",D82=\"\",ROWS($H$2:H82)>$L$2),\"\",IF(OR(C82=\"\",D82=\"\"),\"\",SMALL($J$2:$J$250,ROWS($H$2:H82))))","v":""},{"$f":"IF(OR(C82=\"\",D82=\"\",ROWS($F$2:F82)>$L$2),\"\",IF(OR(C82=\"\",D82=\"\"),\"\",OrdeUP100(H82)))","v":""},""]
[null,null,null,null,{"$f":"IF(OR(C83=\"\",D83=\"\"),\"\",RANK(D83,$D$2:$D$250)+(ROWS($A$1:A82)-1)/100)","v":""},{"$f":"IF(OR(C83=\"\",D83=\"\",ROWS($F$2:F83)>$L$2),\"\",INDEX($C$2:$C$250,MATCH(SMALL($E$2:$E$250,ROWS($F$2:F83)),$E$2:$E$250,0)))","v":""},{"$f":"IF(OR(C83=\"\",D83=\"\",ROWS($G$2:G83)>$L$2),\"\",IF(OR(C83=\"\",D83=\"\"),\"\",INDEX($D$2:$D$250,MATCH(F83,$C$2:$C$250,0))))","v":""},{"$f":"IF(OR(C83=\"\",D83=\"\",ROWS($H$2:H83)>$L$2),\"\",IF(OR(C83=\"\",D83=\"\"),\"\",SMALL($J$2:$J$250,ROWS($H$2:H83))))","v":""},{"$f":"IF(OR(C83=\"\",D83=\"\",ROWS($F$2:F83)>$L$2),\"\",IF(OR(C83=\"\",D83=\"\"),\"\",OrdeUP100(H83)))","v":""},""]
[null,null,null,null,{"$f":"IF(OR(C84=\"\",D84=\"\"),\"\",RANK(D84,$D$2:$D$250)+(ROWS($A$1:A83)-1)/100)","v":""},{"$f":"IF(OR(C84=\"\",D84=\"\",ROWS($F$2:F84)>$L$2),\"\",INDEX($C$2:$C$250,MATCH(SMALL($E$2:$E$250,ROWS($F$2:F84)),$E$2:$E$250,0)))","v":""},{"$f":"IF(OR(C84=\"\",D84=\"\",ROWS($G$2:G84)>$L$2),\"\",IF(OR(C84=\"\",D84=\"\"),\"\",INDEX($D$2:$D$250,MATCH(F84,$C$2:$C$250,0))))","v":""},{"$f":"IF(OR(C84=\"\",D84=\"\",ROWS($H$2:H84)>$L$2),\"\",IF(OR(C84=\"\",D84=\"\"),\"\",SMALL($J$2:$J$250,ROWS($H$2:H84))))","v":""},{"$f":"IF(OR(C84=\"\",D84=\"\",ROWS($F$2:F84)>$L$2),\"\",IF(OR(C84=\"\",D84=\"\"),\"\",OrdeUP100(H84)))","v":""},""]
[null,null,null,null,{"$f":"IF(OR(C85=\"\",D85=\"\"),\"\",RANK(D85,$D$2:$D$250)+(ROWS($A$1:A84)-1)/100)","v":""},{"$f":"IF(OR(C85=\"\",D85=\"\",ROWS($F$2:F85)>$L$2),\"\",INDEX($C$2:$C$250,MATCH(SMALL($E$2:$E$250,ROWS($F$2:F85)),$E$2:$E$250,0)))","v":""},{"$f":"IF(OR(C85=\"\",D85=\"\",ROWS($G$2:G85)>$L$2),\"\",IF(OR(C85=\"\",D85=\"\"),\"\",INDEX($D$2:$D$250,MATCH(F85,$C$2:$C$250,0))))","v":""},{"$f":"IF(OR(C85=\"\",D85=\"\",ROWS($H$2:H85)>$L$2),\"\",IF(OR(C85=\"\",D85=\"\"),\"\",SMALL($J$2:$J$250,ROWS($H$2:H85))))","v":""},{"$f":"IF(OR(C85=\"\",D85=\"\",ROWS($F$2:F85)>$L$2),\"\",IF(OR(C85=\"\",D85=\"\"),\"\",OrdeUP100(H85)))","v":""},""]
[null,null,null,null,{"$f":"IF(OR(C86=\"\",D86=\"\"),\"\",RANK(D86,$D$2:$D$250)+(ROWS($A$1:A85)-1)/100)","v":""},{"$f":"IF(OR(C86=\"\",D86=\"\",ROWS($F$2:F86)>$L$2),\"\",INDEX($C$2:$C$250,MATCH(SMALL($E$2:$E$250,ROWS($F$2:F86)),$E$2:$E$250,0)))","v":""},{"$f":"IF(OR(C86=\"\",D86=\"\",ROWS($G$2:G86)>$L$2),\"\",IF(OR(C86=\"\",D86=\"\"),\"\",INDEX($D$2:$D$250,MATCH(F86,$C$2:$C$250,0))))","v":""},{"$f":"IF(OR(C86=\"\",D86=\"\",ROWS($H$2:H86)>$L$2),\"\",IF(OR(C86=\"\",D86=\"\"),\"\",SMALL($J$2:$J$250,ROWS($H$2:H86))))","v":""},{"$f":"IF(OR(C86=\"\",D86=\"\",ROWS($F$2:F86)>$L$2),\"\",IF(OR(C86=\"\",D86=\"\"),\"\",OrdeUP100(H86)))","v":""},""]
[null,null,null,null,{"$f":"IF(OR(C87=\"\",D87=\"\"),\"\",RANK(D87,$D$2:$D$250)+(ROWS($A$1:A86)-1)/100)","v":""},{"$f":"IF(OR(C87=\"\",D87=\"\",ROWS($F$2:F87)>$L$2),\"\",INDEX($C$2:$C$250,MATCH(SMALL($E$2:$E$250,ROWS($F$2:F87)),$E$2:$E$250,0)))","v":""},{"$f":"IF(OR(C87=\"\",D87=\"\",ROWS($G$2:G87)>$L$2),\"\",IF(OR(C87=\"\",D87=\"\"),\"\",INDEX($D$2:$D$250,MATCH(F87,$C$2:$C$250,0))))","v":""},{"$f":"IF(OR(C87=\"\",D87=\"\",ROWS($H$2:H87)>$L$2),\"\",IF(OR(C87=\"\",D87=\"\"),\"\",SMALL($J$2:$J$250,ROWS($H$2:H87))))","v":""},{"$f":"IF(OR(C87=\"\",D87=\"\",ROWS($F$2:F87)>$L$2),\"\",IF(OR(C87=\"\",D87=\"\"),\"\",OrdeUP100(H87)))","v":""},""]
[null,null,null,null,{"$f":"IF(OR(C88=\"\",D88=\"\"),\"\",RANK(D88,$D$2:$D$250)+(ROWS($A$1:A87)-1)/100)","v":""},{"$f":"IF(OR(C88=\"\",D88=\"\",ROWS($F$2:F88)>$L$2),\"\",INDEX($C$2:$C$250,MATCH(SMALL($E$2:$E$250,ROWS($F$2:F88)),$E$2:$E$250,0)))","v":""},{"$f":"IF(OR(C88=\"\",D88=\"\",ROWS($G$2:G88)>$L$2),\"\",IF(OR(C88=\"\",D88=\"\"),\"\",INDEX($D$2:$D$250,MATCH(F88,$C$2:$C$250,0))))","v":""},{"$f":"IF(OR(C88=\"\",D88=\"\",ROWS($H$2:H88)>$L$2),\"\",IF(OR(C88=\"\",D88=\"\"),\"\",SMALL($J$2:$J$250,ROWS($H$2:H88))))","v":""},{"$f":"IF(OR(C88=\"\",D88=\"\",ROWS($F$2:F88)>$L$2),\"\",IF(OR(C88=\"\",D88=\"\"),\"\",OrdeUP100(H88)))","v":""},""]
[null,null,null,null,{"$f":"IF(OR(C89=\"\",D89=\"\"),\"\",RANK(D89,$D$2:$D$250)+(ROWS($A$1:A88)-1)/100)","v":""},{"$f":"IF(OR(C89=\"\",D89=\"\",ROWS($F$2:F89)>$L$2),\"\",INDEX($C$2:$C$250,MATCH(SMALL($E$2:$E$250,ROWS($F$2:F89)),$E$2:$E$250,0)))","v":""},{"$f":"IF(OR(C89=\"\",D89=\"\",ROWS($G$2:G89)>$L$2),\"\",IF(OR(C89=\"\",D89=\"\"),\"\",INDEX($D$2:$D$250,MATCH(F89,$C$2:$C$250,0))))","v":""},{"$f":"IF(OR(C89=\"\",D89=\"\",ROWS($H$2:H89)>$L$2),\"\",IF(OR(C89=\"\",D89=\"\"),\"\",SMALL($J$2:$J$250,ROWS($H$2:H89))))","v":""},{"$f":"IF(OR(C89=\"\",D89=\"\",ROWS($F$2:F89)>$L$2),\"\",IF(OR(C89=\"\",D89=\"\"),\"\",OrdeUP100(H89)))","v":""},""]
[null,null,null,null,{"$f":"IF(OR(C90=\"\",D90=\"\"),\"\",RANK(D90,$D$2:$D$250)+(ROWS($A$1:A89)-1)/100)","v":""},{"$f":"IF(OR(C90=\"\",D90=\"\",ROWS($F$2:F90)>$L$2),\"\",INDEX($C$2:$C$250,MATCH(SMALL($E$2:$E$250,ROWS($F$2:F90)),$E$2:$E$250,0)))","v":""},{"$f":"IF(OR(C90=\"\",D90=\"\",ROWS($G$2:G90)>$L$2),\"\",IF(OR(C90=\"\",D90=\"\"),\"\",INDEX($D$2:$D$250,MATCH(F90,$C$2:$C$250,0))))","v":""},{"$f":"IF(OR(C90=\"\",D90=\"\",ROWS($H$2:H90)>$L$2),\"\",IF(OR(C90=\"\",D90=\"\"),\"\",SMALL($J$2:$J$250,ROWS($H$2:H90))))","v":""},{"$f":"IF(OR(C90=\"\",D90=\"\",ROWS($F$2:F90)>$L$2),\"\",IF(OR(C90=\"\",D90=\"\"),\"\",OrdeUP100(H90)))","v":""},""]
[null,null,null,null,{"$f":"IF(OR(C91=\"\",D91=\"\"),\"\",RANK(D91,$D$2:$D$250)+(ROWS($A$1:A90)-1)/100)","v":""},{"$f":"IF(OR(C91=\"\",D91=\"\",ROWS($F$2:F91)>$L$2),\"\",INDEX($C$2:$C$250,MATCH(SMALL($E$2:$E$250,ROWS($F$2:F91)),$E$2:$E$250,0)))","v":""},{"$f":"IF(OR(C91=\"\",D91=\"\",ROWS($G$2:G91)>$L$2),\"\",IF(OR(C91=\"\",D91=\"\"),\"\",INDEX($D$2:$D$250,MATCH(F91,$C$2:$C$250,0))))","v":""},{"$f":"IF(OR(C91=\"\",D91=\"\",ROWS($H$2:H91)>$L$2),\"\",IF(OR(C91=\"\",D91=\"\"),\"\",SMALL($J$2:$J$250,ROWS($H$2:H91))))","v":""},{"$f":"IF(OR(C91=\"\",D91=\"\",ROWS($F$2:F91)>$L$2),\"\",IF(OR(C91=\"\",D91=\"\"),\"\",OrdeUP100(H91)))","v":""},""]
[null,null,null,null,{"$f":"IF(OR(C92=\"\",D92=\"\"),\"\",RANK(D92,$D$2:$D$250)+(ROWS($A$1:A91)-1)/100)","v":""},{"$f":"IF(OR(C92=\"\",D92=\"\",ROWS($F$2:F92)>$L$2),\"\",INDEX($C$2:$C$250,MATCH(SMALL($E$2:$E$250,ROWS($F$2:F92)),$E$2:$E$250,0)))","v":""},{"$f":"IF(OR(C92=\"\",D92=\"\",ROWS($G$2:G92)>$L$2),\"\",IF(OR(C92=\"\",D92=\"\"),\"\",INDEX($D$2:$D$250,MATCH(F92,$C$2:$C$250,0))))","v":""},{"$f":"IF(OR(C92=\"\",D92=\"\",ROWS($H$2:H92)>$L$2),\"\",IF(OR(C92=\"\",D92=\"\"),\"\",SMALL($J$2:$J$250,ROWS($H$2:H92))))","v":""},{"$f":"IF(OR(C92=\"\",D92=\"\",ROWS($F$2:F92)>$L$2),\"\",IF(OR(C92=\"\",D92=\"\"),\"\",OrdeUP100(H92)))","v":""},""]
[null,null,null,null,{"$f":"IF(OR(C93=\"\",D93=\"\"),\"\",RANK(D93,$D$2:$D$250)+(ROWS($A$1:A92)-1)/100)","v":""},{"$f":"IF(OR(C93=\"\",D93=\"\",ROWS($F$2:F93)>$L$2),\"\",INDEX($C$2:$C$250,MATCH(SMALL($E$2:$E$250,ROWS($F$2:F93)),$E$2:$E$250,0)))","v":""},{"$f":"IF(OR(C93=\"\",D93=\"\",ROWS($G$2:G93)>$L$2),\"\",IF(OR(C93=\"\",D93=\"\"),\"\",INDEX($D$2:$D$250,MATCH(F93,$C$2:$C$250,0))))","v":""},{"$f":"IF(OR(C93=\"\",D93=\"\",ROWS($H$2:H93)>$L$2),\"\",IF(OR(C93=\"\",D93=\"\"),\"\",SMALL($J$2:$J$250,ROWS($H$2:H93))))","v":""},{"$f":"IF(OR(C93=\"\",D93=\"\",ROWS($F$2:F93)>$L$2),\"\",IF(OR(C93=\"\",D93=\"\"),\"\",OrdeUP100(H93)))","v":""},""]
[null,null,null,null,{"$f":"IF(OR(C94=\"\",D94=\"\"),\"\",RANK(D94,$D$2:$D$250)+(ROWS($A$1:A93)-1)/100)","v":""},{"$f":"IF(OR(C94=\"\",D94=\"\",ROWS($F$2:F94)>$L$2),\"\",INDEX($C$2:$C$250,MATCH(SMALL($E$2:$E$250,ROWS($F$2:F94)),$E$2:$E$250,0)))","v":""},{"$f":"IF(OR(C94=\"\",D94=\"\",ROWS($G$2:G94)>$L$2),\"\",IF(OR(C94=\"\",D94=\"\"),\"\",INDEX($D$2:$D$250,MATCH(F94,$C$2:$C$250,0))))","v":""},{"$f":"IF(OR(C94=\"\",D94=\"\",ROWS($H$2:H94)>$L$2),\"\",IF(OR(C94=\"\",D94=\"\"),\"\",SMALL($J$2:$J$250,ROWS($H$2:H94))))","v":""},{"$f":"IF(OR(C94=\"\",D94=\"\",ROWS($F$2:F94)>$L$2),\"\",IF(OR(C94=\"\",D94=\"\"),\"\",OrdeUP100(H94)))","v":""},""]
[null,null,null,null,{"$f":"IF(OR(C95=\"\",D95=\"\"),\"\",RANK(D95,$D$2:$D$250)+(ROWS($A$1:A94)-1)/100)","v":""},{"$f":"IF(OR(C95=\"\",D95=\"\",ROWS($F$2:F95)>$L$2),\"\",INDEX($C$2:$C$250,MATCH(SMALL($E$2:$E$250,ROWS($F$2:F95)),$E$2:$E$250,0)))","v":""},{"$f":"IF(OR(C95=\"\",D95=\"\",ROWS($G$2:G95)>$L$2),\"\",IF(OR(C95=\"\",D95=\"\"),\"\",INDEX($D$2:$D$250,MATCH(F95,$C$2:$C$250,0))))","v":""},{"$f":"IF(OR(C95=\"\",D95=\"\",ROWS($H$2:H95)>$L$2),\"\",IF(OR(C95=\"\",D95=\"\"),\"\",SMALL($J$2:$J$250,ROWS($H$2:H95))))","v":""},{"$f":"IF(OR(C95=\"\",D95=\"\",ROWS($F$2:F95)>$L$2),\"\",IF(OR(C95=\"\",D95=\"\"),\"\",OrdeUP100(H95)))","v":""},""]
[null,null,null,null,{"$f":"IF(OR(C96=\"\",D96=\"\"),\"\",RANK(D96,$D$2:$D$250)+(ROWS($A$1:A95)-1)/100)","v":""},{"$f":"IF(OR(C96=\"\",D96=\"\",ROWS($F$2:F96)>$L$2),\"\",INDEX($C$2:$C$250,MATCH(SMALL($E$2:$E$250,ROWS($F$2:F96)),$E$2:$E$250,0)))","v":""},{"$f":"IF(OR(C96=\"\",D96=\"\",ROWS($G$2:G96)>$L$2),\"\",IF(OR(C96=\"\",D96=\"\"),\"\",INDEX($D$2:$D$250,MATCH(F96,$C$2:$C$250,0))))","v":""},{"$f":"IF(OR(C96=\"\",D96=\"\",ROWS($H$2:H96)>$L$2),\"\",IF(OR(C96=\"\",D96=\"\"),\"\",SMALL($J$2:$J$250,ROWS($H$2:H96))))","v":""},{"$f":"IF(OR(C96=\"\",D96=\"\",ROWS($F$2:F96)>$L$2),\"\",IF(OR(C96=\"\",D96=\"\"),\"\",OrdeUP100(H96)))","v":""},""]
[null,null,null,null,{"$f":"IF(OR(C97=\"\",D97=\"\"),\"\",RANK(D97,$D$2:$D$250)+(ROWS($A$1:A96)-1)/100)","v":""},{"$f":"IF(OR(C97=\"\",D97=\"\",ROWS($F$2:F97)>$L$2),\"\",INDEX($C$2:$C$250,MATCH(SMALL($E$2:$E$250,ROWS($F$2:F97)),$E$2:$E$250,0)))","v":""},{"$f":"IF(OR(C97=\"\",D97=\"\",ROWS($G$2:G97)>$L$2),\"\",IF(OR(C97=\"\",D97=\"\"),\"\",INDEX($D$2:$D$250,MATCH(F97,$C$2:$C$250,0))))","v":""},{"$f":"IF(OR(C97=\"\",D97=\"\",ROWS($H$2:H97)>$L$2),\"\",IF(OR(C97=\"\",D97=\"\"),\"\",SMALL($J$2:$J$250,ROWS($H$2:H97))))","v":""},{"$f":"IF(OR(C97=\"\",D97=\"\",ROWS($F$2:F97)>$L$2),\"\",IF(OR(C97=\"\",D97=\"\"),\"\",OrdeUP100(H97)))","v":""},""]
[null,null,null,null,{"$f":"IF(OR(C98=\"\",D98=\"\"),\"\",RANK(D98,$D$2:$D$250)+(ROWS($A$1:A97)-1)/100)","v":""},{"$f":"IF(OR(C98=\"\",D98=\"\",ROWS($F$2:F98)>$L$2),\"\",INDEX($C$2:$C$250,MATCH(SMALL($E$2:$E$250,ROWS($F$2:F98)),$E$2:$E$250,0)))","v":""},{"$f":"IF(OR(C98=\"\",D98=\"\",ROWS($G$2:G98)>$L$2),\"\",IF(OR(C98=\"\",D98=\"\"),\"\",INDEX($D$2:$D$250,MATCH(F98,$C$2:$C$250,0))))","v":""},{"$f":"IF(OR(C98=\"\",D98=\"\",ROWS($H$2:H98)>$L$2),\"\",IF(OR(C98=\"\",D98=\"\"),\"\",SMALL($J$2:$J$250,ROWS($H$2:H98))))","v":""},{"$f":"IF(OR(C98=\"\",D98=\"\",ROWS($F$2:F98)>$L$2),\"\",IF(OR(C98=\"\",D98=\"\"),\"\",OrdeUP100(H98)))","v":""},""]
[null,null,null,null,{"$f":"IF(OR(C99=\"\",D99=\"\"),\"\",RANK(D99,$D$2:$D$250)+(ROWS($A$1:A98)-1)/100)","v":""},{"$f":"IF(OR(C99=\"\",D99=\"\",ROWS($F$2:F99)>$L$2),\"\",INDEX($C$2:$C$250,MATCH(SMALL($E$2:$E$250,ROWS($F$2:F99)),$E$2:$E$250,0)))","v":""},{"$f":"IF(OR(C99=\"\",D99=\"\",ROWS($G$2:G99)>$L$2),\"\",IF(OR(C99=\"\",D99=\"\"),\"\",INDEX($D$2:$D$250,MATCH(F99,$C$2:$C$250,0))))","v":""},{"$f":"IF(OR(C99=\"\",D99=\"\",ROWS($H$2:H99)>$L$2),\"\",IF(OR(C99=\"\",D99=\"\"),\"\",SMALL($J$2:$J$250,ROWS($H$2:H99))))","v":""},{"$f":"IF(OR(C99=\"\",D99=\"\",ROWS($F$2:F99)>$L$2),\"\",IF(OR(C99=\"\",D99=\"\"),\"\",OrdeUP100(H99)))","v":""},""]
[null,null,null,null,{"$f":"IF(OR(C100=\"\",D100=\"\"),\"\",RANK(D100,$D$2:$D$250)+(ROWS($A$1:A99)-1)/100)","v":""},{"$f":"IF(OR(C100=\"\",D100=\"\",ROWS($F$2:F100)>$L$2),\"\",INDEX($C$2:$C$250,MATCH(SMALL($E$2:$E$250,ROWS($F$2:F100)),$E$2:$E$250,0)))","v":""},{"$f":"IF(OR(C100=\"\",D100=\"\",ROWS($G$2:G100)>$L$2),\"\",IF(OR(C100=\"\",D100=\"\"),\"\",INDEX($D$2:$D$250,MATCH(F100,$C$2:$C$250,0))))","v":""},{"$f":"IF(OR(C100=\"\",D100=\"\",ROWS($H$2:H100)>$L$2),\"\",IF(OR(C100=\"\",D100=\"\"),\"\",SMALL($J$2:$J$250,ROWS($H$2:H100))))","v":""},{"$f":"IF(OR(C100=\"\",D100=\"\",ROWS($F$2:F100)>$L$2),\"\",IF(OR(C100=\"\",D100=\"\"),\"\",OrdeUP100(H100)))","v":""},""]
[null,null,null,null,{"$f":"IF(OR(C101=\"\",D101=\"\"),\"\",RANK(D101,$D$2:$D$250)+(ROWS($A$1:A100)-1)/100)","v":""},{"$f":"IF(OR(C101=\"\",D101=\"\",ROWS($F$2:F101)>$L$2),\"\",INDEX($C$2:$C$250,MATCH(SMALL($E$2:$E$250,ROWS($F$2:F101)),$E$2:$E$250,0)))","v":""},{"$f":"IF(OR(C101=\"\",D101=\"\",ROWS($G$2:G101)>$L$2),\"\",IF(OR(C101=\"\",D101=\"\"),\"\",INDEX($D$2:$D$250,MATCH(F101,$C$2:$C$250,0))))","v":""},{"$f":"IF(OR(C101=\"\",D101=\"\",ROWS($H$2:H101)>$L$2),\"\",IF(OR(C101=\"\",D101=\"\"),\"\",SMALL($J$2:$J$250,ROWS($H$2:H101))))","v":""},{"$f":"IF(OR(C101=\"\",D101=\"\",ROWS($F$2:F101)>$L$2),\"\",IF(OR(C101=\"\",D101=\"\"),\"\",OrdeUP100(H101)))","v":""},""]
[null,null,null,null,{"$f":"IF(OR(C102=\"\",D102=\"\"),\"\",RANK(D102,$D$2:$D$250)+(ROWS($A$1:A101)-1)/100)","v":""},{"$f":"IF(OR(C102=\"\",D102=\"\",ROWS($F$2:F102)>$L$2),\"\",INDEX($C$2:$C$250,MATCH(SMALL($E$2:$E$250,ROWS($F$2:F102)),$E$2:$E$250,0)))","v":""},{"$f":"IF(OR(C102=\"\",D102=\"\",ROWS($G$2:G102)>$L$2),\"\",IF(OR(C102=\"\",D102=\"\"),\"\",INDEX($D$2:$D$250,MATCH(F102,$C$2:$C$250,0))))","v":""},{"$f":"IF(OR(C102=\"\",D102=\"\",ROWS($H$2:H102)>$L$2),\"\",IF(OR(C102=\"\",D102=\"\"),\"\",SMALL($J$2:$J$250,ROWS($H$2:H102))))","v":""},{"$f":"IF(OR(C102=\"\",D102=\"\",ROWS($F$2:F102)>$L$2),\"\",IF(OR(C102=\"\",D102=\"\"),\"\",OrdeUP100(H102)))","v":""},""]
[null,null,null,null,{"$f":"IF(OR(C103=\"\",D103=\"\"),\"\",RANK(D103,$D$2:$D$250)+(ROWS($A$1:A102)-1)/100)","v":""},{"$f":"IF(OR(C103=\"\",D103=\"\",ROWS($F$2:F103)>$L$2),\"\",INDEX($C$2:$C$250,MATCH(SMALL($E$2:$E$250,ROWS($F$2:F103)),$E$2:$E$250,0)))","v":""},{"$f":"IF(OR(C103=\"\",D103=\"\",ROWS($G$2:G103)>$L$2),\"\",IF(OR(C103=\"\",D103=\"\"),\"\",INDEX($D$2:$D$250,MATCH(F103,$C$2:$C$250,0))))","v":""},{"$f":"IF(OR(C103=\"\",D103=\"\",ROWS($H$2:H103)>$L$2),\"\",IF(OR(C103=\"\",D103=\"\"),\"\",SMALL($J$2:$J$250,ROWS($H$2:H103))))","v":""},{"$f":"IF(OR(C103=\"\",D103=\"\",ROWS($F$2:F103)>$L$2),\"\",IF(OR(C103=\"\",D103=\"\"),\"\",OrdeUP100(H103)))","v":""},""]
[null,null,null,null,{"$f":"IF(OR(C104=\"\",D104=\"\"),\"\",RANK(D104,$D$2:$D$250)+(ROWS($A$1:A103)-1)/100)","v":""},{"$f":"IF(OR(C104=\"\",D104=\"\",ROWS($F$2:F104)>$L$2),\"\",INDEX($C$2:$C$250,MATCH(SMALL($E$2:$E$250,ROWS($F$2:F104)),$E$2:$E$250,0)))","v":""},{"$f":"IF(OR(C104=\"\",D104=\"\",ROWS($G$2:G104)>$L$2),\"\",IF(OR(C104=\"\",D104=\"\"),\"\",INDEX($D$2:$D$250,MATCH(F104,$C$2:$C$250,0))))","v":""},{"$f":"IF(OR(C104=\"\",D104=\"\",ROWS($H$2:H104)>$L$2),\"\",IF(OR(C104=\"\",D104=\"\"),\"\",SMALL($J$2:$J$250,ROWS($H$2:H104))))","v":""},{"$f":"IF(OR(C104=\"\",D104=\"\",ROWS($F$2:F104)>$L$2),\"\",IF(OR(C104=\"\",D104=\"\"),\"\",OrdeUP100(H104)))","v":""},""]
[null,null,null,null,{"$f":"IF(OR(C105=\"\",D105=\"\"),\"\",RANK(D105,$D$2:$D$250)+(ROWS($A$1:A104)-1)/100)","v":""},{"$f":"IF(OR(C105=\"\",D105=\"\",ROWS($F$2:F105)>$L$2),\"\",INDEX($C$2:$C$250,MATCH(SMALL($E$2:$E$250,ROWS($F$2:F105)),$E$2:$E$250,0)))","v":""},{"$f":"IF(OR(C105=\"\",D105=\"\",ROWS($G$2:G105)>$L$2),\"\",IF(OR(C105=\"\",D105=\"\"),\"\",INDEX($D$2:$D$250,MATCH(F105,$C$2:$C$250,0))))","v":""},{"$f":"IF(OR(C105=\"\",D105=\"\",ROWS($H$2:H105)>$L$2),\"\",IF(OR(C105=\"\",D105=\"\"),\"\",SMALL($J$2:$J$250,ROWS($H$2:H105))))","v":""},{"$f":"IF(OR(C105=\"\",D105=\"\",ROWS($F$2:F105)>$L$2),\"\",IF(OR(C105=\"\",D105=\"\"),\"\",OrdeUP100(H105)))","v":""},""]
[null,null,null,null,{"$f":"IF(OR(C106=\"\",D106=\"\"),\"\",RANK(D106,$D$2:$D$250)+(ROWS($A$1:A105)-1)/100)","v":""},{"$f":"IF(OR(C106=\"\",D106=\"\",ROWS($F$2:F106)>$L$2),\"\",INDEX($C$2:$C$250,MATCH(SMALL($E$2:$E$250,ROWS($F$2:F106)),$E$2:$E$250,0)))","v":""},{"$f":"IF(OR(C106=\"\",D106=\"\",ROWS($G$2:G106)>$L$2),\"\",IF(OR(C106=\"\",D106=\"\"),\"\",INDEX($D$2:$D$250,MATCH(F106,$C$2:$C$250,0))))","v":""},{"$f":"IF(OR(C106=\"\",D106=\"\",ROWS($H$2:H106)>$L$2),\"\",IF(OR(C106=\"\",D106=\"\"),\"\",SMALL($J$2:$J$250,ROWS($H$2:H106))))","v":""},{"$f":"IF(OR(C106=\"\",D106=\"\",ROWS($F$2:F106)>$L$2),\"\",IF(OR(C106=\"\",D106=\"\"),\"\",OrdeUP100(H106)))","v":""},""]
[null,null,null,null,{"$f":"IF(OR(C107=\"\",D107=\"\"),\"\",RANK(D107,$D$2:$D$250)+(ROWS($A$1:A106)-1)/100)","v":""},{"$f":"IF(OR(C107=\"\",D107=\"\",ROWS($F$2:F107)>$L$2),\"\",INDEX($C$2:$C$250,MATCH(SMALL($E$2:$E$250,ROWS($F$2:F107)),$E$2:$E$250,0)))","v":""},{"$f":"IF(OR(C107=\"\",D107=\"\",ROWS($G$2:G107)>$L$2),\"\",IF(OR(C107=\"\",D107=\"\"),\"\",INDEX($D$2:$D$250,MATCH(F107,$C$2:$C$250,0))))","v":""},{"$f":"IF(OR(C107=\"\",D107=\"\",ROWS($H$2:H107)>$L$2),\"\",IF(OR(C107=\"\",D107=\"\"),\"\",SMALL($J$2:$J$250,ROWS($H$2:H107))))","v":""},{"$f":"IF(OR(C107=\"\",D107=\"\",ROWS($F$2:F107)>$L$2),\"\",IF(OR(C107=\"\",D107=\"\"),\"\",OrdeUP100(H107)))","v":""},""]
[null,null,null,null,{"$f":"IF(OR(C108=\"\",D108=\"\"),\"\",RANK(D108,$D$2:$D$250)+(ROWS($A$1:A107)-1)/100)","v":""},{"$f":"IF(OR(C108=\"\",D108=\"\",ROWS($F$2:F108)>$L$2),\"\",INDEX($C$2:$C$250,MATCH(SMALL($E$2:$E$250,ROWS($F$2:F108)),$E$2:$E$250,0)))","v":""},{"$f":"IF(OR(C108=\"\",D108=\"\",ROWS($G$2:G108)>$L$2),\"\",IF(OR(C108=\"\",D108=\"\"),\"\",INDEX($D$2:$D$250,MATCH(F108,$C$2:$C$250,0))))","v":""},{"$f":"IF(OR(C108=\"\",D108=\"\",ROWS($H$2:H108)>$L$2),\"\",IF(OR(C108=\"\",D108=\"\"),\"\",SMALL($J$2:$J$250,ROWS($H$2:H108))))","v":""},{"$f":"IF(OR(C108=\"\",D108=\"\",ROWS($F$2:F108)>$L$2),\"\",IF(OR(C108=\"\",D108=\"\"),\"\",OrdeUP100(H108)))","v":""},""]
[null,null,null,null,{"$f":"IF(OR(C109=\"\",D109=\"\"),\"\",RANK(D109,$D$2:$D$250)+(ROWS($A$1:A108)-1)/100)","v":""},{"$f":"IF(OR(C109=\"\",D109=\"\",ROWS($F$2:F109)>$L$2),\"\",INDEX($C$2:$C$250,MATCH(SMALL($E$2:$E$250,ROWS($F$2:F109)),$E$2:$E$250,0)))","v":""},{"$f":"IF(OR(C109=\"\",D109=\"\",ROWS($G$2:G109)>$L$2),\"\",IF(OR(C109=\"\",D109=\"\"),\"\",INDEX($D$2:$D$250,MATCH(F109,$C$2:$C$250,0))))","v":""},{"$f":"IF(OR(C109=\"\",D109=\"\",ROWS($H$2:H109)>$L$2),\"\",IF(OR(C109=\"\",D109=\"\"),\"\",SMALL($J$2:$J$250,ROWS($H$2:H109))))","v":""},{"$f":"IF(OR(C109=\"\",D109=\"\",ROWS($F$2:F109)>$L$2),\"\",IF(OR(C109=\"\",D109=\"\"),\"\",OrdeUP100(H109)))","v":""},""]
[null,null,null,null,{"$f":"IF(OR(C110=\"\",D110=\"\"),\"\",RANK(D110,$D$2:$D$250)+(ROWS($A$1:A109)-1)/100)","v":""},{"$f":"IF(OR(C110=\"\",D110=\"\",ROWS($F$2:F110)>$L$2),\"\",INDEX($C$2:$C$250,MATCH(SMALL($E$2:$E$250,ROWS($F$2:F110)),$E$2:$E$250,0)))","v":""},{"$f":"IF(OR(C110=\"\",D110=\"\",ROWS($G$2:G110)>$L$2),\"\",IF(OR(C110=\"\",D110=\"\"),\"\",INDEX($D$2:$D$250,MATCH(F110,$C$2:$C$250,0))))","v":""},{"$f":"IF(OR(C110=\"\",D110=\"\",ROWS($H$2:H110)>$L$2),\"\",IF(OR(C110=\"\",D110=\"\"),\"\",SMALL($J$2:$J$250,ROWS($H$2:H110))))","v":""},{"$f":"IF(OR(C110=\"\",D110=\"\",ROWS($F$2:F110)>$L$2),\"\",IF(OR(C110=\"\",D110=\"\"),\"\",OrdeUP100(H110)))","v":""},""]
[null,null,null,null,{"$f":"IF(OR(C111=\"\",D111=\"\"),\"\",RANK(D111,$D$2:$D$250)+(ROWS($A$1:A110)-1)/100)","v":""},{"$f":"IF(OR(C111=\"\",D111=\"\",ROWS($F$2:F111)>$L$2),\"\",INDEX($C$2:$C$250,MATCH(SMALL($E$2:$E$250,ROWS($F$2:F111)),$E$2:$E$250,0)))","v":""},{"$f":"IF(OR(C111=\"\",D111=\"\",ROWS($G$2:G111)>$L$2),\"\",IF(OR(C111=\"\",D111=\"\"),\"\",INDEX($D$2:$D$250,MATCH(F111,$C$2:$C$250,0))))","v":""},{"$f":"IF(OR(C111=\"\",D111=\"\",ROWS($H$2:H111)>$L$2),\"\",IF(OR(C111=\"\",D111=\"\"),\"\",SMALL($J$2:$J$250,ROWS($H$2:H111))))","v":""},{"$f":"IF(OR(C111=\"\",D111=\"\",ROWS($F$2:F111)>$L$2),\"\",IF(OR(C111=\"\",D111=\"\"),\"\",OrdeUP100(H111)))","v":""},""]
[null,null,null,null,{"$f":"IF(OR(C112=\"\",D112=\"\"),\"\",RANK(D112,$D$2:$D$250)+(ROWS($A$1:A111)-1)/100)","v":""},{"$f":"IF(OR(C112=\"\",D112=\"\",ROWS($F$2:F112)>$L$2),\"\",INDEX($C$2:$C$250,MATCH(SMALL($E$2:$E$250,ROWS($F$2:F112)),$E$2:$E$250,0)))","v":""},{"$f":"IF(OR(C112=\"\",D112=\"\",ROWS($G$2:G112)>$L$2),\"\",IF(OR(C112=\"\",D112=\"\"),\"\",INDEX($D$2:$D$250,MATCH(F112,$C$2:$C$250,0))))","v":""},{"$f":"IF(OR(C112=\"\",D112=\"\",ROWS($H$2:H112)>$L$2),\"\",IF(OR(C112=\"\",D112=\"\"),\"\",SMALL($J$2:$J$250,ROWS($H$2:H112))))","v":""},{"$f":"IF(OR(C112=\"\",D112=\"\",ROWS($F$2:F112)>$L$2),\"\",IF(OR(C112=\"\",D112=\"\"),\"\",OrdeUP100(H112)))","v":""},""]
[null,null,null,null,{"$f":"IF(OR(C113=\"\",D113=\"\"),\"\",RANK(D113,$D$2:$D$250)+(ROWS($A$1:A112)-1)/100)","v":""},{"$f":"IF(OR(C113=\"\",D113=\"\",ROWS($F$2:F113)>$L$2),\"\",INDEX($C$2:$C$250,MATCH(SMALL($E$2:$E$250,ROWS($F$2:F113)),$E$2:$E$250,0)))","v":""},{"$f":"IF(OR(C113=\"\",D113=\"\",ROWS($G$2:G113)>$L$2),\"\",IF(OR(C113=\"\",D113=\"\"),\"\",INDEX($D$2:$D$250,MATCH(F113,$C$2:$C$250,0))))","v":""},{"$f":"IF(OR(C113=\"\",D113=\"\",ROWS($H$2:H113)>$L$2),\"\",IF(OR(C113=\"\",D113=\"\"),\"\",SMALL($J$2:$J$250,ROWS($H$2:H113))))","v":""},{"$f":"IF(OR(C113=\"\",D113=\"\",ROWS($F$2:F113)>$L$2),\"\",IF(OR(C113=\"\",D113=\"\"),\"\",OrdeUP100(H113)))","v":""},""]
[null,null,null,null,{"$f":"IF(OR(C114=\"\",D114=\"\"),\"\",RANK(D114,$D$2:$D$250)+(ROWS($A$1:A113)-1)/100)","v":""},{"$f":"IF(OR(C114=\"\",D114=\"\",ROWS($F$2:F114)>$L$2),\"\",INDEX($C$2:$C$250,MATCH(SMALL($E$2:$E$250,ROWS($F$2:F114)),$E$2:$E$250,0)))","v":""},{"$f":"IF(OR(C114=\"\",D114=\"\",ROWS($G$2:G114)>$L$2),\"\",IF(OR(C114=\"\",D114=\"\"),\"\",INDEX($D$2:$D$250,MATCH(F114,$C$2:$C$250,0))))","v":""},{"$f":"IF(OR(C114=\"\",D114=\"\",ROWS($H$2:H114)>$L$2),\"\",IF(OR(C114=\"\",D114=\"\"),\"\",SMALL($J$2:$J$250,ROWS($H$2:H114))))","v":""},{"$f":"IF(OR(C114=\"\",D114=\"\",ROWS($F$2:F114)>$L$2),\"\",IF(OR(C114=\"\",D114=\"\"),\"\",OrdeUP100(H114)))","v":""},""]
[null,null,null,null,{"$f":"IF(OR(C115=\"\",D115=\"\"),\"\",RANK(D115,$D$2:$D$250)+(ROWS($A$1:A114)-1)/100)","v":""},{"$f":"IF(OR(C115=\"\",D115=\"\",ROWS($F$2:F115)>$L$2),\"\",INDEX($C$2:$C$250,MATCH(SMALL($E$2:$E$250,ROWS($F$2:F115)),$E$2:$E$250,0)))","v":""},{"$f":"IF(OR(C115=\"\",D115=\"\",ROWS($G$2:G115)>$L$2),\"\",IF(OR(C115=\"\",D115=\"\"),\"\",INDEX($D$2:$D$250,MATCH(F115,$C$2:$C$250,0))))","v":""},{"$f":"IF(OR(C115=\"\",D115=\"\",ROWS($H$2:H115)>$L$2),\"\",IF(OR(C115=\"\",D115=\"\"),\"\",SMALL($J$2:$J$250,ROWS($H$2:H115))))","v":""},{"$f":"IF(OR(C115=\"\",D115=\"\",ROWS($F$2:F115)>$L$2),\"\",IF(OR(C115=\"\",D115=\"\"),\"\",OrdeUP100(H115)))","v":""},""]
[null,null,null,null,{"$f":"IF(OR(C116=\"\",D116=\"\"),\"\",RANK(D116,$D$2:$D$250)+(ROWS($A$1:A115)-1)/100)","v":""},{"$f":"IF(OR(C116=\"\",D116=\"\",ROWS($F$2:F116)>$L$2),\"\",INDEX($C$2:$C$250,MATCH(SMALL($E$2:$E$250,ROWS($F$2:F116)),$E$2:$E$250,0)))","v":""},{"$f":"IF(OR(C116=\"\",D116=\"\",ROWS($G$2:G116)>$L$2),\"\",IF(OR(C116=\"\",D116=\"\"),\"\",INDEX($D$2:$D$250,MATCH(F116,$C$2:$C$250,0))))","v":""},{"$f":"IF(OR(C116=\"\",D116=\"\",ROWS($H$2:H116)>$L$2),\"\",IF(OR(C116=\"\",D116=\"\"),\"\",SMALL($J$2:$J$250,ROWS($H$2:H116))))","v":""},{"$f":"IF(OR(C116=\"\",D116=\"\",ROWS($F$2:F116)>$L$2),\"\",IF(OR(C116=\"\",D116=\"\"),\"\",OrdeUP100(H116)))","v":""},""]
[null,null,null,null,{"$f":"IF(OR(C117=\"\",D117=\"\"),\"\",RANK(D117,$D$2:$D$250)+(ROWS($A$1:A116)-1)/100)","v":""},{"$f":"IF(OR(C117=\"\",D117=\"\",ROWS($F$2:F117)>$L$2),\"\",INDEX($C$2:$C$250,MATCH(SMALL($E$2:$E$250,ROWS($F$2:F117)),$E$2:$E$250,0)))","v":""},{"$f":"IF(OR(C117=\"\",D117=\"\",ROWS($G$2:G117)>$L$2),\"\",IF(OR(C117=\"\",D117=\"\"),\"\",INDEX($D$2:$D$250,MATCH(F117,$C$2:$C$250,0))))","v":""},{"$f":"IF(OR(C117=\"\",D117=\"\",ROWS($H$2:H117)>$L$2),\"\",IF(OR(C117=\"\",D117=\"\"),\"\",SMALL($J$2:$J$250,ROWS($H$2:H117))))","v":""},{"$f":"IF(OR(C117=\"\",D117=\"\",ROWS($F$2:F117)>$L$2),\"\",IF(OR(C117=\"\",D117=\"\"),\"\",OrdeUP100(H117)))","v":""},""]
[null,null,null,null,{"$f":"IF(OR(C118=\"\",D118=\"\"),\"\",RANK(D118,$D$2:$D$250)+(ROWS($A$1:A117)-1)/100)","v":""},{"$f":"IF(OR(C118=\"\",D118=\"\",ROWS($F$2:F118)>$L$2),\"\",INDEX($C$2:$C$250,MATCH(SMALL($E$2:$E$250,ROWS($F$2:F118)),$E$2:$E$250,0)))","v":""},{"$f":"IF(OR(C118=\"\",D118=\"\",ROWS($G$2:G118)>$L$2),\"\",IF(OR(C118=\"\",D118=\"\"),\"\",INDEX($D$2:$D$250,MATCH(F118,$C$2:$C$250,0))))","v":""},{"$f":"IF(OR(C118=\"\",D118=\"\",ROWS($H$2:H118)>$L$2),\"\",IF(OR(C118=\"\",D118=\"\"),\"\",SMALL($J$2:$J$250,ROWS($H$2:H118))))","v":""},{"$f":"IF(OR(C118=\"\",D118=\"\",ROWS($F$2:F118)>$L$2),\"\",IF(OR(C118=\"\",D118=\"\"),\"\",OrdeUP100(H118)))","v":""},""]
[null,null,null,null,{"$f":"IF(OR(C119=\"\",D119=\"\"),\"\",RANK(D119,$D$2:$D$250)+(ROWS($A$1:A118)-1)/100)","v":""},{"$f":"IF(OR(C119=\"\",D119=\"\",ROWS($F$2:F119)>$L$2),\"\",INDEX($C$2:$C$250,MATCH(SMALL($E$2:$E$250,ROWS($F$2:F119)),$E$2:$E$250,0)))","v":""},{"$f":"IF(OR(C119=\"\",D119=\"\",ROWS($G$2:G119)>$L$2),\"\",IF(OR(C119=\"\",D119=\"\"),\"\",INDEX($D$2:$D$250,MATCH(F119,$C$2:$C$250,0))))","v":""},{"$f":"IF(OR(C119=\"\",D119=\"\",ROWS($H$2:H119)>$L$2),\"\",IF(OR(C119=\"\",D119=\"\"),\"\",SMALL($J$2:$J$250,ROWS($H$2:H119))))","v":""},{"$f":"IF(OR(C119=\"\",D119=\"\",ROWS($F$2:F119)>$L$2),\"\",IF(OR(C119=\"\",D119=\"\"),\"\",OrdeUP100(H119)))","v":""},""]
[null,null,null,null,{"$f":"IF(OR(C120=\"\",D120=\"\"),\"\",RANK(D120,$D$2:$D$250)+(ROWS($A$1:A119)-1)/100)","v":""},{"$f":"IF(OR(C120=\"\",D120=\"\",ROWS($F$2:F120)>$L$2),\"\",INDEX($C$2:$C$250,MATCH(SMALL($E$2:$E$250,ROWS($F$2:F120)),$E$2:$E$250,0)))","v":""},{"$f":"IF(OR(C120=\"\",D120=\"\",ROWS($G$2:G120)>$L$2),\"\",IF(OR(C120=\"\",D120=\"\"),\"\",INDEX($D$2:$D$250,MATCH(F120,$C$2:$C$250,0))))","v":""},{"$f":"IF(OR(C120=\"\",D120=\"\",ROWS($H$2:H120)>$L$2),\"\",IF(OR(C120=\"\",D120=\"\"),\"\",SMALL($J$2:$J$250,ROWS($H$2:H120))))","v":""},{"$f":"IF(OR(C120=\"\",D120=\"\",ROWS($F$2:F120)>$L$2),\"\",IF(OR(C120=\"\",D120=\"\"),\"\",OrdeUP100(H120)))","v":""},""]
[null,null,null,null,{"$f":"IF(OR(C121=\"\",D121=\"\"),\"\",RANK(D121,$D$2:$D$250)+(ROWS($A$1:A120)-1)/100)","v":""},{"$f":"IF(OR(C121=\"\",D121=\"\",ROWS($F$2:F121)>$L$2),\"\",INDEX($C$2:$C$250,MATCH(SMALL($E$2:$E$250,ROWS($F$2:F121)),$E$2:$E$250,0)))","v":""},{"$f":"IF(OR(C121=\"\",D121=\"\",ROWS($G$2:G121)>$L$2),\"\",IF(OR(C121=\"\",D121=\"\"),\"\",INDEX($D$2:$D$250,MATCH(F121,$C$2:$C$250,0))))","v":""},{"$f":"IF(OR(C121=\"\",D121=\"\",ROWS($H$2:H121)>$L$2),\"\",IF(OR(C121=\"\",D121=\"\"),\"\",SMALL($J$2:$J$250,ROWS($H$2:H121))))","v":""},{"$f":"IF(OR(C121=\"\",D121=\"\",ROWS($F$2:F121)>$L$2),\"\",IF(OR(C121=\"\",D121=\"\"),\"\",OrdeUP100(H121)))","v":""},""]
[null,null,null,null,{"$f":"IF(OR(C122=\"\",D122=\"\"),\"\",RANK(D122,$D$2:$D$250)+(ROWS($A$1:A121)-1)/100)","v":""},{"$f":"IF(OR(C122=\"\",D122=\"\",ROWS($F$2:F122)>$L$2),\"\",INDEX($C$2:$C$250,MATCH(SMALL($E$2:$E$250,ROWS($F$2:F122)),$E$2:$E$250,0)))","v":""},{"$f":"IF(OR(C122=\"\",D122=\"\",ROWS($G$2:G122)>$L$2),\"\",IF(OR(C122=\"\",D122=\"\"),\"\",INDEX($D$2:$D$250,MATCH(F122,$C$2:$C$250,0))))","v":""},{"$f":"IF(OR(C122=\"\",D122=\"\",ROWS($H$2:H122)>$L$2),\"\",IF(OR(C122=\"\",D122=\"\"),\"\",SMALL($J$2:$J$250,ROWS($H$2:H122))))","v":""},{"$f":"IF(OR(C122=\"\",D122=\"\",ROWS($F$2:F122)>$L$2),\"\",IF(OR(C122=\"\",D122=\"\"),\"\",OrdeUP100(H122)))","v":""},""]
[null,null,null,null,{"$f":"IF(OR(C123=\"\",D123=\"\"),\"\",RANK(D123,$D$2:$D$250)+(ROWS($A$1:A122)-1)/100)","v":""},{"$f":"IF(OR(C123=\"\",D123=\"\",ROWS($F$2:F123)>$L$2),\"\",INDEX($C$2:$C$250,MATCH(SMALL($E$2:$E$250,ROWS($F$2:F123)),$E$2:$E$250,0)))","v":""},{"$f":"IF(OR(C123=\"\",D123=\"\",ROWS($G$2:G123)>$L$2),\"\",IF(OR(C123=\"\",D123=\"\"),\"\",INDEX($D$2:$D$250,MATCH(F123,$C$2:$C$250,0))))","v":""},{"$f":"IF(OR(C123=\"\",D123=\"\",ROWS($H$2:H123)>$L$2),\"\",IF(OR(C123=\"\",D123=\"\"),\"\",SMALL($J$2:$J$250,ROWS($H$2:H123))))","v":""},{"$f":"IF(OR(C123=\"\",D123=\"\",ROWS($F$2:F123)>$L$2),\"\",IF(OR(C123=\"\",D123=\"\"),\"\",OrdeUP100(H123)))","v":""},""]
[null,null,null,null,{"$f":"IF(OR(C124=\"\",D124=\"\"),\"\",RANK(D124,$D$2:$D$250)+(ROWS($A$1:A123)-1)/100)","v":""},{"$f":"IF(OR(C124=\"\",D124=\"\",ROWS($F$2:F124)>$L$2),\"\",INDEX($C$2:$C$250,MATCH(SMALL($E$2:$E$250,ROWS($F$2:F124)),$E$2:$E$250,0)))","v":""},{"$f":"IF(OR(C124=\"\",D124=\"\",ROWS($G$2:G124)>$L$2),\"\",IF(OR(C124=\"\",D124=\"\"),\"\",INDEX($D$2:$D$250,MATCH(F124,$C$2:$C$250,0))))","v":""},{"$f":"IF(OR(C124=\"\",D124=\"\",ROWS($H$2:H124)>$L$2),\"\",IF(OR(C124=\"\",D124=\"\"),\"\",SMALL($J$2:$J$250,ROWS($H$2:H124))))","v":""},{"$f":"IF(OR(C124=\"\",D124=\"\",ROWS($F$2:F124)>$L$2),\"\",IF(OR(C124=\"\",D124=\"\"),\"\",OrdeUP100(H124)))","v":""},""]
[null,null,null,null,{"$f":"IF(OR(C125=\"\",D125=\"\"),\"\",RANK(D125,$D$2:$D$250)+(ROWS($A$1:A124)-1)/100)","v":""},{"$f":"IF(OR(C125=\"\",D125=\"\",ROWS($F$2:F125)>$L$2),\"\",INDEX($C$2:$C$250,MATCH(SMALL($E$2:$E$250,ROWS($F$2:F125)),$E$2:$E$250,0)))","v":""},{"$f":"IF(OR(C125=\"\",D125=\"\",ROWS($G$2:G125)>$L$2),\"\",IF(OR(C125=\"\",D125=\"\"),\"\",INDEX($D$2:$D$250,MATCH(F125,$C$2:$C$250,0))))","v":""},{"$f":"IF(OR(C125=\"\",D125=\"\",ROWS($H$2:H125)>$L$2),\"\",IF(OR(C125=\"\",D125=\"\"),\"\",SMALL($J$2:$J$250,ROWS($H$2:H125))))","v":""},{"$f":"IF(OR(C125=\"\",D125=\"\",ROWS($F$2:F125)>$L$2),\"\",IF(OR(C125=\"\",D125=\"\"),\"\",OrdeUP100(H125)))","v":""},""]
[null,null,null,null,{"$f":"IF(OR(C126=\"\",D126=\"\"),\"\",RANK(D126,$D$2:$D$250)+(ROWS($A$1:A125)-1)/100)","v":""},{"$f":"IF(OR(C126=\"\",D126=\"\",ROWS($F$2:F126)>$L$2),\"\",INDEX($C$2:$C$250,MATCH(SMALL($E$2:$E$250,ROWS($F$2:F126)),$E$2:$E$250,0)))","v":""},{"$f":"IF(OR(C126=\"\",D126=\"\",ROWS($G$2:G126)>$L$2),\"\",IF(OR(C126=\"\",D126=\"\"),\"\",INDEX($D$2:$D$250,MATCH(F126,$C$2:$C$250,0))))","v":""},{"$f":"IF(OR(C126=\"\",D126=\"\",ROWS($H$2:H126)>$L$2),\"\",IF(OR(C126=\"\",D126=\"\"),\"\",SMALL($J$2:$J$250,ROWS($H$2:H126))))","v":""},{"$f":"IF(OR(C126=\"\",D126=\"\",ROWS($F$2:F126)>$L$2),\"\",IF(OR(C126=\"\",D126=\"\"),\"\",OrdeUP100(H126)))","v":""},""]
[null,null,null,null,{"$f":"IF(OR(C127=\"\",D127=\"\"),\"\",RANK(D127,$D$2:$D$250)+(ROWS($A$1:A126)-1)/100)","v":""},{"$f":"IF(OR(C127=\"\",D127=\"\",ROWS($F$2:F127)>$L$2),\"\",INDEX($C$2:$C$250,MATCH(SMALL($E$2:$E$250,ROWS($F$2:F127)),$E$2:$E$250,0)))","v":""},{"$f":"IF(OR(C127=\"\",D127=\"\",ROWS($G$2:G127)>$L$2),\"\",IF(OR(C127=\"\",D127=\"\"),\"\",INDEX($D$2:$D$250,MATCH(F127,$C$2:$C$250,0))))","v":""},{"$f":"IF(OR(C127=\"\",D127=\"\",ROWS($H$2:H127)>$L$2),\"\",IF(OR(C127=\"\",D127=\"\"),\"\",SMALL($J$2:$J$250,ROWS($H$2:H127))))","v":""},{"$f":"IF(OR(C127=\"\",D127=\"\",ROWS($F$2:F127)>$L$2),\"\",IF(OR(C127=\"\",D127=\"\"),\"\",OrdeUP100(H127)))","v":""},""]
[null,null,null,null,{"$f":"IF(OR(C128=\"\",D128=\"\"),\"\",RANK(D128,$D$2:$D$250)+(ROWS($A$1:A127)-1)/100)","v":""},{"$f":"IF(OR(C128=\"\",D128=\"\",ROWS($F$2:F128)>$L$2),\"\",INDEX($C$2:$C$250,MATCH(SMALL($E$2:$E$250,ROWS($F$2:F128)),$E$2:$E$250,0)))","v":""},{"$f":"IF(OR(C128=\"\",D128=\"\",ROWS($G$2:G128)>$L$2),\"\",IF(OR(C128=\"\",D128=\"\"),\"\",INDEX($D$2:$D$250,MATCH(F128,$C$2:$C$250,0))))","v":""},{"$f":"IF(OR(C128=\"\",D128=\"\",ROWS($H$2:H128)>$L$2),\"\",IF(OR(C128=\"\",D128=\"\"),\"\",SMALL($J$2:$J$250,ROWS($H$2:H128))))","v":""},{"$f":"IF(OR(C128=\"\",D128=\"\",ROWS($F$2:F128)>$L$2),\"\",IF(OR(C128=\"\",D128=\"\"),\"\",OrdeUP100(H128)))","v":""},""]
[null,null,null,null,{"$f":"IF(OR(C129=\"\",D129=\"\"),\"\",RANK(D129,$D$2:$D$250)+(ROWS($A$1:A128)-1)/100)","v":""},{"$f":"IF(OR(C129=\"\",D129=\"\",ROWS($F$2:F129)>$L$2),\"\",INDEX($C$2:$C$250,MATCH(SMALL($E$2:$E$250,ROWS($F$2:F129)),$E$2:$E$250,0)))","v":""},{"$f":"IF(OR(C129=\"\",D129=\"\",ROWS($G$2:G129)>$L$2),\"\",IF(OR(C129=\"\",D129=\"\"),\"\",INDEX($D$2:$D$250,MATCH(F129,$C$2:$C$250,0))))","v":""},{"$f":"IF(OR(C129=\"\",D129=\"\",ROWS($H$2:H129)>$L$2),\"\",IF(OR(C129=\"\",D129=\"\"),\"\",SMALL($J$2:$J$250,ROWS($H$2:H129))))","v":""},{"$f":"IF(OR(C129=\"\",D129=\"\",ROWS($F$2:F129)>$L$2),\"\",IF(OR(C129=\"\",D129=\"\"),\"\",OrdeUP100(H129)))","v":""},""]
[null,null,null,null,{"$f":"IF(OR(C130=\"\",D130=\"\"),\"\",RANK(D130,$D$2:$D$250)+(ROWS($A$1:A129)-1)/100)","v":""},{"$f":"IF(OR(C130=\"\",D130=\"\",ROWS($F$2:F130)>$L$2),\"\",INDEX($C$2:$C$250,MATCH(SMALL($E$2:$E$250,ROWS($F$2:F130)),$E$2:$E$250,0)))","v":""},{"$f":"IF(OR(C130=\"\",D130=\"\",ROWS($G$2:G130)>$L$2),\"\",IF(OR(C130=\"\",D130=\"\"),\"\",INDEX($D$2:$D$250,MATCH(F130,$C$2:$C$250,0))))","v":""},{"$f":"IF(OR(C130=\"\",D130=\"\",ROWS($H$2:H130)>$L$2),\"\",IF(OR(C130=\"\",D130=\"\"),\"\",SMALL($J$2:$J$250,ROWS($H$2:H130))))","v":""},{"$f":"IF(OR(C130=\"\",D130=\"\",ROWS($F$2:F130)>$L$2),\"\",IF(OR(C130=\"\",D130=\"\"),\"\",OrdeUP100(H130)))","v":""},""]
[null,null,null,null,{"$f":"IF(OR(C131=\"\",D131=\"\"),\"\",RANK(D131,$D$2:$D$250)+(ROWS($A$1:A130)-1)/100)","v":""},{"$f":"IF(OR(C131=\"\",D131=\"\",ROWS($F$2:F131)>$L$2),\"\",INDEX($C$2:$C$250,MATCH(SMALL($E$2:$E$250,ROWS($F$2:F131)),$E$2:$E$250,0)))","v":""},{"$f":"IF(OR(C131=\"\",D131=\"\",ROWS($G$2:G131)>$L$2),\"\",IF(OR(C131=\"\",D131=\"\"),\"\",INDEX($D$2:$D$250,MATCH(F131,$C$2:$C$250,0))))","v":""},{"$f":"IF(OR(C131=\"\",D131=\"\",ROWS($H$2:H131)>$L$2),\"\",IF(OR(C131=\"\",D131=\"\"),\"\",SMALL($J$2:$J$250,ROWS($H$2:H131))))","v":""},{"$f":"IF(OR(C131=\"\",D131=\"\",ROWS($F$2:F131)>$L$2),\"\",IF(OR(C131=\"\",D131=\"\"),\"\",OrdeUP100(H131)))","v":""},{"$f":"IF(OR(C131=\"\",D131=\"\"),\"\",RANK(D131,$D$2:$D$250))","v":""}]
[null,null,null,null,{"$f":"IF(OR(C132=\"\",D132=\"\"),\"\",RANK(D132,$D$2:$D$250)+(ROWS($A$1:A131)-1)/100)","v":""},{"$f":"IF(OR(C132=\"\",D132=\"\",ROWS($F$2:F132)>$L$2),\"\",INDEX($C$2:$C$250,MATCH(SMALL($E$2:$E$250,ROWS($F$2:F132)),$E$2:$E$250,0)))","v":""},{"$f":"IF(OR(C132=\"\",D132=\"\",ROWS($G$2:G132)>$L$2),\"\",IF(OR(C132=\"\",D132=\"\"),\"\",INDEX($D$2:$D$250,MATCH(F132,$C$2:$C$250,0))))","v":""},{"$f":"IF(OR(C132=\"\",D132=\"\",ROWS($H$2:H132)>$L$2),\"\",IF(OR(C132=\"\",D132=\"\"),\"\",SMALL($J$2:$J$250,ROWS($H$2:H132))))","v":""},{"$f":"IF(OR(C132=\"\",D132=\"\",ROWS($F$2:F132)>$L$2),\"\",IF(OR(C132=\"\",D132=\"\"),\"\",OrdeUP100(H132)))","v":""},""]
[null,null,null,null,{"$f":"IF(OR(C133=\"\",D133=\"\"),\"\",RANK(D133,$D$2:$D$250)+(ROWS($A$1:A132)-1)/100)","v":""},{"$f":"IF(OR(C133=\"\",D133=\"\",ROWS($F$2:F133)>$L$2),\"\",INDEX($C$2:$C$250,MATCH(SMALL($E$2:$E$250,ROWS($F$2:F133)),$E$2:$E$250,0)))","v":""},{"$f":"IF(OR(C133=\"\",D133=\"\",ROWS($G$2:G133)>$L$2),\"\",IF(OR(C133=\"\",D133=\"\"),\"\",INDEX($D$2:$D$250,MATCH(F133,$C$2:$C$250,0))))","v":""},{"$f":"IF(OR(C133=\"\",D133=\"\",ROWS($H$2:H133)>$L$2),\"\",IF(OR(C133=\"\",D133=\"\"),\"\",SMALL($J$2:$J$250,ROWS($H$2:H133))))","v":""},{"$f":"IF(OR(C133=\"\",D133=\"\",ROWS($F$2:F133)>$L$2),\"\",IF(OR(C133=\"\",D133=\"\"),\"\",OrdeUP100(H133)))","v":""},""]
[null,null,null,null,{"$f":"IF(OR(C134=\"\",D134=\"\"),\"\",RANK(D134,$D$2:$D$250)+(ROWS($A$1:A133)-1)/100)","v":""},{"$f":"IF(OR(C134=\"\",D134=\"\",ROWS($F$2:F134)>$L$2),\"\",INDEX($C$2:$C$250,MATCH(SMALL($E$2:$E$250,ROWS($F$2:F134)),$E$2:$E$250,0)))","v":""},{"$f":"IF(OR(C134=\"\",D134=\"\",ROWS($G$2:G134)>$L$2),\"\",IF(OR(C134=\"\",D134=\"\"),\"\",INDEX($D$2:$D$250,MATCH(F134,$C$2:$C$250,0))))","v":""},{"$f":"IF(OR(C134=\"\",D134=\"\",ROWS($H$2:H134)>$L$2),\"\",IF(OR(C134=\"\",D134=\"\"),\"\",SMALL($J$2:$J$250,ROWS($H$2:H134))))","v":""},{"$f":"IF(OR(C134=\"\",D134=\"\",ROWS($F$2:F134)>$L$2),\"\",IF(OR(C134=\"\",D134=\"\"),\"\",OrdeUP100(H134)))","v":""},""]
[null,null,null,null,{"$f":"IF(OR(C135=\"\",D135=\"\"),\"\",RANK(D135,$D$2:$D$250)+(ROWS($A$1:A134)-1)/100)","v":""},{"$f":"IF(OR(C135=\"\",D135=\"\",ROWS($F$2:F135)>$L$2),\"\",INDEX($C$2:$C$250,MATCH(SMALL($E$2:$E$250,ROWS($F$2:F135)),$E$2:$E$250,0)))","v":""},{"$f":"IF(OR(C135=\"\",D135=\"\",ROWS($G$2:G135)>$L$2),\"\",IF(OR(C135=\"\",D135=\"\"),\"\",INDEX($D$2:$D$250,MATCH(F135,$C$2:$C$250,0))))","v":""},{"$f":"IF(OR(C135=\"\",D135=\"\",ROWS($H$2:H135)>$L$2),\"\",IF(OR(C135=\"\",D135=\"\"),\"\",SMALL($J$2:$J$250,ROWS($H$2:H135))))","v":""},{"$f":"IF(OR(C135=\"\",D135=\"\",ROWS($F$2:F135)>$L$2),\"\",IF(OR(C135=\"\",D135=\"\"),\"\",OrdeUP100(H135)))","v":""},""]
[null,null,null,null,{"$f":"IF(OR(C136=\"\",D136=\"\"),\"\",RANK(D136,$D$2:$D$250)+(ROWS($A$1:A135)-1)/100)","v":""},{"$f":"IF(OR(C136=\"\",D136=\"\",ROWS($F$2:F136)>$L$2),\"\",INDEX($C$2:$C$250,MATCH(SMALL($E$2:$E$250,ROWS($F$2:F136)),$E$2:$E$250,0)))","v":""},{"$f":"IF(OR(C136=\"\",D136=\"\",ROWS($G$2:G136)>$L$2),\"\",IF(OR(C136=\"\",D136=\"\"),\"\",INDEX($D$2:$D$250,MATCH(F136,$C$2:$C$250,0))))","v":""},{"$f":"IF(OR(C136=\"\",D136=\"\",ROWS($H$2:H136)>$L$2),\"\",IF(OR(C136=\"\",D136=\"\"),\"\",SMALL($J$2:$J$250,ROWS($H$2:H136))))","v":""},{"$f":"IF(OR(C136=\"\",D136=\"\",ROWS($F$2:F136)>$L$2),\"\",IF(OR(C136=\"\",D136=\"\"),\"\",OrdeUP100(H136)))","v":""},""]
[null,null,null,null,{"$f":"IF(OR(C137=\"\",D137=\"\"),\"\",RANK(D137,$D$2:$D$250)+(ROWS($A$1:A136)-1)/100)","v":""},{"$f":"IF(OR(C137=\"\",D137=\"\",ROWS($F$2:F137)>$L$2),\"\",INDEX($C$2:$C$250,MATCH(SMALL($E$2:$E$250,ROWS($F$2:F137)),$E$2:$E$250,0)))","v":""},{"$f":"IF(OR(C137=\"\",D137=\"\",ROWS($G$2:G137)>$L$2),\"\",IF(OR(C137=\"\",D137=\"\"),\"\",INDEX($D$2:$D$250,MATCH(F137,$C$2:$C$250,0))))","v":""},{"$f":"IF(OR(C137=\"\",D137=\"\",ROWS($H$2:H137)>$L$2),\"\",IF(OR(C137=\"\",D137=\"\"),\"\",SMALL($J$2:$J$250,ROWS($H$2:H137))))","v":""},{"$f":"IF(OR(C137=\"\",D137=\"\",ROWS($F$2:F137)>$L$2),\"\",IF(OR(C137=\"\",D137=\"\"),\"\",OrdeUP100(H137)))","v":""},""]
[null,null,null,null,{"$f":"IF(OR(C138=\"\",D138=\"\"),\"\",RANK(D138,$D$2:$D$250)+(ROWS($A$1:A137)-1)/100)","v":""},{"$f":"IF(OR(C138=\"\",D138=\"\",ROWS($F$2:F138)>$L$2),\"\",INDEX($C$2:$C$250,MATCH(SMALL($E$2:$E$250,ROWS($F$2:F138)),$E$2:$E$250,0)))","v":""},{"$f":"IF(OR(C138=\"\",D138=\"\",ROWS($G$2:G138)>$L$2),\"\",IF(OR(C138=\"\",D138=\"\"),\"\",INDEX($D$2:$D$250,MATCH(F138,$C$2:$C$250,0))))","v":""},{"$f":"IF(OR(C138=\"\",D138=\"\",ROWS($H$2:H138)>$L$2),\"\",IF(OR(C138=\"\",D138=\"\"),\"\",SMALL($J$2:$J$250,ROWS($H$2:H138))))","v":""},{"$f":"IF(OR(C138=\"\",D138=\"\",ROWS($F$2:F138)>$L$2),\"\",IF(OR(C138=\"\",D138=\"\"),\"\",OrdeUP100(H138)))","v":""},""]
[null,null,null,null,{"$f":"IF(OR(C139=\"\",D139=\"\"),\"\",RANK(D139,$D$2:$D$250)+(ROWS($A$1:A138)-1)/100)","v":""},{"$f":"IF(OR(C139=\"\",D139=\"\",ROWS($F$2:F139)>$L$2),\"\",INDEX($C$2:$C$250,MATCH(SMALL($E$2:$E$250,ROWS($F$2:F139)),$E$2:$E$250,0)))","v":""},{"$f":"IF(OR(C139=\"\",D139=\"\",ROWS($G$2:G139)>$L$2),\"\",IF(OR(C139=\"\",D139=\"\"),\"\",INDEX($D$2:$D$250,MATCH(F139,$C$2:$C$250,0))))","v":""},{"$f":"IF(OR(C139=\"\",D139=\"\",ROWS($H$2:H139)>$L$2),\"\",IF(OR(C139=\"\",D139=\"\"),\"\",SMALL($J$2:$J$250,ROWS($H$2:H139))))","v":""},{"$f":"IF(OR(C139=\"\",D139=\"\",ROWS($F$2:F139)>$L$2),\"\",IF(OR(C139=\"\",D139=\"\"),\"\",OrdeUP100(H139)))","v":""},""]
[null,null,null,null,{"$f":"IF(OR(C140=\"\",D140=\"\"),\"\",RANK(D140,$D$2:$D$250)+(ROWS($A$1:A139)-1)/100)","v":""},{"$f":"IF(OR(C140=\"\",D140=\"\",ROWS($F$2:F140)>$L$2),\"\",INDEX($C$2:$C$250,MATCH(SMALL($E$2:$E$250,ROWS($F$2:F140)),$E$2:$E$250,0)))","v":""},{"$f":"IF(OR(C140=\"\",D140=\"\",ROWS($G$2:G140)>$L$2),\"\",IF(OR(C140=\"\",D140=\"\"),\"\",INDEX($D$2:$D$250,MATCH(F140,$C$2:$C$250,0))))","v":""},{"$f":"IF(OR(C140=\"\",D140=\"\",ROWS($H$2:H140)>$L$2),\"\",IF(OR(C140=\"\",D140=\"\"),\"\",SMALL($J$2:$J$250,ROWS($H$2:H140))))","v":""},{"$f":"IF(OR(C140=\"\",D140=\"\",ROWS($F$2:F140)>$L$2),\"\",IF(OR(C140=\"\",D140=\"\"),\"\",OrdeUP100(H140)))","v":""},""]
[null,null,null,null,{"$f":"IF(OR(C141=\"\",D141=\"\"),\"\",RANK(D141,$D$2:$D$250)+(ROWS($A$1:A140)-1)/100)","v":""},{"$f":"IF(OR(C141=\"\",D141=\"\",ROWS($F$2:F141)>$L$2),\"\",INDEX($C$2:$C$250,MATCH(SMALL($E$2:$E$250,ROWS($F$2:F141)),$E$2:$E$250,0)))","v":""},{"$f":"IF(OR(C141=\"\",D141=\"\",ROWS($G$2:G141)>$L$2),\"\",IF(OR(C141=\"\",D141=\"\"),\"\",INDEX($D$2:$D$250,MATCH(F141,$C$2:$C$250,0))))","v":""},{"$f":"IF(OR(C141=\"\",D141=\"\",ROWS($H$2:H141)>$L$2),\"\",IF(OR(C141=\"\",D141=\"\"),\"\",SMALL($J$2:$J$250,ROWS($H$2:H141))))","v":""},{"$f":"IF(OR(C141=\"\",D141=\"\",ROWS($F$2:F141)>$L$2),\"\",IF(OR(C141=\"\",D141=\"\"),\"\",OrdeUP100(H141)))","v":""},""]
[null,null,null,null,{"$f":"IF(OR(C142=\"\",D142=\"\"),\"\",RANK(D142,$D$2:$D$250)+(ROWS($A$1:A141)-1)/100)","v":""},{"$f":"IF(OR(C142=\"\",D142=\"\",ROWS($F$2:F142)>$L$2),\"\",INDEX($C$2:$C$250,MATCH(SMALL($E$2:$E$250,ROWS($F$2:F142)),$E$2:$E$250,0)))","v":""},{"$f":"IF(OR(C142=\"\",D142=\"\",ROWS($G$2:G142)>$L$2),\"\",IF(OR(C142=\"\",D142=\"\"),\"\",INDEX($D$2:$D$250,MATCH(F142,$C$2:$C$250,0))))","v":""},{"$f":"IF(OR(C142=\"\",D142=\"\",ROWS($H$2:H142)>$L$2),\"\",IF(OR(C142=\"\",D142=\"\"),\"\",SMALL($J$2:$J$250,ROWS($H$2:H142))))","v":""},{"$f":"IF(OR(C142=\"\",D142=\"\",ROWS($F$2:F142)>$L$2),\"\",IF(OR(C142=\"\",D142=\"\"),\"\",OrdeUP100(H142)))","v":""},""]
[null,null,null,null,{"$f":"IF(OR(C143=\"\",D143=\"\"),\"\",RANK(D143,$D$2:$D$250)+(ROWS($A$1:A142)-1)/100)","v":""},{"$f":"IF(OR(C143=\"\",D143=\"\",ROWS($F$2:F143)>$L$2),\"\",INDEX($C$2:$C$250,MATCH(SMALL($E$2:$E$250,ROWS($F$2:F143)),$E$2:$E$250,0)))","v":""},{"$f":"IF(OR(C143=\"\",D143=\"\",ROWS($G$2:G143)>$L$2),\"\",IF(OR(C143=\"\",D143=\"\"),\"\",INDEX($D$2:$D$250,MATCH(F143,$C$2:$C$250,0))))","v":""},{"$f":"IF(OR(C143=\"\",D143=\"\",ROWS($H$2:H143)>$L$2),\"\",IF(OR(C143=\"\",D143=\"\"),\"\",SMALL($J$2:$J$250,ROWS($H$2:H143))))","v":""},{"$f":"IF(OR(C143=\"\",D143=\"\",ROWS($F$2:F143)>$L$2),\"\",IF(OR(C143=\"\",D143=\"\"),\"\",OrdeUP100(H143)))","v":""},""]
[null,null,null,null,{"$f":"IF(OR(C144=\"\",D144=\"\"),\"\",RANK(D144,$D$2:$D$250)+(ROWS($A$1:A143)-1)/100)","v":""},{"$f":"IF(OR(C144=\"\",D144=\"\",ROWS($F$2:F144)>$L$2),\"\",INDEX($C$2:$C$250,MATCH(SMALL($E$2:$E$250,ROWS($F$2:F144)),$E$2:$E$250,0)))","v":""},{"$f":"IF(OR(C144=\"\",D144=\"\",ROWS($G$2:G144)>$L$2),\"\",IF(OR(C144=\"\",D144=\"\"),\"\",INDEX($D$2:$D$250,MATCH(F144,$C$2:$C$250,0))))","v":""},{"$f":"IF(OR(C144=\"\",D144=\"\",ROWS($H$2:H144)>$L$2),\"\",IF(OR(C144=\"\",D144=\"\"),\"\",SMALL($J$2:$J$250,ROWS($H$2:H144))))","v":""},{"$f":"IF(OR(C144=\"\",D144=\"\",ROWS($F$2:F144)>$L$2),\"\",IF(OR(C144=\"\",D144=\"\"),\"\",OrdeUP100(H144)))","v":""},""]
[null,null,null,null,{"$f":"IF(OR(C145=\"\",D145=\"\"),\"\",RANK(D145,$D$2:$D$250)+(ROWS($A$1:A144)-1)/100)","v":""},{"$f":"IF(OR(C145=\"\",D145=\"\",ROWS($F$2:F145)>$L$2),\"\",INDEX($C$2:$C$250,MATCH(SMALL($E$2:$E$250,ROWS($F$2:F145)),$E$2:$E$250,0)))","v":""},{"$f":"IF(OR(C145=\"\",D145=\"\",ROWS($G$2:G145)>$L$2),\"\",IF(OR(C145=\"\",D145=\"\"),\"\",INDEX($D$2:$D$250,MATCH(F145,$C$2:$C$250,0))))","v":""},{"$f":"IF(OR(C145=\"\",D145=\"\",ROWS($H$2:H145)>$L$2),\"\",IF(OR(C145=\"\",D145=\"\"),\"\",SMALL($J$2:$J$250,ROWS($H$2:H145))))","v":""},{"$f":"IF(OR(C145=\"\",D145=\"\",ROWS($F$2:F145)>$L$2),\"\",IF(OR(C145=\"\",D145=\"\"),\"\",OrdeUP100(H145)))","v":""},""]
[null,null,null,null,{"$f":"IF(OR(C146=\"\",D146=\"\"),\"\",RANK(D146,$D$2:$D$250)+(ROWS($A$1:A145)-1)/100)","v":""},{"$f":"IF(OR(C146=\"\",D146=\"\",ROWS($F$2:F146)>$L$2),\"\",INDEX($C$2:$C$250,MATCH(SMALL($E$2:$E$250,ROWS($F$2:F146)),$E$2:$E$250,0)))","v":""},{"$f":"IF(OR(C146=\"\",D146=\"\",ROWS($G$2:G146)>$L$2),\"\",IF(OR(C146=\"\",D146=\"\"),\"\",INDEX($D$2:$D$250,MATCH(F146,$C$2:$C$250,0))))","v":""},{"$f":"IF(OR(C146=\"\",D146=\"\",ROWS($H$2:H146)>$L$2),\"\",IF(OR(C146=\"\",D146=\"\"),\"\",SMALL($J$2:$J$250,ROWS($H$2:H146))))","v":""},{"$f":"IF(OR(C146=\"\",D146=\"\",ROWS($F$2:F146)>$L$2),\"\",IF(OR(C146=\"\",D146=\"\"),\"\",OrdeUP100(H146)))","v":""},""]
[null,null,null,null,{"$f":"IF(OR(C147=\"\",D147=\"\"),\"\",RANK(D147,$D$2:$D$250)+(ROWS($A$1:A146)-1)/100)","v":""},{"$f":"IF(OR(C147=\"\",D147=\"\",ROWS($F$2:F147)>$L$2),\"\",INDEX($C$2:$C$250,MATCH(SMALL($E$2:$E$250,ROWS($F$2:F147)),$E$2:$E$250,0)))","v":""},{"$f":"IF(OR(C147=\"\",D147=\"\",ROWS($G$2:G147)>$L$2),\"\",IF(OR(C147=\"\",D147=\"\"),\"\",INDEX($D$2:$D$250,MATCH(F147,$C$2:$C$250,0))))","v":""},{"$f":"IF(OR(C147=\"\",D147=\"\",ROWS($H$2:H147)>$L$2),\"\",IF(OR(C147=\"\",D147=\"\"),\"\",SMALL($J$2:$J$250,ROWS($H$2:H147))))","v":""},{"$f":"IF(OR(C147=\"\",D147=\"\",ROWS($F$2:F147)>$L$2),\"\",IF(OR(C147=\"\",D147=\"\"),\"\",OrdeUP100(H147)))","v":""},""]
[null,null,null,null,{"$f":"IF(OR(C148=\"\",D148=\"\"),\"\",RANK(D148,$D$2:$D$250)+(ROWS($A$1:A147)-1)/100)","v":""},{"$f":"IF(OR(C148=\"\",D148=\"\",ROWS($F$2:F148)>$L$2),\"\",INDEX($C$2:$C$250,MATCH(SMALL($E$2:$E$250,ROWS($F$2:F148)),$E$2:$E$250,0)))","v":""},{"$f":"IF(OR(C148=\"\",D148=\"\",ROWS($G$2:G148)>$L$2),\"\",IF(OR(C148=\"\",D148=\"\"),\"\",INDEX($D$2:$D$250,MATCH(F148,$C$2:$C$250,0))))","v":""},{"$f":"IF(OR(C148=\"\",D148=\"\",ROWS($H$2:H148)>$L$2),\"\",IF(OR(C148=\"\",D148=\"\"),\"\",SMALL($J$2:$J$250,ROWS($H$2:H148))))","v":""},{"$f":"IF(OR(C148=\"\",D148=\"\",ROWS($F$2:F148)>$L$2),\"\",IF(OR(C148=\"\",D148=\"\"),\"\",OrdeUP100(H148)))","v":""},""]
[null,null,null,null,{"$f":"IF(OR(C149=\"\",D149=\"\"),\"\",RANK(D149,$D$2:$D$250)+(ROWS($A$1:A148)-1)/100)","v":""},{"$f":"IF(OR(C149=\"\",D149=\"\",ROWS($F$2:F149)>$L$2),\"\",INDEX($C$2:$C$250,MATCH(SMALL($E$2:$E$250,ROWS($F$2:F149)),$E$2:$E$250,0)))","v":""},{"$f":"IF(OR(C149=\"\",D149=\"\",ROWS($G$2:G149)>$L$2),\"\",IF(OR(C149=\"\",D149=\"\"),\"\",INDEX($D$2:$D$250,MATCH(F149,$C$2:$C$250,0))))","v":""},{"$f":"IF(OR(C149=\"\",D149=\"\",ROWS($H$2:H149)>$L$2),\"\",IF(OR(C149=\"\",D149=\"\"),\"\",SMALL($J$2:$J$250,ROWS($H$2:H149))))","v":""},{"$f":"IF(OR(C149=\"\",D149=\"\",ROWS($F$2:F149)>$L$2),\"\",IF(OR(C149=\"\",D149=\"\"),\"\",OrdeUP100(H149)))","v":""},""]
[null,null,null,null,{"$f":"IF(OR(C150=\"\",D150=\"\"),\"\",RANK(D150,$D$2:$D$250)+(ROWS($A$1:A149)-1)/100)","v":""},{"$f":"IF(OR(C150=\"\",D150=\"\",ROWS($F$2:F150)>$L$2),\"\",INDEX($C$2:$C$250,MATCH(SMALL($E$2:$E$250,ROWS($F$2:F150)),$E$2:$E$250,0)))","v":""},{"$f":"IF(OR(C150=\"\",D150=\"\",ROWS($G$2:G150)>$L$2),\"\",IF(OR(C150=\"\",D150=\"\"),\"\",INDEX($D$2:$D$250,MATCH(F150,$C$2:$C$250,0))))","v":""},{"$f":"IF(OR(C150=\"\",D150=\"\",ROWS($H$2:H150)>$L$2),\"\",IF(OR(C150=\"\",D150=\"\"),\"\",SMALL($J$2:$J$250,ROWS($H$2:H150))))","v":""},{"$f":"IF(OR(C150=\"\",D150=\"\",ROWS($F$2:F150)>$L$2),\"\",IF(OR(C150=\"\",D150=\"\"),\"\",OrdeUP100(H150)))","v":""},""]
[null,null,null,null,{"$f":"IF(OR(C151=\"\",D151=\"\"),\"\",RANK(D151,$D$2:$D$250)+(ROWS($A$1:A150)-1)/100)","v":""},{"$f":"IF(OR(C151=\"\",D151=\"\",ROWS($F$2:F151)>$L$2),\"\",INDEX($C$2:$C$250,MATCH(SMALL($E$2:$E$250,ROWS($F$2:F151)),$E$2:$E$250,0)))","v":""},{"$f":"IF(OR(C151=\"\",D151=\"\",ROWS($G$2:G151)>$L$2),\"\",IF(OR(C151=\"\",D151=\"\"),\"\",INDEX($D$2:$D$250,MATCH(F151,$C$2:$C$250,0))))","v":""},{"$f":"IF(OR(C151=\"\",D151=\"\",ROWS($H$2:H151)>$L$2),\"\",IF(OR(C151=\"\",D151=\"\"),\"\",SMALL($J$2:$J$250,ROWS($H$2:H151))))","v":""},{"$f":"IF(OR(C151=\"\",D151=\"\",ROWS($F$2:F151)>$L$2),\"\",IF(OR(C151=\"\",D151=\"\"),\"\",OrdeUP100(H151)))","v":""},""]
[null,null,null,null,{"$f":"IF(OR(C152=\"\",D152=\"\"),\"\",RANK(D152,$D$2:$D$250)+(ROWS($A$1:A151)-1)/100)","v":""},{"$f":"IF(OR(C152=\"\",D152=\"\",ROWS($F$2:F152)>$L$2),\"\",INDEX($C$2:$C$250,MATCH(SMALL($E$2:$E$250,ROWS($F$2:F152)),$E$2:$E$250,0)))","v":""},{"$f":"IF(OR(C152=\"\",D152=\"\",ROWS($G$2:G152)>$L$2),\"\",IF(OR(C152=\"\",D152=\"\"),\"\",INDEX($D$2:$D$250,MATCH(F152,$C$2:$C$250,0))))","v":""},{"$f":"IF(OR(C152=\"\",D152=\"\",ROWS($H$2:H152)>$L$2),\"\",IF(OR(C152=\"\",D152=\"\"),\"\",SMALL($J$2:$J$250,ROWS($H$2:H152))))","v":""},{"$f":"IF(OR(C152=\"\",D152=\"\",ROWS($F$2:F152)>$L$2),\"\",IF(OR(C152=\"\",D152=\"\"),\"\",OrdeUP100(H152)))","v":""},""]
[null,null,null,null,{"$f":"IF(OR(C153=\"\",D153=\"\"),\"\",RANK(D153,$D$2:$D$250)+(ROWS($A$1:A152)-1)/100)","v":""},{"$f":"IF(OR(C153=\"\",D153=\"\",ROWS($F$2:F153)>$L$2),\"\",INDEX($C$2:$C$250,MATCH(SMALL($E$2:$E$250,ROWS($F$2:F153)),$E$2:$E$250,0)))","v":""},{"$f":"IF(OR(C153=\"\",D153=\"\",ROWS($G$2:G153)>$L$2),\"\",IF(OR(C153=\"\",D153=\"\"),\"\",INDEX($D$2:$D$250,MATCH(F153,$C$2:$C$250,0))))","v":""},{"$f":"IF(OR(C153=\"\",D153=\"\",ROWS($H$2:H153)>$L$2),\"\",IF(OR(C153=\"\",D153=\"\"),\"\",SMALL($J$2:$J$250,ROWS($H$2:H153))))","v":""},{"$f":"IF(OR(C153=\"\",D153=\"\",ROWS($F$2:F153)>$L$2),\"\",IF(OR(C153=\"\",D153=\"\"),\"\",OrdeUP100(H153)))","v":""},""]
[null,null,null,null,{"$f":"IF(OR(C154=\"\",D154=\"\"),\"\",RANK(D154,$D$2:$D$250)+(ROWS($A$1:A153)-1)/100)","v":""},{"$f":"IF(OR(C154=\"\",D154=\"\",ROWS($F$2:F154)>$L$2),\"\",INDEX($C$2:$C$250,MATCH(SMALL($E$2:$E$250,ROWS($F$2:F154)),$E$2:$E$250,0)))","v":""},{"$f":"IF(OR(C154=\"\",D154=\"\",ROWS($G$2:G154)>$L$2),\"\",IF(OR(C154=\"\",D154=\"\"),\"\",INDEX($D$2:$D$250,MATCH(F154,$C$2:$C$250,0))))","v":""},{"$f":"IF(OR(C154=\"\",D154=\"\",ROWS($H$2:H154)>$L$2),\"\",IF(OR(C154=\"\",D154=\"\"),\"\",SMALL($J$2:$J$250,ROWS($H$2:H154))))","v":""},{"$f":"IF(OR(C154=\"\",D154=\"\",ROWS($F$2:F154)>$L$2),\"\",IF(OR(C154=\"\",D154=\"\"),\"\",OrdeUP100(H154)))","v":""},""]
[null,null,null,null,{"$f":"IF(OR(C155=\"\",D155=\"\"),\"\",RANK(D155,$D$2:$D$250)+(ROWS($A$1:A154)-1)/100)","v":""},{"$f":"IF(OR(C155=\"\",D155=\"\",ROWS($F$2:F155)>$L$2),\"\",INDEX($C$2:$C$250,MATCH(SMALL($E$2:$E$250,ROWS($F$2:F155)),$E$2:$E$250,0)))","v":""},{"$f":"IF(OR(C155=\"\",D155=\"\",ROWS($G$2:G155)>$L$2),\"\",IF(OR(C155=\"\",D155=\"\"),\"\",INDEX($D$2:$D$250,MATCH(F155,$C$2:$C$250,0))))","v":""},{"$f":"IF(OR(C155=\"\",D155=\"\",ROWS($H$2:H155)>$L$2),\"\",IF(OR(C155=\"\",D155=\"\"),\"\",SMALL($J$2:$J$250,ROWS($H$2:H155))))","v":""},{"$f":"IF(OR(C155=\"\",D155=\"\",ROWS($F$2:F155)>$L$2),\"\",IF(OR(C155=\"\",D155=\"\"),\"\",OrdeUP100(H155)))","v":""},""]
[null,null,null,null,{"$f":"IF(OR(C156=\"\",D156=\"\"),\"\",RANK(D156,$D$2:$D$250)+(ROWS($A$1:A155)-1)/100)","v":""},{"$f":"IF(OR(C156=\"\",D156=\"\",ROWS($F$2:F156)>$L$2),\"\",INDEX($C$2:$C$250,MATCH(SMALL($E$2:$E$250,ROWS($F$2:F156)),$E$2:$E$250,0)))","v":""},{"$f":"IF(OR(C156=\"\",D156=\"\",ROWS($G$2:G156)>$L$2),\"\",IF(OR(C156=\"\",D156=\"\"),\"\",INDEX($D$2:$D$250,MATCH(F156,$C$2:$C$250,0))))","v":""},{"$f":"IF(OR(C156=\"\",D156=\"\",ROWS($H$2:H156)>$L$2),\"\",IF(OR(C156=\"\",D156=\"\"),\"\",SMALL($J$2:$J$250,ROWS($H$2:H156))))","v":""},{"$f":"IF(OR(C156=\"\",D156=\"\",ROWS($F$2:F156)>$L$2),\"\",IF(OR(C156=\"\",D156=\"\"),\"\",OrdeUP100(H156)))","v":""},""]
[null,null,null,null,{"$f":"IF(OR(C157=\"\",D157=\"\"),\"\",RANK(D157,$D$2:$D$250)+(ROWS($A$1:A156)-1)/100)","v":""},{"$f":"IF(OR(C157=\"\",D157=\"\",ROWS($F$2:F157)>$L$2),\"\",INDEX($C$2:$C$250,MATCH(SMALL($E$2:$E$250,ROWS($F$2:F157)),$E$2:$E$250,0)))","v":""},{"$f":"IF(OR(C157=\"\",D157=\"\",ROWS($G$2:G157)>$L$2),\"\",IF(OR(C157=\"\",D157=\"\"),\"\",INDEX($D$2:$D$250,MATCH(F157,$C$2:$C$250,0))))","v":""},{"$f":"IF(OR(C157=\"\",D157=\"\",ROWS($H$2:H157)>$L$2),\"\",IF(OR(C157=\"\",D157=\"\"),\"\",SMALL($J$2:$J$250,ROWS($H$2:H157))))","v":""},{"$f":"IF(OR(C157=\"\",D157=\"\",ROWS($F$2:F157)>$L$2),\"\",IF(OR(C157=\"\",D157=\"\"),\"\",OrdeUP100(H157)))","v":""},""]
[null,null,null,null,{"$f":"IF(OR(C158=\"\",D158=\"\"),\"\",RANK(D158,$D$2:$D$250)+(ROWS($A$1:A157)-1)/100)","v":""},{"$f":"IF(OR(C158=\"\",D158=\"\",ROWS($F$2:F158)>$L$2),\"\",INDEX($C$2:$C$250,MATCH(SMALL($E$2:$E$250,ROWS($F$2:F158)),$E$2:$E$250,0)))","v":""},{"$f":"IF(OR(C158=\"\",D158=\"\",ROWS($G$2:G158)>$L$2),\"\",IF(OR(C158=\"\",D158=\"\"),\"\",INDEX($D$2:$D$250,MATCH(F158,$C$2:$C$250,0))))","v":""},{"$f":"IF(OR(C158=\"\",D158=\"\",ROWS($H$2:H158)>$L$2),\"\",IF(OR(C158=\"\",D158=\"\"),\"\",SMALL($J$2:$J$250,ROWS($H$2:H158))))","v":""},{"$f":"IF(OR(C158=\"\",D158=\"\",ROWS($F$2:F158)>$L$2),\"\",IF(OR(C158=\"\",D158=\"\"),\"\",OrdeUP100(H158)))","v":""},""]
[null,null,null,null,{"$f":"IF(OR(C159=\"\",D159=\"\"),\"\",RANK(D159,$D$2:$D$250)+(ROWS($A$1:A158)-1)/100)","v":""},{"$f":"IF(OR(C159=\"\",D159=\"\",ROWS($F$2:F159)>$L$2),\"\",INDEX($C$2:$C$250,MATCH(SMALL($E$2:$E$250,ROWS($F$2:F159)),$E$2:$E$250,0)))","v":""},{"$f":"IF(OR(C159=\"\",D159=\"\",ROWS($G$2:G159)>$L$2),\"\",IF(OR(C159=\"\",D159=\"\"),\"\",INDEX($D$2:$D$250,MATCH(F159,$C$2:$C$250,0))))","v":""},{"$f":"IF(OR(C159=\"\",D159=\"\",ROWS($H$2:H159)>$L$2),\"\",IF(OR(C159=\"\",D159=\"\"),\"\",SMALL($J$2:$J$250,ROWS($H$2:H159))))","v":""},{"$f":"IF(OR(C159=\"\",D159=\"\",ROWS($F$2:F159)>$L$2),\"\",IF(OR(C159=\"\",D159=\"\"),\"\",OrdeUP100(H159)))","v":""},""]
[null,null,null,null,{"$f":"IF(OR(C160=\"\",D160=\"\"),\"\",RANK(D160,$D$2:$D$250)+(ROWS($A$1:A159)-1)/100)","v":""},{"$f":"IF(OR(C160=\"\",D160=\"\",ROWS($F$2:F160)>$L$2),\"\",INDEX($C$2:$C$250,MATCH(SMALL($E$2:$E$250,ROWS($F$2:F160)),$E$2:$E$250,0)))","v":""},{"$f":"IF(OR(C160=\"\",D160=\"\",ROWS($G$2:G160)>$L$2),\"\",IF(OR(C160=\"\",D160=\"\"),\"\",INDEX($D$2:$D$250,MATCH(F160,$C$2:$C$250,0))))","v":""},{"$f":"IF(OR(C160=\"\",D160=\"\",ROWS($H$2:H160)>$L$2),\"\",IF(OR(C160=\"\",D160=\"\"),\"\",SMALL($J$2:$J$250,ROWS($H$2:H160))))","v":""},{"$f":"IF(OR(C160=\"\",D160=\"\",ROWS($F$2:F160)>$L$2),\"\",IF(OR(C160=\"\",D160=\"\"),\"\",OrdeUP100(H160)))","v":""},""]
[null,null,null,null,{"$f":"IF(OR(C161=\"\",D161=\"\"),\"\",RANK(D161,$D$2:$D$250)+(ROWS($A$1:A160)-1)/100)","v":""},{"$f":"IF(OR(C161=\"\",D161=\"\",ROWS($F$2:F161)>$L$2),\"\",INDEX($C$2:$C$250,MATCH(SMALL($E$2:$E$250,ROWS($F$2:F161)),$E$2:$E$250,0)))","v":""},{"$f":"IF(OR(C161=\"\",D161=\"\",ROWS($G$2:G161)>$L$2),\"\",IF(OR(C161=\"\",D161=\"\"),\"\",INDEX($D$2:$D$250,MATCH(F161,$C$2:$C$250,0))))","v":""},{"$f":"IF(OR(C161=\"\",D161=\"\",ROWS($H$2:H161)>$L$2),\"\",IF(OR(C161=\"\",D161=\"\"),\"\",SMALL($J$2:$J$250,ROWS($H$2:H161))))","v":""},{"$f":"IF(OR(C161=\"\",D161=\"\",ROWS($F$2:F161)>$L$2),\"\",IF(OR(C161=\"\",D161=\"\"),\"\",OrdeUP100(H161)))","v":""},""]
[null,null,null,null,{"$f":"IF(OR(C162=\"\",D162=\"\"),\"\",RANK(D162,$D$2:$D$250)+(ROWS($A$1:A161)-1)/100)","v":""},{"$f":"IF(OR(C162=\"\",D162=\"\",ROWS($F$2:F162)>$L$2),\"\",INDEX($C$2:$C$250,MATCH(SMALL($E$2:$E$250,ROWS($F$2:F162)),$E$2:$E$250,0)))","v":""},{"$f":"IF(OR(C162=\"\",D162=\"\",ROWS($G$2:G162)>$L$2),\"\",IF(OR(C162=\"\",D162=\"\"),\"\",INDEX($D$2:$D$250,MATCH(F162,$C$2:$C$250,0))))","v":""},{"$f":"IF(OR(C162=\"\",D162=\"\",ROWS($H$2:H162)>$L$2),\"\",IF(OR(C162=\"\",D162=\"\"),\"\",SMALL($J$2:$J$250,ROWS($H$2:H162))))","v":""},{"$f":"IF(OR(C162=\"\",D162=\"\",ROWS($F$2:F162)>$L$2),\"\",IF(OR(C162=\"\",D162=\"\"),\"\",OrdeUP100(H162)))","v":""},""]
[null,null,null,null,{"$f":"IF(OR(C163=\"\",D163=\"\"),\"\",RANK(D163,$D$2:$D$250)+(ROWS($A$1:A162)-1)/100)","v":""},{"$f":"IF(OR(C163=\"\",D163=\"\",ROWS($F$2:F163)>$L$2),\"\",INDEX($C$2:$C$250,MATCH(SMALL($E$2:$E$250,ROWS($F$2:F163)),$E$2:$E$250,0)))","v":""},{"$f":"IF(OR(C163=\"\",D163=\"\",ROWS($G$2:G163)>$L$2),\"\",IF(OR(C163=\"\",D163=\"\"),\"\",INDEX($D$2:$D$250,MATCH(F163,$C$2:$C$250,0))))","v":""},{"$f":"IF(OR(C163=\"\",D163=\"\",ROWS($H$2:H163)>$L$2),\"\",IF(OR(C163=\"\",D163=\"\"),\"\",SMALL($J$2:$J$250,ROWS($H$2:H163))))","v":""},{"$f":"IF(OR(C163=\"\",D163=\"\",ROWS($F$2:F163)>$L$2),\"\",IF(OR(C163=\"\",D163=\"\"),\"\",OrdeUP100(H163)))","v":""},""]
[null,null,null,null,{"$f":"IF(OR(C164=\"\",D164=\"\"),\"\",RANK(D164,$D$2:$D$250)+(ROWS($A$1:A163)-1)/100)","v":""},{"$f":"IF(OR(C164=\"\",D164=\"\",ROWS($F$2:F164)>$L$2),\"\",INDEX($C$2:$C$250,MATCH(SMALL($E$2:$E$250,ROWS($F$2:F164)),$E$2:$E$250,0)))","v":""},{"$f":"IF(OR(C164=\"\",D164=\"\",ROWS($G$2:G164)>$L$2),\"\",IF(OR(C164=\"\",D164=\"\"),\"\",INDEX($D$2:$D$250,MATCH(F164,$C$2:$C$250,0))))","v":""},{"$f":"IF(OR(C164=\"\",D164=\"\",ROWS($H$2:H164)>$L$2),\"\",IF(OR(C164=\"\",D164=\"\"),\"\",SMALL($J$2:$J$250,ROWS($H$2:H164))))","v":""},{"$f":"IF(OR(C164=\"\",D164=\"\",ROWS($F$2:F164)>$L$2),\"\",IF(OR(C164=\"\",D164=\"\"),\"\",OrdeUP100(H164)))","v":""},""]
[null,null,null,null,{"$f":"IF(OR(C165=\"\",D165=\"\"),\"\",RANK(D165,$D$2:$D$250)+(ROWS($A$1:A164)-1)/100)","v":""},{"$f":"IF(OR(C165=\"\",D165=\"\",ROWS($F$2:F165)>$L$2),\"\",INDEX($C$2:$C$250,MATCH(SMALL($E$2:$E$250,ROWS($F$2:F165)),$E$2:$E$250,0)))","v":""},{"$f":"IF(OR(C165=\"\",D165=\"\",ROWS($G$2:G165)>$L$2),\"\",IF(OR(C165=\"\",D165=\"\"),\"\",INDEX($D$2:$D$250,MATCH(F165,$C$2:$C$250,0))))","v":""},{"$f":"IF(OR(C165=\"\",D165=\"\",ROWS($H$2:H165)>$L$2),\"\",IF(OR(C165=\"\",D165=\"\"),\"\",SMALL($J$2:$J$250,ROWS($H$2:H165))))","v":""},{"$f":"IF(OR(C165=\"\",D165=\"\",ROWS($F$2:F165)>$L$2),\"\",IF(OR(C165=\"\",D165=\"\"),\"\",OrdeUP100(H165)))","v":""},""]
[null,null,null,null,{"$f":"IF(OR(C166=\"\",D166=\"\"),\"\",RANK(D166,$D$2:$D$250)+(ROWS($A$1:A165)-1)/100)","v":""},{"$f":"IF(OR(C166=\"\",D166=\"\",ROWS($F$2:F166)>$L$2),\"\",INDEX($C$2:$C$250,MATCH(SMALL($E$2:$E$250,ROWS($F$2:F166)),$E$2:$E$250,0)))","v":""},{"$f":"IF(OR(C166=\"\",D166=\"\",ROWS($G$2:G166)>$L$2),\"\",IF(OR(C166=\"\",D166=\"\"),\"\",INDEX($D$2:$D$250,MATCH(F166,$C$2:$C$250,0))))","v":""},{"$f":"IF(OR(C166=\"\",D166=\"\",ROWS($H$2:H166)>$L$2),\"\",IF(OR(C166=\"\",D166=\"\"),\"\",SMALL($J$2:$J$250,ROWS($H$2:H166))))","v":""},{"$f":"IF(OR(C166=\"\",D166=\"\",ROWS($F$2:F166)>$L$2),\"\",IF(OR(C166=\"\",D166=\"\"),\"\",OrdeUP100(H166)))","v":""},""]
[null,null,null,null,{"$f":"IF(OR(C167=\"\",D167=\"\"),\"\",RANK(D167,$D$2:$D$250)+(ROWS($A$1:A166)-1)/100)","v":""},{"$f":"IF(OR(C167=\"\",D167=\"\",ROWS($F$2:F167)>$L$2),\"\",INDEX($C$2:$C$250,MATCH(SMALL($E$2:$E$250,ROWS($F$2:F167)),$E$2:$E$250,0)))","v":""},{"$f":"IF(OR(C167=\"\",D167=\"\",ROWS($G$2:G167)>$L$2),\"\",IF(OR(C167=\"\",D167=\"\"),\"\",INDEX($D$2:$D$250,MATCH(F167,$C$2:$C$250,0))))","v":""},{"$f":"IF(OR(C167=\"\",D167=\"\",ROWS($H$2:H167)>$L$2),\"\",IF(OR(C167=\"\",D167=\"\"),\"\",SMALL($J$2:$J$250,ROWS($H$2:H167))))","v":""},{"$f":"IF(OR(C167=\"\",D167=\"\",ROWS($F$2:F167)>$L$2),\"\",IF(OR(C167=\"\",D167=\"\"),\"\",OrdeUP100(H167)))","v":""},""]
[null,null,null,null,{"$f":"IF(OR(C168=\"\",D168=\"\"),\"\",RANK(D168,$D$2:$D$250)+(ROWS($A$1:A167)-1)/100)","v":""},{"$f":"IF(OR(C168=\"\",D168=\"\",ROWS($F$2:F168)>$L$2),\"\",INDEX($C$2:$C$250,MATCH(SMALL($E$2:$E$250,ROWS($F$2:F168)),$E$2:$E$250,0)))","v":""},{"$f":"IF(OR(C168=\"\",D168=\"\",ROWS($G$2:G168)>$L$2),\"\",IF(OR(C168=\"\",D168=\"\"),\"\",INDEX($D$2:$D$250,MATCH(F168,$C$2:$C$250,0))))","v":""},{"$f":"IF(OR(C168=\"\",D168=\"\",ROWS($H$2:H168)>$L$2),\"\",IF(OR(C168=\"\",D168=\"\"),\"\",SMALL($J$2:$J$250,ROWS($H$2:H168))))","v":""},{"$f":"IF(OR(C168=\"\",D168=\"\",ROWS($F$2:F168)>$L$2),\"\",IF(OR(C168=\"\",D168=\"\"),\"\",OrdeUP100(H168)))","v":""},""]
[null,null,null,null,{"$f":"IF(OR(C169=\"\",D169=\"\"),\"\",RANK(D169,$D$2:$D$250)+(ROWS($A$1:A168)-1)/100)","v":""},{"$f":"IF(OR(C169=\"\",D169=\"\",ROWS($F$2:F169)>$L$2),\"\",INDEX($C$2:$C$250,MATCH(SMALL($E$2:$E$250,ROWS($F$2:F169)),$E$2:$E$250,0)))","v":""},{"$f":"IF(OR(C169=\"\",D169=\"\",ROWS($G$2:G169)>$L$2),\"\",IF(OR(C169=\"\",D169=\"\"),\"\",INDEX($D$2:$D$250,MATCH(F169,$C$2:$C$250,0))))","v":""},{"$f":"IF(OR(C169=\"\",D169=\"\",ROWS($H$2:H169)>$L$2),\"\",IF(OR(C169=\"\",D169=\"\"),\"\",SMALL($J$2:$J$250,ROWS($H$2:H169))))","v":""},{"$f":"IF(OR(C169=\"\",D169=\"\",ROWS($F$2:F169)>$L$2),\"\",IF(OR(C169=\"\",D169=\"\"),\"\",OrdeUP100(H169)))","v":""},""]
[null,null,null,null,{"$f":"IF(OR(C170=\"\",D170=\"\"),\"\",RANK(D170,$D$2:$D$250)+(ROWS($A$1:A169)-1)/100)","v":""},{"$f":"IF(OR(C170=\"\",D170=\"\",ROWS($F$2:F170)>$L$2),\"\",INDEX($C$2:$C$250,MATCH(SMALL($E$2:$E$250,ROWS($F$2:F170)),$E$2:$E$250,0)))","v":""},{"$f":"IF(OR(C170=\"\",D170=\"\",ROWS($G$2:G170)>$L$2),\"\",IF(OR(C170=\"\",D170=\"\"),\"\",INDEX($D$2:$D$250,MATCH(F170,$C$2:$C$250,0))))","v":""},{"$f":"IF(OR(C170=\"\",D170=\"\",ROWS($H$2:H170)>$L$2),\"\",IF(OR(C170=\"\",D170=\"\"),\"\",SMALL($J$2:$J$250,ROWS($H$2:H170))))","v":""},{"$f":"IF(OR(C170=\"\",D170=\"\",ROWS($F$2:F170)>$L$2),\"\",IF(OR(C170=\"\",D170=\"\"),\"\",OrdeUP100(H170)))","v":""},""]
[null,null,null,null,{"$f":"IF(OR(C171=\"\",D171=\"\"),\"\",RANK(D171,$D$2:$D$250)+(ROWS($A$1:A170)-1)/100)","v":""},{"$f":"IF(OR(C171=\"\",D171=\"\",ROWS($F$2:F171)>$L$2),\"\",INDEX($C$2:$C$250,MATCH(SMALL($E$2:$E$250,ROWS($F$2:F171)),$E$2:$E$250,0)))","v":""},{"$f":"IF(OR(C171=\"\",D171=\"\",ROWS($G$2:G171)>$L$2),\"\",IF(OR(C171=\"\",D171=\"\"),\"\",INDEX($D$2:$D$250,MATCH(F171,$C$2:$C$250,0))))","v":""},{"$f":"IF(OR(C171=\"\",D171=\"\",ROWS($H$2:H171)>$L$2),\"\",IF(OR(C171=\"\",D171=\"\"),\"\",SMALL($J$2:$J$250,ROWS($H$2:H171))))","v":""},{"$f":"IF(OR(C171=\"\",D171=\"\",ROWS($F$2:F171)>$L$2),\"\",IF(OR(C171=\"\",D171=\"\"),\"\",OrdeUP100(H171)))","v":""},""]
[null,null,null,null,{"$f":"IF(OR(C172=\"\",D172=\"\"),\"\",RANK(D172,$D$2:$D$250)+(ROWS($A$1:A171)-1)/100)","v":""},{"$f":"IF(OR(C172=\"\",D172=\"\",ROWS($F$2:F172)>$L$2),\"\",INDEX($C$2:$C$250,MATCH(SMALL($E$2:$E$250,ROWS($F$2:F172)),$E$2:$E$250,0)))","v":""},{"$f":"IF(OR(C172=\"\",D172=\"\",ROWS($G$2:G172)>$L$2),\"\",IF(OR(C172=\"\",D172=\"\"),\"\",INDEX($D$2:$D$250,MATCH(F172,$C$2:$C$250,0))))","v":""},{"$f":"IF(OR(C172=\"\",D172=\"\",ROWS($H$2:H172)>$L$2),\"\",IF(OR(C172=\"\",D172=\"\"),\"\",SMALL($J$2:$J$250,ROWS($H$2:H172))))","v":""},{"$f":"IF(OR(C172=\"\",D172=\"\",ROWS($F$2:F172)>$L$2),\"\",IF(OR(C172=\"\",D172=\"\"),\"\",OrdeUP100(H172)))","v":""},""]
[null,null,null,null,{"$f":"IF(OR(C173=\"\",D173=\"\"),\"\",RANK(D173,$D$2:$D$250)+(ROWS($A$1:A172)-1)/100)","v":""},{"$f":"IF(OR(C173=\"\",D173=\"\",ROWS($F$2:F173)>$L$2),\"\",INDEX($C$2:$C$250,MATCH(SMALL($E$2:$E$250,ROWS($F$2:F173)),$E$2:$E$250,0)))","v":""},{"$f":"IF(OR(C173=\"\",D173=\"\",ROWS($G$2:G173)>$L$2),\"\",IF(OR(C173=\"\",D173=\"\"),\"\",INDEX($D$2:$D$250,MATCH(F173,$C$2:$C$250,0))))","v":""},{"$f":"IF(OR(C173=\"\",D173=\"\",ROWS($H$2:H173)>$L$2),\"\",IF(OR(C173=\"\",D173=\"\"),\"\",SMALL($J$2:$J$250,ROWS($H$2:H173))))","v":""},{"$f":"IF(OR(C173=\"\",D173=\"\",ROWS($F$2:F173)>$L$2),\"\",IF(OR(C173=\"\",D173=\"\"),\"\",OrdeUP100(H173)))","v":""},""]
[null,null,null,null,{"$f":"IF(OR(C174=\"\",D174=\"\"),\"\",RANK(D174,$D$2:$D$250)+(ROWS($A$1:A173)-1)/100)","v":""},{"$f":"IF(OR(C174=\"\",D174=\"\",ROWS($F$2:F174)>$L$2),\"\",INDEX($C$2:$C$250,MATCH(SMALL($E$2:$E$250,ROWS($F$2:F174)),$E$2:$E$250,0)))","v":""},{"$f":"IF(OR(C174=\"\",D174=\"\",ROWS($G$2:G174)>$L$2),\"\",IF(OR(C174=\"\",D174=\"\"),\"\",INDEX($D$2:$D$250,MATCH(F174,$C$2:$C$250,0))))","v":""},{"$f":"IF(OR(C174=\"\",D174=\"\",ROWS($H$2:H174)>$L$2),\"\",IF(OR(C174=\"\",D174=\"\"),\"\",SMALL($J$2:$J$250,ROWS($H$2:H174))))","v":""},{"$f":"IF(OR(C174=\"\",D174=\"\",ROWS($F$2:F174)>$L$2),\"\",IF(OR(C174=\"\",D174=\"\"),\"\",OrdeUP100(H174)))","v":""},""]
[null,null,null,null,{"$f":"IF(OR(C175=\"\",D175=\"\"),\"\",RANK(D175,$D$2:$D$250)+(ROWS($A$1:A174)-1)/100)","v":""},{"$f":"IF(OR(C175=\"\",D175=\"\",ROWS($F$2:F175)>$L$2),\"\",INDEX($C$2:$C$250,MATCH(SMALL($E$2:$E$250,ROWS($F$2:F175)),$E$2:$E$250,0)))","v":""},{"$f":"IF(OR(C175=\"\",D175=\"\",ROWS($G$2:G175)>$L$2),\"\",IF(OR(C175=\"\",D175=\"\"),\"\",INDEX($D$2:$D$250,MATCH(F175,$C$2:$C$250,0))))","v":""},{"$f":"IF(OR(C175=\"\",D175=\"\",ROWS($H$2:H175)>$L$2),\"\",IF(OR(C175=\"\",D175=\"\"),\"\",SMALL($J$2:$J$250,ROWS($H$2:H175))))","v":""},{"$f":"IF(OR(C175=\"\",D175=\"\",ROWS($F$2:F175)>$L$2),\"\",IF(OR(C175=\"\",D175=\"\"),\"\",OrdeUP100(H175)))","v":""},""]
[null,null,null,null,{"$f":"IF(OR(C176=\"\",D176=\"\"),\"\",RANK(D176,$D$2:$D$250)+(ROWS($A$1:A175)-1)/100)","v":""},{"$f":"IF(OR(C176=\"\",D176=\"\",ROWS($F$2:F176)>$L$2),\"\",INDEX($C$2:$C$250,MATCH(SMALL($E$2:$E$250,ROWS($F$2:F176)),$E$2:$E$250,0)))","v":""},{"$f":"IF(OR(C176=\"\",D176=\"\",ROWS($G$2:G176)>$L$2),\"\",IF(OR(C176=\"\",D176=\"\"),\"\",INDEX($D$2:$D$250,MATCH(F176,$C$2:$C$250,0))))","v":""},{"$f":"IF(OR(C176=\"\",D176=\"\",ROWS($H$2:H176)>$L$2),\"\",IF(OR(C176=\"\",D176=\"\"),\"\",SMALL($J$2:$J$250,ROWS($H$2:H176))))","v":""},{"$f":"IF(OR(C176=\"\",D176=\"\",ROWS($F$2:F176)>$L$2),\"\",IF(OR(C176=\"\",D176=\"\"),\"\",OrdeUP100(H176)))","v":""},""]
[null,null,null,null,{"$f":"IF(OR(C177=\"\",D177=\"\"),\"\",RANK(D177,$D$2:$D$250)+(ROWS($A$1:A176)-1)/100)","v":""},{"$f":"IF(OR(C177=\"\",D177=\"\",ROWS($F$2:F177)>$L$2),\"\",INDEX($C$2:$C$250,MATCH(SMALL($E$2:$E$250,ROWS($F$2:F177)),$E$2:$E$250,0)))","v":""},{"$f":"IF(OR(C177=\"\",D177=\"\",ROWS($G$2:G177)>$L$2),\"\",IF(OR(C177=\"\",D177=\"\"),\"\",INDEX($D$2:$D$250,MATCH(F177,$C$2:$C$250,0))))","v":""},{"$f":"IF(OR(C177=\"\",D177=\"\",ROWS($H$2:H177)>$L$2),\"\",IF(OR(C177=\"\",D177=\"\"),\"\",SMALL($J$2:$J$250,ROWS($H$2:H177))))","v":""},{"$f":"IF(OR(C177=\"\",D177=\"\",ROWS($F$2:F177)>$L$2),\"\",IF(OR(C177=\"\",D177=\"\"),\"\",OrdeUP100(H177)))","v":""},""]
[null,null,null,null,{"$f":"IF(OR(C178=\"\",D178=\"\"),\"\",RANK(D178,$D$2:$D$250)+(ROWS($A$1:A177)-1)/100)","v":""},{"$f":"IF(OR(C178=\"\",D178=\"\",ROWS($F$2:F178)>$L$2),\"\",INDEX($C$2:$C$250,MATCH(SMALL($E$2:$E$250,ROWS($F$2:F178)),$E$2:$E$250,0)))","v":""},{"$f":"IF(OR(C178=\"\",D178=\"\",ROWS($G$2:G178)>$L$2),\"\",IF(OR(C178=\"\",D178=\"\"),\"\",INDEX($D$2:$D$250,MATCH(F178,$C$2:$C$250,0))))","v":""},{"$f":"IF(OR(C178=\"\",D178=\"\",ROWS($H$2:H178)>$L$2),\"\",IF(OR(C178=\"\",D178=\"\"),\"\",SMALL($J$2:$J$250,ROWS($H$2:H178))))","v":""},{"$f":"IF(OR(C178=\"\",D178=\"\",ROWS($F$2:F178)>$L$2),\"\",IF(OR(C178=\"\",D178=\"\"),\"\",OrdeUP100(H178)))","v":""},""]
[null,null,null,null,{"$f":"IF(OR(C179=\"\",D179=\"\"),\"\",RANK(D179,$D$2:$D$250)+(ROWS($A$1:A178)-1)/100)","v":""},{"$f":"IF(OR(C179=\"\",D179=\"\",ROWS($F$2:F179)>$L$2),\"\",INDEX($C$2:$C$250,MATCH(SMALL($E$2:$E$250,ROWS($F$2:F179)),$E$2:$E$250,0)))","v":""},{"$f":"IF(OR(C179=\"\",D179=\"\",ROWS($G$2:G179)>$L$2),\"\",IF(OR(C179=\"\",D179=\"\"),\"\",INDEX($D$2:$D$250,MATCH(F179,$C$2:$C$250,0))))","v":""},{"$f":"IF(OR(C179=\"\",D179=\"\",ROWS($H$2:H179)>$L$2),\"\",IF(OR(C179=\"\",D179=\"\"),\"\",SMALL($J$2:$J$250,ROWS($H$2:H179))))","v":""},{"$f":"IF(OR(C179=\"\",D179=\"\",ROWS($F$2:F179)>$L$2),\"\",IF(OR(C179=\"\",D179=\"\"),\"\",OrdeUP100(H179)))","v":""},""]
[null,null,null,null,{"$f":"IF(OR(C180=\"\",D180=\"\"),\"\",RANK(D180,$D$2:$D$250)+(ROWS($A$1:A179)-1)/100)","v":""},{"$f":"IF(OR(C180=\"\",D180=\"\",ROWS($F$2:F180)>$L$2),\"\",INDEX($C$2:$C$250,MATCH(SMALL($E$2:$E$250,ROWS($F$2:F180)),$E$2:$E$250,0)))","v":""},{"$f":"IF(OR(C180=\"\",D180=\"\",ROWS($G$2:G180)>$L$2),\"\",IF(OR(C180=\"\",D180=\"\"),\"\",INDEX($D$2:$D$250,MATCH(F180,$C$2:$C$250,0))))","v":""},{"$f":"IF(OR(C180=\"\",D180=\"\",ROWS($H$2:H180)>$L$2),\"\",IF(OR(C180=\"\",D180=\"\"),\"\",SMALL($J$2:$J$250,ROWS($H$2:H180))))","v":""},{"$f":"IF(OR(C180=\"\",D180=\"\",ROWS($F$2:F180)>$L$2),\"\",IF(OR(C180=\"\",D180=\"\"),\"\",OrdeUP100(H180)))","v":""},""]
[null,null,null,null,{"$f":"IF(OR(C181=\"\",D181=\"\"),\"\",RANK(D181,$D$2:$D$250)+(ROWS($A$1:A180)-1)/100)","v":""},{"$f":"IF(OR(C181=\"\",D181=\"\",ROWS($F$2:F181)>$L$2),\"\",INDEX($C$2:$C$250,MATCH(SMALL($E$2:$E$250,ROWS($F$2:F181)),$E$2:$E$250,0)))","v":""},{"$f":"IF(OR(C181=\"\",D181=\"\",ROWS($G$2:G181)>$L$2),\"\",IF(OR(C181=\"\",D181=\"\"),\"\",INDEX($D$2:$D$250,MATCH(F181,$C$2:$C$250,0))))","v":""},{"$f":"IF(OR(C181=\"\",D181=\"\",ROWS($H$2:H181)>$L$2),\"\",IF(OR(C181=\"\",D181=\"\"),\"\",SMALL($J$2:$J$250,ROWS($H$2:H181))))","v":""},{"$f":"IF(OR(C181=\"\",D181=\"\",ROWS($F$2:F181)>$L$2),\"\",IF(OR(C181=\"\",D181=\"\"),\"\",OrdeUP100(H181)))","v":""},""]
[null,null,null,null,{"$f":"IF(OR(C182=\"\",D182=\"\"),\"\",RANK(D182,$D$2:$D$250)+(ROWS($A$1:A181)-1)/100)","v":""},{"$f":"IF(OR(C182=\"\",D182=\"\",ROWS($F$2:F182)>$L$2),\"\",INDEX($C$2:$C$250,MATCH(SMALL($E$2:$E$250,ROWS($F$2:F182)),$E$2:$E$250,0)))","v":""},{"$f":"IF(OR(C182=\"\",D182=\"\",ROWS($G$2:G182)>$L$2),\"\",IF(OR(C182=\"\",D182=\"\"),\"\",INDEX($D$2:$D$250,MATCH(F182,$C$2:$C$250,0))))","v":""},{"$f":"IF(OR(C182=\"\",D182=\"\",ROWS($H$2:H182)>$L$2),\"\",IF(OR(C182=\"\",D182=\"\"),\"\",SMALL($J$2:$J$250,ROWS($H$2:H182))))","v":""},{"$f":"IF(OR(C182=\"\",D182=\"\",ROWS($F$2:F182)>$L$2),\"\",IF(OR(C182=\"\",D182=\"\"),\"\",OrdeUP100(H182)))","v":""},""]
[null,null,null,null,{"$f":"IF(OR(C183=\"\",D183=\"\"),\"\",RANK(D183,$D$2:$D$250)+(ROWS($A$1:A182)-1)/100)","v":""},{"$f":"IF(OR(C183=\"\",D183=\"\",ROWS($F$2:F183)>$L$2),\"\",INDEX($C$2:$C$250,MATCH(SMALL($E$2:$E$250,ROWS($F$2:F183)),$E$2:$E$250,0)))","v":""},{"$f":"IF(OR(C183=\"\",D183=\"\",ROWS($G$2:G183)>$L$2),\"\",IF(OR(C183=\"\",D183=\"\"),\"\",INDEX($D$2:$D$250,MATCH(F183,$C$2:$C$250,0))))","v":""},{"$f":"IF(OR(C183=\"\",D183=\"\",ROWS($H$2:H183)>$L$2),\"\",IF(OR(C183=\"\",D183=\"\"),\"\",SMALL($J$2:$J$250,ROWS($H$2:H183))))","v":""},{"$f":"IF(OR(C183=\"\",D183=\"\",ROWS($F$2:F183)>$L$2),\"\",IF(OR(C183=\"\",D183=\"\"),\"\",OrdeUP100(H183)))","v":""},""]
[null,null,null,null,{"$f":"IF(OR(C184=\"\",D184=\"\"),\"\",RANK(D184,$D$2:$D$250)+(ROWS($A$1:A183)-1)/100)","v":""},{"$f":"IF(OR(C184=\"\",D184=\"\",ROWS($F$2:F184)>$L$2),\"\",INDEX($C$2:$C$250,MATCH(SMALL($E$2:$E$250,ROWS($F$2:F184)),$E$2:$E$250,0)))","v":""},{"$f":"IF(OR(C184=\"\",D184=\"\",ROWS($G$2:G184)>$L$2),\"\",IF(OR(C184=\"\",D184=\"\"),\"\",INDEX($D$2:$D$250,MATCH(F184,$C$2:$C$250,0))))","v":""},{"$f":"IF(OR(C184=\"\",D184=\"\",ROWS($H$2:H184)>$L$2),\"\",IF(OR(C184=\"\",D184=\"\"),\"\",SMALL($J$2:$J$250,ROWS($H$2:H184))))","v":""},{"$f":"IF(OR(C184=\"\",D184=\"\",ROWS($F$2:F184)>$L$2),\"\",IF(OR(C184=\"\",D184=\"\"),\"\",OrdeUP100(H184)))","v":""},""]
[null,null,null,null,{"$f":"IF(OR(C185=\"\",D185=\"\"),\"\",RANK(D185,$D$2:$D$250)+(ROWS($A$1:A184)-1)/100)","v":""},{"$f":"IF(OR(C185=\"\",D185=\"\",ROWS($F$2:F185)>$L$2),\"\",INDEX($C$2:$C$250,MATCH(SMALL($E$2:$E$250,ROWS($F$2:F185)),$E$2:$E$250,0)))","v":""},{"$f":"IF(OR(C185=\"\",D185=\"\",ROWS($G$2:G185)>$L$2),\"\",IF(OR(C185=\"\",D185=\"\"),\"\",INDEX($D$2:$D$250,MATCH(F185,$C$2:$C$250,0))))","v":""},{"$f":"IF(OR(C185=\"\",D185=\"\",ROWS($H$2:H185)>$L$2),\"\",IF(OR(C185=\"\",D185=\"\"),\"\",SMALL($J$2:$J$250,ROWS($H$2:H185))))","v":""},{"$f":"IF(OR(C185=\"\",D185=\"\",ROWS($F$2:F185)>$L$2),\"\",IF(OR(C185=\"\",D185=\"\"),\"\",OrdeUP100(H185)))","v":""},""]
[null,null,null,null,{"$f":"IF(OR(C186=\"\",D186=\"\"),\"\",RANK(D186,$D$2:$D$250)+(ROWS($A$1:A185)-1)/100)","v":""},{"$f":"IF(OR(C186=\"\",D186=\"\",ROWS($F$2:F186)>$L$2),\"\",INDEX($C$2:$C$250,MATCH(SMALL($E$2:$E$250,ROWS($F$2:F186)),$E$2:$E$250,0)))","v":""},{"$f":"IF(OR(C186=\"\",D186=\"\",ROWS($G$2:G186)>$L$2),\"\",IF(OR(C186=\"\",D186=\"\"),\"\",INDEX($D$2:$D$250,MATCH(F186,$C$2:$C$250,0))))","v":""},{"$f":"IF(OR(C186=\"\",D186=\"\",ROWS($H$2:H186)>$L$2),\"\",IF(OR(C186=\"\",D186=\"\"),\"\",SMALL($J$2:$J$250,ROWS($H$2:H186))))","v":""},{"$f":"IF(OR(C186=\"\",D186=\"\",ROWS($F$2:F186)>$L$2),\"\",IF(OR(C186=\"\",D186=\"\"),\"\",OrdeUP100(H186)))","v":""},""]
[null,null,null,null,{"$f":"IF(OR(C187=\"\",D187=\"\"),\"\",RANK(D187,$D$2:$D$250)+(ROWS($A$1:A186)-1)/100)","v":""},{"$f":"IF(OR(C187=\"\",D187=\"\",ROWS($F$2:F187)>$L$2),\"\",INDEX($C$2:$C$250,MATCH(SMALL($E$2:$E$250,ROWS($F$2:F187)),$E$2:$E$250,0)))","v":""},{"$f":"IF(OR(C187=\"\",D187=\"\",ROWS($G$2:G187)>$L$2),\"\",IF(OR(C187=\"\",D187=\"\"),\"\",INDEX($D$2:$D$250,MATCH(F187,$C$2:$C$250,0))))","v":""},{"$f":"IF(OR(C187=\"\",D187=\"\",ROWS($H$2:H187)>$L$2),\"\",IF(OR(C187=\"\",D187=\"\"),\"\",SMALL($J$2:$J$250,ROWS($H$2:H187))))","v":""},{"$f":"IF(OR(C187=\"\",D187=\"\",ROWS($F$2:F187)>$L$2),\"\",IF(OR(C187=\"\",D187=\"\"),\"\",OrdeUP100(H187)))","v":""},""]
[null,null,null,null,{"$f":"IF(OR(C188=\"\",D188=\"\"),\"\",RANK(D188,$D$2:$D$250)+(ROWS($A$1:A187)-1)/100)","v":""},{"$f":"IF(OR(C188=\"\",D188=\"\",ROWS($F$2:F188)>$L$2),\"\",INDEX($C$2:$C$250,MATCH(SMALL($E$2:$E$250,ROWS($F$2:F188)),$E$2:$E$250,0)))","v":""},{"$f":"IF(OR(C188=\"\",D188=\"\",ROWS($G$2:G188)>$L$2),\"\",IF(OR(C188=\"\",D188=\"\"),\"\",INDEX($D$2:$D$250,MATCH(F188,$C$2:$C$250,0))))","v":""},{"$f":"IF(OR(C188=\"\",D188=\"\",ROWS($H$2:H188)>$L$2),\"\",IF(OR(C188=\"\",D188=\"\"),\"\",SMALL($J$2:$J$250,ROWS($H$2:H188))))","v":""},{"$f":"IF(OR(C188=\"\",D188=\"\",ROWS($F$2:F188)>$L$2),\"\",IF(OR(C188=\"\",D188=\"\"),\"\",OrdeUP100(H188)))","v":""},""]
[null,null,null,null,{"$f":"IF(OR(C189=\"\",D189=\"\"),\"\",RANK(D189,$D$2:$D$250)+(ROWS($A$1:A188)-1)/100)","v":""},{"$f":"IF(OR(C189=\"\",D189=\"\",ROWS($F$2:F189)>$L$2),\"\",INDEX($C$2:$C$250,MATCH(SMALL($E$2:$E$250,ROWS($F$2:F189)),$E$2:$E$250,0)))","v":""},{"$f":"IF(OR(C189=\"\",D189=\"\",ROWS($G$2:G189)>$L$2),\"\",IF(OR(C189=\"\",D189=\"\"),\"\",INDEX($D$2:$D$250,MATCH(F189,$C$2:$C$250,0))))","v":""},{"$f":"IF(OR(C189=\"\",D189=\"\",ROWS($H$2:H189)>$L$2),\"\",IF(OR(C189=\"\",D189=\"\"),\"\",SMALL($J$2:$J$250,ROWS($H$2:H189))))","v":""},{"$f":"IF(OR(C189=\"\",D189=\"\",ROWS($F$2:F189)>$L$2),\"\",IF(OR(C189=\"\",D189=\"\"),\"\",OrdeUP100(H189)))","v":""},""]
[null,null,null,null,{"$f":"IF(OR(C190=\"\",D190=\"\"),\"\",RANK(D190,$D$2:$D$250)+(ROWS($A$1:A189)-1)/100)","v":""},{"$f":"IF(OR(C190=\"\",D190=\"\",ROWS($F$2:F190)>$L$2),\"\",INDEX($C$2:$C$250,MATCH(SMALL($E$2:$E$250,ROWS($F$2:F190)),$E$2:$E$250,0)))","v":""},{"$f":"IF(OR(C190=\"\",D190=\"\",ROWS($G$2:G190)>$L$2),\"\",IF(OR(C190=\"\",D190=\"\"),\"\",INDEX($D$2:$D$250,MATCH(F190,$C$2:$C$250,0))))","v":""},{"$f":"IF(OR(C190=\"\",D190=\"\",ROWS($H$2:H190)>$L$2),\"\",IF(OR(C190=\"\",D190=\"\"),\"\",SMALL($J$2:$J$250,ROWS($H$2:H190))))","v":""},{"$f":"IF(OR(C190=\"\",D190=\"\",ROWS($F$2:F190)>$L$2),\"\",IF(OR(C190=\"\",D190=\"\"),\"\",OrdeUP100(H190)))","v":""},""]
[null,null,null,null,{"$f":"IF(OR(C191=\"\",D191=\"\"),\"\",RANK(D191,$D$2:$D$250)+(ROWS($A$1:A190)-1)/100)","v":""},{"$f":"IF(OR(C191=\"\",D191=\"\",ROWS($F$2:F191)>$L$2),\"\",INDEX($C$2:$C$250,MATCH(SMALL($E$2:$E$250,ROWS($F$2:F191)),$E$2:$E$250,0)))","v":""},{"$f":"IF(OR(C191=\"\",D191=\"\",ROWS($G$2:G191)>$L$2),\"\",IF(OR(C191=\"\",D191=\"\"),\"\",INDEX($D$2:$D$250,MATCH(F191,$C$2:$C$250,0))))","v":""},{"$f":"IF(OR(C191=\"\",D191=\"\",ROWS($H$2:H191)>$L$2),\"\",IF(OR(C191=\"\",D191=\"\"),\"\",SMALL($J$2:$J$250,ROWS($H$2:H191))))","v":""},{"$f":"IF(OR(C191=\"\",D191=\"\",ROWS($F$2:F191)>$L$2),\"\",IF(OR(C191=\"\",D191=\"\"),\"\",OrdeUP100(H191)))","v":""},""]
[null,null,null,null,{"$f":"IF(OR(C192=\"\",D192=\"\"),\"\",RANK(D192,$D$2:$D$250)+(ROWS($A$1:A191)-1)/100)","v":""},{"$f":"IF(OR(C192=\"\",D192=\"\",ROWS($F$2:F192)>$L$2),\"\",INDEX($C$2:$C$250,MATCH(SMALL($E$2:$E$250,ROWS($F$2:F192)),$E$2:$E$250,0)))","v":""},{"$f":"IF(OR(C192=\"\",D192=\"\",ROWS($G$2:G192)>$L$2),\"\",IF(OR(C192=\"\",D192=\"\"),\"\",INDEX($D$2:$D$250,MATCH(F192,$C$2:$C$250,0))))","v":""},{"$f":"IF(OR(C192=\"\",D192=\"\",ROWS($H$2:H192)>$L$2),\"\",IF(OR(C192=\"\",D192=\"\"),\"\",SMALL($J$2:$J$250,ROWS($H$2:H192))))","v":""},{"$f":"IF(OR(C192=\"\",D192=\"\",ROWS($F$2:F192)>$L$2),\"\",IF(OR(C192=\"\",D192=\"\"),\"\",OrdeUP100(H192)))","v":""},""]
[null,null,null,null,{"$f":"IF(OR(C193=\"\",D193=\"\"),\"\",RANK(D193,$D$2:$D$250)+(ROWS($A$1:A192)-1)/100)","v":""},{"$f":"IF(OR(C193=\"\",D193=\"\",ROWS($F$2:F193)>$L$2),\"\",INDEX($C$2:$C$250,MATCH(SMALL($E$2:$E$250,ROWS($F$2:F193)),$E$2:$E$250,0)))","v":""},{"$f":"IF(OR(C193=\"\",D193=\"\",ROWS($G$2:G193)>$L$2),\"\",IF(OR(C193=\"\",D193=\"\"),\"\",INDEX($D$2:$D$250,MATCH(F193,$C$2:$C$250,0))))","v":""},{"$f":"IF(OR(C193=\"\",D193=\"\",ROWS($H$2:H193)>$L$2),\"\",IF(OR(C193=\"\",D193=\"\"),\"\",SMALL($J$2:$J$250,ROWS($H$2:H193))))","v":""},{"$f":"IF(OR(C193=\"\",D193=\"\",ROWS($F$2:F193)>$L$2),\"\",IF(OR(C193=\"\",D193=\"\"),\"\",OrdeUP100(H193)))","v":""},""]
[null,null,null,null,{"$f":"IF(OR(C194=\"\",D194=\"\"),\"\",RANK(D194,$D$2:$D$250)+(ROWS($A$1:A193)-1)/100)","v":""},{"$f":"IF(OR(C194=\"\",D194=\"\",ROWS($F$2:F194)>$L$2),\"\",INDEX($C$2:$C$250,MATCH(SMALL($E$2:$E$250,ROWS($F$2:F194)),$E$2:$E$250,0)))","v":""},{"$f":"IF(OR(C194=\"\",D194=\"\",ROWS($G$2:G194)>$L$2),\"\",IF(OR(C194=\"\",D194=\"\"),\"\",INDEX($D$2:$D$250,MATCH(F194,$C$2:$C$250,0))))","v":""},{"$f":"IF(OR(C194=\"\",D194=\"\",ROWS($H$2:H194)>$L$2),\"\",IF(OR(C194=\"\",D194=\"\"),\"\",SMALL($J$2:$J$250,ROWS($H$2:H194))))","v":""},{"$f":"IF(OR(C194=\"\",D194=\"\",ROWS($F$2:F194)>$L$2),\"\",IF(OR(C194=\"\",D194=\"\"),\"\",OrdeUP100(H194)))","v":""},""]
[null,null,null,null,{"$f":"IF(OR(C195=\"\",D195=\"\"),\"\",RANK(D195,$D$2:$D$250)+(ROWS($A$1:A194)-1)/100)","v":""},{"$f":"IF(OR(C195=\"\",D195=\"\",ROWS($F$2:F195)>$L$2),\"\",INDEX($C$2:$C$250,MATCH(SMALL($E$2:$E$250,ROWS($F$2:F195)),$E$2:$E$250,0)))","v":""},{"$f":"IF(OR(C195=\"\",D195=\"\",ROWS($G$2:G195)>$L$2),\"\",IF(OR(C195=\"\",D195=\"\"),\"\",INDEX($D$2:$D$250,MATCH(F195,$C$2:$C$250,0))))","v":""},{"$f":"IF(OR(C195=\"\",D195=\"\",ROWS($H$2:H195)>$L$2),\"\",IF(OR(C195=\"\",D195=\"\"),\"\",SMALL($J$2:$J$250,ROWS($H$2:H195))))","v":""},{"$f":"IF(OR(C195=\"\",D195=\"\",ROWS($F$2:F195)>$L$2),\"\",IF(OR(C195=\"\",D195=\"\"),\"\",OrdeUP100(H195)))","v":""},{"$f":"IF(OR(C195=\"\",D195=\"\"),\"\",RANK(D195,$D$2:$D$250))","v":""}]
[null,null,null,null,{"$f":"IF(OR(C196=\"\",D196=\"\"),\"\",RANK(D196,$D$2:$D$250)+(ROWS($A$1:A195)-1)/100)","v":""},{"$f":"IF(OR(C196=\"\",D196=\"\",ROWS($F$2:F196)>$L$2),\"\",INDEX($C$2:$C$250,MATCH(SMALL($E$2:$E$250,ROWS($F$2:F196)),$E$2:$E$250,0)))","v":""},{"$f":"IF(OR(C196=\"\",D196=\"\",ROWS($G$2:G196)>$L$2),\"\",IF(OR(C196=\"\",D196=\"\"),\"\",INDEX($D$2:$D$250,MATCH(F196,$C$2:$C$250,0))))","v":""},{"$f":"IF(OR(C196=\"\",D196=\"\",ROWS($H$2:H196)>$L$2),\"\",IF(OR(C196=\"\",D196=\"\"),\"\",SMALL($J$2:$J$250,ROWS($H$2:H196))))","v":""},{"$f":"IF(OR(C196=\"\",D196=\"\",ROWS($F$2:F196)>$L$2),\"\",IF(OR(C196=\"\",D196=\"\"),\"\",OrdeUP100(H196)))","v":""},""]
[null,null,null,null,{"$f":"IF(OR(C197=\"\",D197=\"\"),\"\",RANK(D197,$D$2:$D$250)+(ROWS($A$1:A196)-1)/100)","v":""},{"$f":"IF(OR(C197=\"\",D197=\"\",ROWS($F$2:F197)>$L$2),\"\",INDEX($C$2:$C$250,MATCH(SMALL($E$2:$E$250,ROWS($F$2:F197)),$E$2:$E$250,0)))","v":""},{"$f":"IF(OR(C197=\"\",D197=\"\",ROWS($G$2:G197)>$L$2),\"\",IF(OR(C197=\"\",D197=\"\"),\"\",INDEX($D$2:$D$250,MATCH(F197,$C$2:$C$250,0))))","v":""},{"$f":"IF(OR(C197=\"\",D197=\"\",ROWS($H$2:H197)>$L$2),\"\",IF(OR(C197=\"\",D197=\"\"),\"\",SMALL($J$2:$J$250,ROWS($H$2:H197))))","v":""},{"$f":"IF(OR(C197=\"\",D197=\"\",ROWS($F$2:F197)>$L$2),\"\",IF(OR(C197=\"\",D197=\"\"),\"\",OrdeUP100(H197)))","v":""},""]
[null,null,null,null,{"$f":"IF(OR(C198=\"\",D198=\"\"),\"\",RANK(D198,$D$2:$D$250)+(ROWS($A$1:A197)-1)/100)","v":""},{"$f":"IF(OR(C198=\"\",D198=\"\",ROWS($F$2:F198)>$L$2),\"\",INDEX($C$2:$C$250,MATCH(SMALL($E$2:$E$250,ROWS($F$2:F198)),$E$2:$E$250,0)))","v":""},{"$f":"IF(OR(C198=\"\",D198=\"\",ROWS($G$2:G198)>$L$2),\"\",IF(OR(C198=\"\",D198=\"\"),\"\",INDEX($D$2:$D$250,MATCH(F198,$C$2:$C$250,0))))","v":""},{"$f":"IF(OR(C198=\"\",D198=\"\",ROWS($H$2:H198)>$L$2),\"\",IF(OR(C198=\"\",D198=\"\"),\"\",SMALL($J$2:$J$250,ROWS($H$2:H198))))","v":""},{"$f":"IF(OR(C198=\"\",D198=\"\",ROWS($F$2:F198)>$L$2),\"\",IF(OR(C198=\"\",D198=\"\"),\"\",OrdeUP100(H198)))","v":""},""]
[null,null,null,null,{"$f":"IF(OR(C199=\"\",D199=\"\"),\"\",RANK(D199,$D$2:$D$250)+(ROWS($A$1:A198)-1)/100)","v":""},{"$f":"IF(OR(C199=\"\",D199=\"\",ROWS($F$2:F199)>$L$2),\"\",INDEX($C$2:$C$250,MATCH(SMALL($E$2:$E$250,ROWS($F$2:F199)),$E$2:$E$250,0)))","v":""},{"$f":"IF(OR(C199=\"\",D199=\"\",ROWS($G$2:G199)>$L$2),\"\",IF(OR(C199=\"\",D199=\"\"),\"\",INDEX($D$2:$D$250,MATCH(F199,$C$2:$C$250,0))))","v":""},{"$f":"IF(OR(C199=\"\",D199=\"\",ROWS($H$2:H199)>$L$2),\"\",IF(OR(C199=\"\",D199=\"\"),\"\",SMALL($J$2:$J$250,ROWS($H$2:H199))))","v":""},{"$f":"IF(OR(C199=\"\",D199=\"\",ROWS($F$2:F199)>$L$2),\"\",IF(OR(C199=\"\",D199=\"\"),\"\",OrdeUP100(H199)))","v":""},""]
[null,null,null,null,{"$f":"IF(OR(C200=\"\",D200=\"\"),\"\",RANK(D200,$D$2:$D$250)+(ROWS($A$1:A199)-1)/100)","v":""},{"$f":"IF(OR(C200=\"\",D200=\"\",ROWS($F$2:F200)>$L$2),\"\",INDEX($C$2:$C$250,MATCH(SMALL($E$2:$E$250,ROWS($F$2:F200)),$E$2:$E$250,0)))","v":""},{"$f":"IF(OR(C200=\"\",D200=\"\",ROWS($G$2:G200)>$L$2),\"\",IF(OR(C200=\"\",D200=\"\"),\"\",INDEX($D$2:$D$250,MATCH(F200,$C$2:$C$250,0))))","v":""},{"$f":"IF(OR(C200=\"\",D200=\"\",ROWS($H$2:H200)>$L$2),\"\",IF(OR(C200=\"\",D200=\"\"),\"\",SMALL($J$2:$J$250,ROWS($H$2:H200))))","v":""},{"$f":"IF(OR(C200=\"\",D200=\"\",ROWS($F$2:F200)>$L$2),\"\",IF(OR(C200=\"\",D200=\"\"),\"\",OrdeUP100(H200)))","v":""},""]
[null,null,null,null,{"$f":"IF(OR(C201=\"\",D201=\"\"),\"\",RANK(D201,$D$2:$D$250)+(ROWS($A$1:A200)-1)/100)","v":""},{"$f":"IF(OR(C201=\"\",D201=\"\",ROWS($F$2:F201)>$L$2),\"\",INDEX($C$2:$C$250,MATCH(SMALL($E$2:$E$250,ROWS($F$2:F201)),$E$2:$E$250,0)))","v":""},{"$f":"IF(OR(C201=\"\",D201=\"\",ROWS($G$2:G201)>$L$2),\"\",IF(OR(C201=\"\",D201=\"\"),\"\",INDEX($D$2:$D$250,MATCH(F201,$C$2:$C$250,0))))","v":""},{"$f":"IF(OR(C201=\"\",D201=\"\",ROWS($H$2:H201)>$L$2),\"\",IF(OR(C201=\"\",D201=\"\"),\"\",SMALL($J$2:$J$250,ROWS($H$2:H201))))","v":""},{"$f":"IF(OR(C201=\"\",D201=\"\",ROWS($F$2:F201)>$L$2),\"\",IF(OR(C201=\"\",D201=\"\"),\"\",OrdeUP100(H201)))","v":""},""]
[null,null,null,null,{"$f":"IF(OR(C202=\"\",D202=\"\"),\"\",RANK(D202,$D$2:$D$250)+(ROWS($A$1:A201)-1)/100)","v":""},{"$f":"IF(OR(C202=\"\",D202=\"\",ROWS($F$2:F202)>$L$2),\"\",INDEX($C$2:$C$250,MATCH(SMALL($E$2:$E$250,ROWS($F$2:F202)),$E$2:$E$250,0)))","v":""},{"$f":"IF(OR(C202=\"\",D202=\"\",ROWS($G$2:G202)>$L$2),\"\",IF(OR(C202=\"\",D202=\"\"),\"\",INDEX($D$2:$D$250,MATCH(F202,$C$2:$C$250,0))))","v":""},{"$f":"IF(OR(C202=\"\",D202=\"\",ROWS($H$2:H202)>$L$2),\"\",IF(OR(C202=\"\",D202=\"\"),\"\",SMALL($J$2:$J$250,ROWS($H$2:H202))))","v":""},{"$f":"IF(OR(C202=\"\",D202=\"\",ROWS($F$2:F202)>$L$2),\"\",IF(OR(C202=\"\",D202=\"\"),\"\",OrdeUP100(H202)))","v":""},""]
[null,null,null,null,{"$f":"IF(OR(C203=\"\",D203=\"\"),\"\",RANK(D203,$D$2:$D$250)+(ROWS($A$1:A202)-1)/100)","v":""},{"$f":"IF(OR(C203=\"\",D203=\"\",ROWS($F$2:F203)>$L$2),\"\",INDEX($C$2:$C$250,MATCH(SMALL($E$2:$E$250,ROWS($F$2:F203)),$E$2:$E$250,0)))","v":""},{"$f":"IF(OR(C203=\"\",D203=\"\",ROWS($G$2:G203)>$L$2),\"\",IF(OR(C203=\"\",D203=\"\"),\"\",INDEX($D$2:$D$250,MATCH(F203,$C$2:$C$250,0))))","v":""},{"$f":"IF(OR(C203=\"\",D203=\"\",ROWS($H$2:H203)>$L$2),\"\",IF(OR(C203=\"\",D203=\"\"),\"\",SMALL($J$2:$J$250,ROWS($H$2:H203))))","v":""},{"$f":"IF(OR(C203=\"\",D203=\"\",ROWS($F$2:F203)>$L$2),\"\",IF(OR(C203=\"\",D203=\"\"),\"\",OrdeUP100(H203)))","v":""},""]
[null,null,null,null,{"$f":"IF(OR(C204=\"\",D204=\"\"),\"\",RANK(D204,$D$2:$D$250)+(ROWS($A$1:A203)-1)/100)","v":""},{"$f":"IF(OR(C204=\"\",D204=\"\",ROWS($F$2:F204)>$L$2),\"\",INDEX($C$2:$C$250,MATCH(SMALL($E$2:$E$250,ROWS($F$2:F204)),$E$2:$E$250,0)))","v":""},{"$f":"IF(OR(C204=\"\",D204=\"\",ROWS($G$2:G204)>$L$2),\"\",IF(OR(C204=\"\",D204=\"\"),\"\",INDEX($D$2:$D$250,MATCH(F204,$C$2:$C$250,0))))","v":""},{"$f":"IF(OR(C204=\"\",D204=\"\",ROWS($H$2:H204)>$L$2),\"\",IF(OR(C204=\"\",D204=\"\"),\"\",SMALL($J$2:$J$250,ROWS($H$2:H204))))","v":""},{"$f":"IF(OR(C204=\"\",D204=\"\",ROWS($F$2:F204)>$L$2),\"\",IF(OR(C204=\"\",D204=\"\"),\"\",OrdeUP100(H204)))","v":""},""]
[null,null,null,null,{"$f":"IF(OR(C205=\"\",D205=\"\"),\"\",RANK(D205,$D$2:$D$250)+(ROWS($A$1:A204)-1)/100)","v":""},{"$f":"IF(OR(C205=\"\",D205=\"\",ROWS($F$2:F205)>$L$2),\"\",INDEX($C$2:$C$250,MATCH(SMALL($E$2:$E$250,ROWS($F$2:F205)),$E$2:$E$250,0)))","v":""},{"$f":"IF(OR(C205=\"\",D205=\"\",ROWS($G$2:G205)>$L$2),\"\",IF(OR(C205=\"\",D205=\"\"),\"\",INDEX($D$2:$D$250,MATCH(F205,$C$2:$C$250,0))))","v":""},{"$f":"IF(OR(C205=\"\",D205=\"\",ROWS($H$2:H205)>$L$2),\"\",IF(OR(C205=\"\",D205=\"\"),\"\",SMALL($J$2:$J$250,ROWS($H$2:H205))))","v":""},{"$f":"IF(OR(C205=\"\",D205=\"\",ROWS($F$2:F205)>$L$2),\"\",IF(OR(C205=\"\",D205=\"\"),\"\",OrdeUP100(H205)))","v":""},""]
[null,null,null,null,{"$f":"IF(OR(C206=\"\",D206=\"\"),\"\",RANK(D206,$D$2:$D$250)+(ROWS($A$1:A205)-1)/100)","v":""},{"$f":"IF(OR(C206=\"\",D206=\"\",ROWS($F$2:F206)>$L$2),\"\",INDEX($C$2:$C$250,MATCH(SMALL($E$2:$E$250,ROWS($F$2:F206)),$E$2:$E$250,0)))","v":""},{"$f":"IF(OR(C206=\"\",D206=\"\",ROWS($G$2:G206)>$L$2),\"\",IF(OR(C206=\"\",D206=\"\"),\"\",INDEX($D$2:$D$250,MATCH(F206,$C$2:$C$250,0))))","v":""},{"$f":"IF(OR(C206=\"\",D206=\"\",ROWS($H$2:H206)>$L$2),\"\",IF(OR(C206=\"\",D206=\"\"),\"\",SMALL($J$2:$J$250,ROWS($H$2:H206))))","v":""},{"$f":"IF(OR(C206=\"\",D206=\"\",ROWS($F$2:F206)>$L$2),\"\",IF(OR(C206=\"\",D206=\"\"),\"\",OrdeUP100(H206)))","v":""},""]
[null,null,null,null,{"$f":"IF(OR(C207=\"\",D207=\"\"),\"\",RANK(D207,$D$2:$D$250)+(ROWS($A$1:A206)-1)/100)","v":""},{"$f":"IF(OR(C207=\"\",D207=\"\",ROWS($F$2:F207)>$L$2),\"\",INDEX($C$2:$C$250,MATCH(SMALL($E$2:$E$250,ROWS($F$2:F207)),$E$2:$E$250,0)))","v":""},{"$f":"IF(OR(C207=\"\",D207=\"\",ROWS($G$2:G207)>$L$2),\"\",IF(OR(C207=\"\",D207=\"\"),\"\",INDEX($D$2:$D$250,MATCH(F207,$C$2:$C$250,0))))","v":""},{"$f":"IF(OR(C207=\"\",D207=\"\",ROWS($H$2:H207)>$L$2),\"\",IF(OR(C207=\"\",D207=\"\"),\"\",SMALL($J$2:$J$250,ROWS($H$2:H207))))","v":""},{"$f":"IF(OR(C207=\"\",D207=\"\",ROWS($F$2:F207)>$L$2),\"\",IF(OR(C207=\"\",D207=\"\"),\"\",OrdeUP100(H207)))","v":""},""]
[null,null,null,null,{"$f":"IF(OR(C208=\"\",D208=\"\"),\"\",RANK(D208,$D$2:$D$250)+(ROWS($A$1:A207)-1)/100)","v":""},{"$f":"IF(OR(C208=\"\",D208=\"\",ROWS($F$2:F208)>$L$2),\"\",INDEX($C$2:$C$250,MATCH(SMALL($E$2:$E$250,ROWS($F$2:F208)),$E$2:$E$250,0)))","v":""},{"$f":"IF(OR(C208=\"\",D208=\"\",ROWS($G$2:G208)>$L$2),\"\",IF(OR(C208=\"\",D208=\"\"),\"\",INDEX($D$2:$D$250,MATCH(F208,$C$2:$C$250,0))))","v":""},{"$f":"IF(OR(C208=\"\",D208=\"\",ROWS($H$2:H208)>$L$2),\"\",IF(OR(C208=\"\",D208=\"\"),\"\",SMALL($J$2:$J$250,ROWS($H$2:H208))))","v":""},{"$f":"IF(OR(C208=\"\",D208=\"\",ROWS($F$2:F208)>$L$2),\"\",IF(OR(C208=\"\",D208=\"\"),\"\",OrdeUP100(H208)))","v":""},""]
[null,null,null,null,{"$f":"IF(OR(C209=\"\",D209=\"\"),\"\",RANK(D209,$D$2:$D$250)+(ROWS($A$1:A208)-1)/100)","v":""},{"$f":"IF(OR(C209=\"\",D209=\"\",ROWS($F$2:F209)>$L$2),\"\",INDEX($C$2:$C$250,MATCH(SMALL($E$2:$E$250,ROWS($F$2:F209)),$E$2:$E$250,0)))","v":""},{"$f":"IF(OR(C209=\"\",D209=\"\",ROWS($G$2:G209)>$L$2),\"\",IF(OR(C209=\"\",D209=\"\"),\"\",INDEX($D$2:$D$250,MATCH(F209,$C$2:$C$250,0))))","v":""},{"$f":"IF(OR(C209=\"\",D209=\"\",ROWS($H$2:H209)>$L$2),\"\",IF(OR(C209=\"\",D209=\"\"),\"\",SMALL($J$2:$J$250,ROWS($H$2:H209))))","v":""},{"$f":"IF(OR(C209=\"\",D209=\"\",ROWS($F$2:F209)>$L$2),\"\",IF(OR(C209=\"\",D209=\"\"),\"\",OrdeUP100(H209)))","v":""},""]
[null,null,null,null,{"$f":"IF(OR(C210=\"\",D210=\"\"),\"\",RANK(D210,$D$2:$D$250)+(ROWS($A$1:A209)-1)/100)","v":""},{"$f":"IF(OR(C210=\"\",D210=\"\",ROWS($F$2:F210)>$L$2),\"\",INDEX($C$2:$C$250,MATCH(SMALL($E$2:$E$250,ROWS($F$2:F210)),$E$2:$E$250,0)))","v":""},{"$f":"IF(OR(C210=\"\",D210=\"\",ROWS($G$2:G210)>$L$2),\"\",IF(OR(C210=\"\",D210=\"\"),\"\",INDEX($D$2:$D$250,MATCH(F210,$C$2:$C$250,0))))","v":""},{"$f":"IF(OR(C210=\"\",D210=\"\",ROWS($H$2:H210)>$L$2),\"\",IF(OR(C210=\"\",D210=\"\"),\"\",SMALL($J$2:$J$250,ROWS($H$2:H210))))","v":""},{"$f":"IF(OR(C210=\"\",D210=\"\",ROWS($F$2:F210)>$L$2),\"\",IF(OR(C210=\"\",D210=\"\"),\"\",OrdeUP100(H210)))","v":""},""]
[null,null,null,null,{"$f":"IF(OR(C211=\"\",D211=\"\"),\"\",RANK(D211,$D$2:$D$250)+(ROWS($A$1:A210)-1)/100)","v":""},{"$f":"IF(OR(C211=\"\",D211=\"\",ROWS($F$2:F211)>$L$2),\"\",INDEX($C$2:$C$250,MATCH(SMALL($E$2:$E$250,ROWS($F$2:F211)),$E$2:$E$250,0)))","v":""},{"$f":"IF(OR(C211=\"\",D211=\"\",ROWS($G$2:G211)>$L$2),\"\",IF(OR(C211=\"\",D211=\"\"),\"\",INDEX($D$2:$D$250,MATCH(F211,$C$2:$C$250,0))))","v":""},{"$f":"IF(OR(C211=\"\",D211=\"\",ROWS($H$2:H211)>$L$2),\"\",IF(OR(C211=\"\",D211=\"\"),\"\",SMALL($J$2:$J$250,ROWS($H$2:H211))))","v":""},{"$f":"IF(OR(C211=\"\",D211=\"\",ROWS($F$2:F211)>$L$2),\"\",IF(OR(C211=\"\",D211=\"\"),\"\",OrdeUP100(H211)))","v":""},""]
[null,null,null,null,{"$f":"IF(OR(C212=\"\",D212=\"\"),\"\",RANK(D212,$D$2:$D$250)+(ROWS($A$1:A211)-1)/100)","v":""},{"$f":"IF(OR(C212=\"\",D212=\"\",ROWS($F$2:F212)>$L$2),\"\",INDEX($C$2:$C$250,MATCH(SMALL($E$2:$E$250,ROWS($F$2:F212)),$E$2:$E$250,0)))","v":""},{"$f":"IF(OR(C212=\"\",D212=\"\",ROWS($G$2:G212)>$L$2),\"\",IF(OR(C212=\"\",D212=\"\"),\"\",INDEX($D$2:$D$250,MATCH(F212,$C$2:$C$250,0))))","v":""},{"$f":"IF(OR(C212=\"\",D212=\"\",ROWS($H$2:H212)>$L$2),\"\",IF(OR(C212=\"\",D212=\"\"),\"\",SMALL($J$2:$J$250,ROWS($H$2:H212))))","v":""},{"$f":"IF(OR(C212=\"\",D212=\"\",ROWS($F$2:F212)>$L$2),\"\",IF(OR(C212=\"\",D212=\"\"),\"\",OrdeUP100(H212)))","v":""},""]
[null,null,null,null,{"$f":"IF(OR(C213=\"\",D213=\"\"),\"\",RANK(D213,$D$2:$D$250)+(ROWS($A$1:A212)-1)/100)","v":""},{"$f":"IF(OR(C213=\"\",D213=\"\",ROWS($F$2:F213)>$L$2),\"\",INDEX($C$2:$C$250,MATCH(SMALL($E$2:$E$250,ROWS($F$2:F213)),$E$2:$E$250,0)))","v":""},{"$f":"IF(OR(C213=\"\",D213=\"\",ROWS($G$2:G213)>$L$2),\"\",IF(OR(C213=\"\",D213=\"\"),\"\",INDEX($D$2:$D$250,MATCH(F213,$C$2:$C$250,0))))","v":""},{"$f":"IF(OR(C213=\"\",D213=\"\",ROWS($H$2:H213)>$L$2),\"\",IF(OR(C213=\"\",D213=\"\"),\"\",SMALL($J$2:$J$250,ROWS($H$2:H213))))","v":""},{"$f":"IF(OR(C213=\"\",D213=\"\",ROWS($F$2:F213)>$L$2),\"\",IF(OR(C213=\"\",D213=\"\"),\"\",OrdeUP100(H213)))","v":""},""]
[null,null,null,null,{"$f":"IF(OR(C214=\"\",D214=\"\"),\"\",RANK(D214,$D$2:$D$250)+(ROWS($A$1:A213)-1)/100)","v":""},{"$f":"IF(OR(C214=\"\",D214=\"\",ROWS($F$2:F214)>$L$2),\"\",INDEX($C$2:$C$250,MATCH(SMALL($E$2:$E$250,ROWS($F$2:F214)),$E$2:$E$250,0)))","v":""},{"$f":"IF(OR(C214=\"\",D214=\"\",ROWS($G$2:G214)>$L$2),\"\",IF(OR(C214=\"\",D214=\"\"),\"\",INDEX($D$2:$D$250,MATCH(F214,$C$2:$C$250,0))))","v":""},{"$f":"IF(OR(C214=\"\",D214=\"\",ROWS($H$2:H214)>$L$2),\"\",IF(OR(C214=\"\",D214=\"\"),\"\",SMALL($J$2:$J$250,ROWS($H$2:H214))))","v":""},{"$f":"IF(OR(C214=\"\",D214=\"\",ROWS($F$2:F214)>$L$2),\"\",IF(OR(C214=\"\",D214=\"\"),\"\",OrdeUP100(H214)))","v":""},""]
[null,null,null,null,{"$f":"IF(OR(C215=\"\",D215=\"\"),\"\",RANK(D215,$D$2:$D$250)+(ROWS($A$1:A214)-1)/100)","v":""},{"$f":"IF(OR(C215=\"\",D215=\"\",ROWS($F$2:F215)>$L$2),\"\",INDEX($C$2:$C$250,MATCH(SMALL($E$2:$E$250,ROWS($F$2:F215)),$E$2:$E$250,0)))","v":""},{"$f":"IF(OR(C215=\"\",D215=\"\",ROWS($G$2:G215)>$L$2),\"\",IF(OR(C215=\"\",D215=\"\"),\"\",INDEX($D$2:$D$250,MATCH(F215,$C$2:$C$250,0))))","v":""},{"$f":"IF(OR(C215=\"\",D215=\"\",ROWS($H$2:H215)>$L$2),\"\",IF(OR(C215=\"\",D215=\"\"),\"\",SMALL($J$2:$J$250,ROWS($H$2:H215))))","v":""},{"$f":"IF(OR(C215=\"\",D215=\"\",ROWS($F$2:F215)>$L$2),\"\",IF(OR(C215=\"\",D215=\"\"),\"\",OrdeUP100(H215)))","v":""},""]
[null,null,null,null,{"$f":"IF(OR(C216=\"\",D216=\"\"),\"\",RANK(D216,$D$2:$D$250)+(ROWS($A$1:A215)-1)/100)","v":""},{"$f":"IF(OR(C216=\"\",D216=\"\",ROWS($F$2:F216)>$L$2),\"\",INDEX($C$2:$C$250,MATCH(SMALL($E$2:$E$250,ROWS($F$2:F216)),$E$2:$E$250,0)))","v":""},{"$f":"IF(OR(C216=\"\",D216=\"\",ROWS($G$2:G216)>$L$2),\"\",IF(OR(C216=\"\",D216=\"\"),\"\",INDEX($D$2:$D$250,MATCH(F216,$C$2:$C$250,0))))","v":""},{"$f":"IF(OR(C216=\"\",D216=\"\",ROWS($H$2:H216)>$L$2),\"\",IF(OR(C216=\"\",D216=\"\"),\"\",SMALL($J$2:$J$250,ROWS($H$2:H216))))","v":""},{"$f":"IF(OR(C216=\"\",D216=\"\",ROWS($F$2:F216)>$L$2),\"\",IF(OR(C216=\"\",D216=\"\"),\"\",OrdeUP100(H216)))","v":""},""]
[null,null,null,null,{"$f":"IF(OR(C217=\"\",D217=\"\"),\"\",RANK(D217,$D$2:$D$250)+(ROWS($A$1:A216)-1)/100)","v":""},{"$f":"IF(OR(C217=\"\",D217=\"\",ROWS($F$2:F217)>$L$2),\"\",INDEX($C$2:$C$250,MATCH(SMALL($E$2:$E$250,ROWS($F$2:F217)),$E$2:$E$250,0)))","v":""},{"$f":"IF(OR(C217=\"\",D217=\"\",ROWS($G$2:G217)>$L$2),\"\",IF(OR(C217=\"\",D217=\"\"),\"\",INDEX($D$2:$D$250,MATCH(F217,$C$2:$C$250,0))))","v":""},{"$f":"IF(OR(C217=\"\",D217=\"\",ROWS($H$2:H217)>$L$2),\"\",IF(OR(C217=\"\",D217=\"\"),\"\",SMALL($J$2:$J$250,ROWS($H$2:H217))))","v":""},{"$f":"IF(OR(C217=\"\",D217=\"\",ROWS($F$2:F217)>$L$2),\"\",IF(OR(C217=\"\",D217=\"\"),\"\",OrdeUP100(H217)))","v":""},""]
[null,null,null,null,{"$f":"IF(OR(C218=\"\",D218=\"\"),\"\",RANK(D218,$D$2:$D$250)+(ROWS($A$1:A217)-1)/100)","v":""},{"$f":"IF(OR(C218=\"\",D218=\"\",ROWS($F$2:F218)>$L$2),\"\",INDEX($C$2:$C$250,MATCH(SMALL($E$2:$E$250,ROWS($F$2:F218)),$E$2:$E$250,0)))","v":""},{"$f":"IF(OR(C218=\"\",D218=\"\",ROWS($G$2:G218)>$L$2),\"\",IF(OR(C218=\"\",D218=\"\"),\"\",INDEX($D$2:$D$250,MATCH(F218,$C$2:$C$250,0))))","v":""},{"$f":"IF(OR(C218=\"\",D218=\"\",ROWS($H$2:H218)>$L$2),\"\",IF(OR(C218=\"\",D218=\"\"),\"\",SMALL($J$2:$J$250,ROWS($H$2:H218))))","v":""},{"$f":"IF(OR(C218=\"\",D218=\"\",ROWS($F$2:F218)>$L$2),\"\",IF(OR(C218=\"\",D218=\"\"),\"\",OrdeUP100(H218)))","v":""},""]
[null,null,null,null,{"$f":"IF(OR(C219=\"\",D219=\"\"),\"\",RANK(D219,$D$2:$D$250)+(ROWS($A$1:A218)-1)/100)","v":""},{"$f":"IF(OR(C219=\"\",D219=\"\",ROWS($F$2:F219)>$L$2),\"\",INDEX($C$2:$C$250,MATCH(SMALL($E$2:$E$250,ROWS($F$2:F219)),$E$2:$E$250,0)))","v":""},{"$f":"IF(OR(C219=\"\",D219=\"\",ROWS($G$2:G219)>$L$2),\"\",IF(OR(C219=\"\",D219=\"\"),\"\",INDEX($D$2:$D$250,MATCH(F219,$C$2:$C$250,0))))","v":""},{"$f":"IF(OR(C219=\"\",D219=\"\",ROWS($H$2:H219)>$L$2),\"\",IF(OR(C219=\"\",D219=\"\"),\"\",SMALL($J$2:$J$250,ROWS($H$2:H219))))","v":""},{"$f":"IF(OR(C219=\"\",D219=\"\",ROWS($F$2:F219)>$L$2),\"\",IF(OR(C219=\"\",D219=\"\"),\"\",OrdeUP100(H219)))","v":""},""]
[null,null,null,null,{"$f":"IF(OR(C220=\"\",D220=\"\"),\"\",RANK(D220,$D$2:$D$250)+(ROWS($A$1:A219)-1)/100)","v":""},{"$f":"IF(OR(C220=\"\",D220=\"\",ROWS($F$2:F220)>$L$2),\"\",INDEX($C$2:$C$250,MATCH(SMALL($E$2:$E$250,ROWS($F$2:F220)),$E$2:$E$250,0)))","v":""},{"$f":"IF(OR(C220=\"\",D220=\"\",ROWS($G$2:G220)>$L$2),\"\",IF(OR(C220=\"\",D220=\"\"),\"\",INDEX($D$2:$D$250,MATCH(F220,$C$2:$C$250,0))))","v":""},{"$f":"IF(OR(C220=\"\",D220=\"\",ROWS($H$2:H220)>$L$2),\"\",IF(OR(C220=\"\",D220=\"\"),\"\",SMALL($J$2:$J$250,ROWS($H$2:H220))))","v":""},{"$f":"IF(OR(C220=\"\",D220=\"\",ROWS($F$2:F220)>$L$2),\"\",IF(OR(C220=\"\",D220=\"\"),\"\",OrdeUP100(H220)))","v":""},""]
[null,null,null,null,{"$f":"IF(OR(C221=\"\",D221=\"\"),\"\",RANK(D221,$D$2:$D$250)+(ROWS($A$1:A220)-1)/100)","v":""},{"$f":"IF(OR(C221=\"\",D221=\"\",ROWS($F$2:F221)>$L$2),\"\",INDEX($C$2:$C$250,MATCH(SMALL($E$2:$E$250,ROWS($F$2:F221)),$E$2:$E$250,0)))","v":""},{"$f":"IF(OR(C221=\"\",D221=\"\",ROWS($G$2:G221)>$L$2),\"\",IF(OR(C221=\"\",D221=\"\"),\"\",INDEX($D$2:$D$250,MATCH(F221,$C$2:$C$250,0))))","v":""},{"$f":"IF(OR(C221=\"\",D221=\"\",ROWS($H$2:H221)>$L$2),\"\",IF(OR(C221=\"\",D221=\"\"),\"\",SMALL($J$2:$J$250,ROWS($H$2:H221))))","v":""},{"$f":"IF(OR(C221=\"\",D221=\"\",ROWS($F$2:F221)>$L$2),\"\",IF(OR(C221=\"\",D221=\"\"),\"\",OrdeUP100(H221)))","v":""},""]
[null,null,null,null,{"$f":"IF(OR(C222=\"\",D222=\"\"),\"\",RANK(D222,$D$2:$D$250)+(ROWS($A$1:A221)-1)/100)","v":""},{"$f":"IF(OR(C222=\"\",D222=\"\",ROWS($F$2:F222)>$L$2),\"\",INDEX($C$2:$C$250,MATCH(SMALL($E$2:$E$250,ROWS($F$2:F222)),$E$2:$E$250,0)))","v":""},{"$f":"IF(OR(C222=\"\",D222=\"\",ROWS($G$2:G222)>$L$2),\"\",IF(OR(C222=\"\",D222=\"\"),\"\",INDEX($D$2:$D$250,MATCH(F222,$C$2:$C$250,0))))","v":""},{"$f":"IF(OR(C222=\"\",D222=\"\",ROWS($H$2:H222)>$L$2),\"\",IF(OR(C222=\"\",D222=\"\"),\"\",SMALL($J$2:$J$250,ROWS($H$2:H222))))","v":""},{"$f":"IF(OR(C222=\"\",D222=\"\",ROWS($F$2:F222)>$L$2),\"\",IF(OR(C222=\"\",D222=\"\"),\"\",OrdeUP100(H222)))","v":""},""]
[null,null,null,null,{"$f":"IF(OR(C223=\"\",D223=\"\"),\"\",RANK(D223,$D$2:$D$250)+(ROWS($A$1:A222)-1)/100)","v":""},{"$f":"IF(OR(C223=\"\",D223=\"\",ROWS($F$2:F223)>$L$2),\"\",INDEX($C$2:$C$250,MATCH(SMALL($E$2:$E$250,ROWS($F$2:F223)),$E$2:$E$250,0)))","v":""},{"$f":"IF(OR(C223=\"\",D223=\"\",ROWS($G$2:G223)>$L$2),\"\",IF(OR(C223=\"\",D223=\"\"),\"\",INDEX($D$2:$D$250,MATCH(F223,$C$2:$C$250,0))))","v":""},{"$f":"IF(OR(C223=\"\",D223=\"\",ROWS($H$2:H223)>$L$2),\"\",IF(OR(C223=\"\",D223=\"\"),\"\",SMALL($J$2:$J$250,ROWS($H$2:H223))))","v":""},{"$f":"IF(OR(C223=\"\",D223=\"\",ROWS($F$2:F223)>$L$2),\"\",IF(OR(C223=\"\",D223=\"\"),\"\",OrdeUP100(H223)))","v":""},""]
[null,null,null,null,{"$f":"IF(OR(C224=\"\",D224=\"\"),\"\",RANK(D224,$D$2:$D$250)+(ROWS($A$1:A223)-1)/100)","v":""},{"$f":"IF(OR(C224=\"\",D224=\"\",ROWS($F$2:F224)>$L$2),\"\",INDEX($C$2:$C$250,MATCH(SMALL($E$2:$E$250,ROWS($F$2:F224)),$E$2:$E$250,0)))","v":""},{"$f":"IF(OR(C224=\"\",D224=\"\",ROWS($G$2:G224)>$L$2),\"\",IF(OR(C224=\"\",D224=\"\"),\"\",INDEX($D$2:$D$250,MATCH(F224,$C$2:$C$250,0))))","v":""},{"$f":"IF(OR(C224=\"\",D224=\"\",ROWS($H$2:H224)>$L$2),\"\",IF(OR(C224=\"\",D224=\"\"),\"\",SMALL($J$2:$J$250,ROWS($H$2:H224))))","v":""},{"$f":"IF(OR(C224=\"\",D224=\"\",ROWS($F$2:F224)>$L$2),\"\",IF(OR(C224=\"\",D224=\"\"),\"\",OrdeUP100(H224)))","v":""},""]
[null,null,null,null,{"$f":"IF(OR(C225=\"\",D225=\"\"),\"\",RANK(D225,$D$2:$D$250)+(ROWS($A$1:A224)-1)/100)","v":""},{"$f":"IF(OR(C225=\"\",D225=\"\",ROWS($F$2:F225)>$L$2),\"\",INDEX($C$2:$C$250,MATCH(SMALL($E$2:$E$250,ROWS($F$2:F225)),$E$2:$E$250,0)))","v":""},{"$f":"IF(OR(C225=\"\",D225=\"\",ROWS($G$2:G225)>$L$2),\"\",IF(OR(C225=\"\",D225=\"\"),\"\",INDEX($D$2:$D$250,MATCH(F225,$C$2:$C$250,0))))","v":""},{"$f":"IF(OR(C225=\"\",D225=\"\",ROWS($H$2:H225)>$L$2),\"\",IF(OR(C225=\"\",D225=\"\"),\"\",SMALL($J$2:$J$250,ROWS($H$2:H225))))","v":""},{"$f":"IF(OR(C225=\"\",D225=\"\",ROWS($F$2:F225)>$L$2),\"\",IF(OR(C225=\"\",D225=\"\"),\"\",OrdeUP100(H225)))","v":""},""]
[null,null,null,null,{"$f":"IF(OR(C226=\"\",D226=\"\"),\"\",RANK(D226,$D$2:$D$250)+(ROWS($A$1:A225)-1)/100)","v":""},{"$f":"IF(OR(C226=\"\",D226=\"\",ROWS($F$2:F226)>$L$2),\"\",INDEX($C$2:$C$250,MATCH(SMALL($E$2:$E$250,ROWS($F$2:F226)),$E$2:$E$250,0)))","v":""},{"$f":"IF(OR(C226=\"\",D226=\"\",ROWS($G$2:G226)>$L$2),\"\",IF(OR(C226=\"\",D226=\"\"),\"\",INDEX($D$2:$D$250,MATCH(F226,$C$2:$C$250,0))))","v":""},{"$f":"IF(OR(C226=\"\",D226=\"\",ROWS($H$2:H226)>$L$2),\"\",IF(OR(C226=\"\",D226=\"\"),\"\",SMALL($J$2:$J$250,ROWS($H$2:H226))))","v":""},{"$f":"IF(OR(C226=\"\",D226=\"\",ROWS($F$2:F226)>$L$2),\"\",IF(OR(C226=\"\",D226=\"\"),\"\",OrdeUP100(H226)))","v":""},""]
[null,null,null,null,{"$f":"IF(OR(C227=\"\",D227=\"\"),\"\",RANK(D227,$D$2:$D$250)+(ROWS($A$1:A226)-1)/100)","v":""},{"$f":"IF(OR(C227=\"\",D227=\"\",ROWS($F$2:F227)>$L$2),\"\",INDEX($C$2:$C$250,MATCH(SMALL($E$2:$E$250,ROWS($F$2:F227)),$E$2:$E$250,0)))","v":""},{"$f":"IF(OR(C227=\"\",D227=\"\",ROWS($G$2:G227)>$L$2),\"\",IF(OR(C227=\"\",D227=\"\"),\"\",INDEX($D$2:$D$250,MATCH(F227,$C$2:$C$250,0))))","v":""},{"$f":"IF(OR(C227=\"\",D227=\"\",ROWS($H$2:H227)>$L$2),\"\",IF(OR(C227=\"\",D227=\"\"),\"\",SMALL($J$2:$J$250,ROWS($H$2:H227))))","v":""},{"$f":"IF(OR(C227=\"\",D227=\"\",ROWS($F$2:F227)>$L$2),\"\",IF(OR(C227=\"\",D227=\"\"),\"\",OrdeUP100(H227)))","v":""},""]
[null,null,null,null,{"$f":"IF(OR(C228=\"\",D228=\"\"),\"\",RANK(D228,$D$2:$D$250)+(ROWS($A$1:A227)-1)/100)","v":""},{"$f":"IF(OR(C228=\"\",D228=\"\",ROWS($F$2:F228)>$L$2),\"\",INDEX($C$2:$C$250,MATCH(SMALL($E$2:$E$250,ROWS($F$2:F228)),$E$2:$E$250,0)))","v":""},{"$f":"IF(OR(C228=\"\",D228=\"\",ROWS($G$2:G228)>$L$2),\"\",IF(OR(C228=\"\",D228=\"\"),\"\",INDEX($D$2:$D$250,MATCH(F228,$C$2:$C$250,0))))","v":""},{"$f":"IF(OR(C228=\"\",D228=\"\",ROWS($H$2:H228)>$L$2),\"\",IF(OR(C228=\"\",D228=\"\"),\"\",SMALL($J$2:$J$250,ROWS($H$2:H228))))","v":""},{"$f":"IF(OR(C228=\"\",D228=\"\",ROWS($F$2:F228)>$L$2),\"\",IF(OR(C228=\"\",D228=\"\"),\"\",OrdeUP100(H228)))","v":""},""]
[null,null,null,null,{"$f":"IF(OR(C229=\"\",D229=\"\"),\"\",RANK(D229,$D$2:$D$250)+(ROWS($A$1:A228)-1)/100)","v":""},{"$f":"IF(OR(C229=\"\",D229=\"\",ROWS($F$2:F229)>$L$2),\"\",INDEX($C$2:$C$250,MATCH(SMALL($E$2:$E$250,ROWS($F$2:F229)),$E$2:$E$250,0)))","v":""},{"$f":"IF(OR(C229=\"\",D229=\"\",ROWS($G$2:G229)>$L$2),\"\",IF(OR(C229=\"\",D229=\"\"),\"\",INDEX($D$2:$D$250,MATCH(F229,$C$2:$C$250,0))))","v":""},{"$f":"IF(OR(C229=\"\",D229=\"\",ROWS($H$2:H229)>$L$2),\"\",IF(OR(C229=\"\",D229=\"\"),\"\",SMALL($J$2:$J$250,ROWS($H$2:H229))))","v":""},{"$f":"IF(OR(C229=\"\",D229=\"\",ROWS($F$2:F229)>$L$2),\"\",IF(OR(C229=\"\",D229=\"\"),\"\",OrdeUP100(H229)))","v":""},""]
[null,null,null,null,{"$f":"IF(OR(C230=\"\",D230=\"\"),\"\",RANK(D230,$D$2:$D$250)+(ROWS($A$1:A229)-1)/100)","v":""},{"$f":"IF(OR(C230=\"\",D230=\"\",ROWS($F$2:F230)>$L$2),\"\",INDEX($C$2:$C$250,MATCH(SMALL($E$2:$E$250,ROWS($F$2:F230)),$E$2:$E$250,0)))","v":""},{"$f":"IF(OR(C230=\"\",D230=\"\",ROWS($G$2:G230)>$L$2),\"\",IF(OR(C230=\"\",D230=\"\"),\"\",INDEX($D$2:$D$250,MATCH(F230,$C$2:$C$250,0))))","v":""},{"$f":"IF(OR(C230=\"\",D230=\"\",ROWS($H$2:H230)>$L$2),\"\",IF(OR(C230=\"\",D230=\"\"),\"\",SMALL($J$2:$J$250,ROWS($H$2:H230))))","v":""},{"$f":"IF(OR(C230=\"\",D230=\"\",ROWS($F$2:F230)>$L$2),\"\",IF(OR(C230=\"\",D230=\"\"),\"\",OrdeUP100(H230)))","v":""},""]
[null,null,null,null,{"$f":"IF(OR(C231=\"\",D231=\"\"),\"\",RANK(D231,$D$2:$D$250)+(ROWS($A$1:A230)-1)/100)","v":""},{"$f":"IF(OR(C231=\"\",D231=\"\",ROWS($F$2:F231)>$L$2),\"\",INDEX($C$2:$C$250,MATCH(SMALL($E$2:$E$250,ROWS($F$2:F231)),$E$2:$E$250,0)))","v":""},{"$f":"IF(OR(C231=\"\",D231=\"\",ROWS($G$2:G231)>$L$2),\"\",IF(OR(C231=\"\",D231=\"\"),\"\",INDEX($D$2:$D$250,MATCH(F231,$C$2:$C$250,0))))","v":""},{"$f":"IF(OR(C231=\"\",D231=\"\",ROWS($H$2:H231)>$L$2),\"\",IF(OR(C231=\"\",D231=\"\"),\"\",SMALL($J$2:$J$250,ROWS($H$2:H231))))","v":""},{"$f":"IF(OR(C231=\"\",D231=\"\",ROWS($F$2:F231)>$L$2),\"\",IF(OR(C231=\"\",D231=\"\"),\"\",OrdeUP100(H231)))","v":""},""]
[null,null,null,null,{"$f":"IF(OR(C232=\"\",D232=\"\"),\"\",RANK(D232,$D$2:$D$250)+(ROWS($A$1:A231)-1)/100)","v":""},{"$f":"IF(OR(C232=\"\",D232=\"\",ROWS($F$2:F232)>$L$2),\"\",INDEX($C$2:$C$250,MATCH(SMALL($E$2:$E$250,ROWS($F$2:F232)),$E$2:$E$250,0)))","v":""},{"$f":"IF(OR(C232=\"\",D232=\"\",ROWS($G$2:G232)>$L$2),\"\",IF(OR(C232=\"\",D232=\"\"),\"\",INDEX($D$2:$D$250,MATCH(F232,$C$2:$C$250,0))))","v":""},{"$f":"IF(OR(C232=\"\",D232=\"\",ROWS($H$2:H232)>$L$2),\"\",IF(OR(C232=\"\",D232=\"\"),\"\",SMALL($J$2:$J$250,ROWS($H$2:H232))))","v":""},{"$f":"IF(OR(C232=\"\",D232=\"\",ROWS($F$2:F232)>$L$2),\"\",IF(OR(C232=\"\",D232=\"\"),\"\",OrdeUP100(H232)))","v":""},""]
[null,null,null,null,{"$f":"IF(OR(C233=\"\",D233=\"\"),\"\",RANK(D233,$D$2:$D$250)+(ROWS($A$1:A232)-1)/100)","v":""},{"$f":"IF(OR(C233=\"\",D233=\"\",ROWS($F$2:F233)>$L$2),\"\",INDEX($C$2:$C$250,MATCH(SMALL($E$2:$E$250,ROWS($F$2:F233)),$E$2:$E$250,0)))","v":""},{"$f":"IF(OR(C233=\"\",D233=\"\",ROWS($G$2:G233)>$L$2),\"\",IF(OR(C233=\"\",D233=\"\"),\"\",INDEX($D$2:$D$250,MATCH(F233,$C$2:$C$250,0))))","v":""},{"$f":"IF(OR(C233=\"\",D233=\"\",ROWS($H$2:H233)>$L$2),\"\",IF(OR(C233=\"\",D233=\"\"),\"\",SMALL($J$2:$J$250,ROWS($H$2:H233))))","v":""},{"$f":"IF(OR(C233=\"\",D233=\"\",ROWS($F$2:F233)>$L$2),\"\",IF(OR(C233=\"\",D233=\"\"),\"\",OrdeUP100(H233)))","v":""},""]
[null,null,null,null,{"$f":"IF(OR(C234=\"\",D234=\"\"),\"\",RANK(D234,$D$2:$D$250)+(ROWS($A$1:A233)-1)/100)","v":""},{"$f":"IF(OR(C234=\"\",D234=\"\",ROWS($F$2:F234)>$L$2),\"\",INDEX($C$2:$C$250,MATCH(SMALL($E$2:$E$250,ROWS($F$2:F234)),$E$2:$E$250,0)))","v":""},{"$f":"IF(OR(C234=\"\",D234=\"\",ROWS($G$2:G234)>$L$2),\"\",IF(OR(C234=\"\",D234=\"\"),\"\",INDEX($D$2:$D$250,MATCH(F234,$C$2:$C$250,0))))","v":""},{"$f":"IF(OR(C234=\"\",D234=\"\",ROWS($H$2:H234)>$L$2),\"\",IF(OR(C234=\"\",D234=\"\"),\"\",SMALL($J$2:$J$250,ROWS($H$2:H234))))","v":""},{"$f":"IF(OR(C234=\"\",D234=\"\",ROWS($F$2:F234)>$L$2),\"\",IF(OR(C234=\"\",D234=\"\"),\"\",OrdeUP100(H234)))","v":""},""]
[null,null,null,null,{"$f":"IF(OR(C235=\"\",D235=\"\"),\"\",RANK(D235,$D$2:$D$250)+(ROWS($A$1:A234)-1)/100)","v":""},{"$f":"IF(OR(C235=\"\",D235=\"\",ROWS($F$2:F235)>$L$2),\"\",INDEX($C$2:$C$250,MATCH(SMALL($E$2:$E$250,ROWS($F$2:F235)),$E$2:$E$250,0)))","v":""},{"$f":"IF(OR(C235=\"\",D235=\"\",ROWS($G$2:G235)>$L$2),\"\",IF(OR(C235=\"\",D235=\"\"),\"\",INDEX($D$2:$D$250,MATCH(F235,$C$2:$C$250,0))))","v":""},{"$f":"IF(OR(C235=\"\",D235=\"\",ROWS($H$2:H235)>$L$2),\"\",IF(OR(C235=\"\",D235=\"\"),\"\",SMALL($J$2:$J$250,ROWS($H$2:H235))))","v":""},{"$f":"IF(OR(C235=\"\",D235=\"\",ROWS($F$2:F235)>$L$2),\"\",IF(OR(C235=\"\",D235=\"\"),\"\",OrdeUP100(H235)))","v":""},""]
[null,null,null,null,{"$f":"IF(OR(C236=\"\",D236=\"\"),\"\",RANK(D236,$D$2:$D$250)+(ROWS($A$1:A235)-1)/100)","v":""},{"$f":"IF(OR(C236=\"\",D236=\"\",ROWS($F$2:F236)>$L$2),\"\",INDEX($C$2:$C$250,MATCH(SMALL($E$2:$E$250,ROWS($F$2:F236)),$E$2:$E$250,0)))","v":""},{"$f":"IF(OR(C236=\"\",D236=\"\",ROWS($G$2:G236)>$L$2),\"\",IF(OR(C236=\"\",D236=\"\"),\"\",INDEX($D$2:$D$250,MATCH(F236,$C$2:$C$250,0))))","v":""},{"$f":"IF(OR(C236=\"\",D236=\"\",ROWS($H$2:H236)>$L$2),\"\",IF(OR(C236=\"\",D236=\"\"),\"\",SMALL($J$2:$J$250,ROWS($H$2:H236))))","v":""},{"$f":"IF(OR(C236=\"\",D236=\"\",ROWS($F$2:F236)>$L$2),\"\",IF(OR(C236=\"\",D236=\"\"),\"\",OrdeUP100(H236)))","v":""},""]
[null,null,null,null,{"$f":"IF(OR(C237=\"\",D237=\"\"),\"\",RANK(D237,$D$2:$D$250)+(ROWS($A$1:A236)-1)/100)","v":""},{"$f":"IF(OR(C237=\"\",D237=\"\",ROWS($F$2:F237)>$L$2),\"\",INDEX($C$2:$C$250,MATCH(SMALL($E$2:$E$250,ROWS($F$2:F237)),$E$2:$E$250,0)))","v":""},{"$f":"IF(OR(C237=\"\",D237=\"\",ROWS($G$2:G237)>$L$2),\"\",IF(OR(C237=\"\",D237=\"\"),\"\",INDEX($D$2:$D$250,MATCH(F237,$C$2:$C$250,0))))","v":""},{"$f":"IF(OR(C237=\"\",D237=\"\",ROWS($H$2:H237)>$L$2),\"\",IF(OR(C237=\"\",D237=\"\"),\"\",SMALL($J$2:$J$250,ROWS($H$2:H237))))","v":""},{"$f":"IF(OR(C237=\"\",D237=\"\",ROWS($F$2:F237)>$L$2),\"\",IF(OR(C237=\"\",D237=\"\"),\"\",OrdeUP100(H237)))","v":""},""]
[null,null,null,null,{"$f":"IF(OR(C238=\"\",D238=\"\"),\"\",RANK(D238,$D$2:$D$250)+(ROWS($A$1:A237)-1)/100)","v":""},{"$f":"IF(OR(C238=\"\",D238=\"\",ROWS($F$2:F238)>$L$2),\"\",INDEX($C$2:$C$250,MATCH(SMALL($E$2:$E$250,ROWS($F$2:F238)),$E$2:$E$250,0)))","v":""},{"$f":"IF(OR(C238=\"\",D238=\"\",ROWS($G$2:G238)>$L$2),\"\",IF(OR(C238=\"\",D238=\"\"),\"\",INDEX($D$2:$D$250,MATCH(F238,$C$2:$C$250,0))))","v":""},{"$f":"IF(OR(C238=\"\",D238=\"\",ROWS($H$2:H238)>$L$2),\"\",IF(OR(C238=\"\",D238=\"\"),\"\",SMALL($J$2:$J$250,ROWS($H$2:H238))))","v":""},{"$f":"IF(OR(C238=\"\",D238=\"\",ROWS($F$2:F238)>$L$2),\"\",IF(OR(C238=\"\",D238=\"\"),\"\",OrdeUP100(H238)))","v":""},""]
[null,null,null,null,{"$f":"IF(OR(C239=\"\",D239=\"\"),\"\",RANK(D239,$D$2:$D$250)+(ROWS($A$1:A238)-1)/100)","v":""},{"$f":"IF(OR(C239=\"\",D239=\"\",ROWS($F$2:F239)>$L$2),\"\",INDEX($C$2:$C$250,MATCH(SMALL($E$2:$E$250,ROWS($F$2:F239)),$E$2:$E$250,0)))","v":""},{"$f":"IF(OR(C239=\"\",D239=\"\",ROWS($G$2:G239)>$L$2),\"\",IF(OR(C239=\"\",D239=\"\"),\"\",INDEX($D$2:$D$250,MATCH(F239,$C$2:$C$250,0))))","v":""},{"$f":"IF(OR(C239=\"\",D239=\"\",ROWS($H$2:H239)>$L$2),\"\",IF(OR(C239=\"\",D239=\"\"),\"\",SMALL($J$2:$J$250,ROWS($H$2:H239))))","v":""},{"$f":"IF(OR(C239=\"\",D239=\"\",ROWS($F$2:F239)>$L$2),\"\",IF(OR(C239=\"\",D239=\"\"),\"\",OrdeUP100(H239)))","v":""},""]
[null,null,null,null,{"$f":"IF(OR(C240=\"\",D240=\"\"),\"\",RANK(D240,$D$2:$D$250)+(ROWS($A$1:A239)-1)/100)","v":""},{"$f":"IF(OR(C240=\"\",D240=\"\",ROWS($F$2:F240)>$L$2),\"\",INDEX($C$2:$C$250,MATCH(SMALL($E$2:$E$250,ROWS($F$2:F240)),$E$2:$E$250,0)))","v":""},{"$f":"IF(OR(C240=\"\",D240=\"\",ROWS($G$2:G240)>$L$2),\"\",IF(OR(C240=\"\",D240=\"\"),\"\",INDEX($D$2:$D$250,MATCH(F240,$C$2:$C$250,0))))","v":""},{"$f":"IF(OR(C240=\"\",D240=\"\",ROWS($H$2:H240)>$L$2),\"\",IF(OR(C240=\"\",D240=\"\"),\"\",SMALL($J$2:$J$250,ROWS($H$2:H240))))","v":""},{"$f":"IF(OR(C240=\"\",D240=\"\",ROWS($F$2:F240)>$L$2),\"\",IF(OR(C240=\"\",D240=\"\"),\"\",OrdeUP100(H240)))","v":""},""]
[null,null,null,null,{"$f":"IF(OR(C241=\"\",D241=\"\"),\"\",RANK(D241,$D$2:$D$250)+(ROWS($A$1:A240)-1)/100)","v":""},{"$f":"IF(OR(C241=\"\",D241=\"\",ROWS($F$2:F241)>$L$2),\"\",INDEX($C$2:$C$250,MATCH(SMALL($E$2:$E$250,ROWS($F$2:F241)),$E$2:$E$250,0)))","v":""},{"$f":"IF(OR(C241=\"\",D241=\"\",ROWS($G$2:G241)>$L$2),\"\",IF(OR(C241=\"\",D241=\"\"),\"\",INDEX($D$2:$D$250,MATCH(F241,$C$2:$C$250,0))))","v":""},{"$f":"IF(OR(C241=\"\",D241=\"\",ROWS($H$2:H241)>$L$2),\"\",IF(OR(C241=\"\",D241=\"\"),\"\",SMALL($J$2:$J$250,ROWS($H$2:H241))))","v":""},{"$f":"IF(OR(C241=\"\",D241=\"\",ROWS($F$2:F241)>$L$2),\"\",IF(OR(C241=\"\",D241=\"\"),\"\",OrdeUP100(H241)))","v":""},""]
[null,null,null,null,{"$f":"IF(OR(C242=\"\",D242=\"\"),\"\",RANK(D242,$D$2:$D$250)+(ROWS($A$1:A241)-1)/100)","v":""},{"$f":"IF(OR(C242=\"\",D242=\"\",ROWS($F$2:F242)>$L$2),\"\",INDEX($C$2:$C$250,MATCH(SMALL($E$2:$E$250,ROWS($F$2:F242)),$E$2:$E$250,0)))","v":""},{"$f":"IF(OR(C242=\"\",D242=\"\",ROWS($G$2:G242)>$L$2),\"\",IF(OR(C242=\"\",D242=\"\"),\"\",INDEX($D$2:$D$250,MATCH(F242,$C$2:$C$250,0))))","v":""},{"$f":"IF(OR(C242=\"\",D242=\"\",ROWS($H$2:H242)>$L$2),\"\",IF(OR(C242=\"\",D242=\"\"),\"\",SMALL($J$2:$J$250,ROWS($H$2:H242))))","v":""},{"$f":"IF(OR(C242=\"\",D242=\"\",ROWS($F$2:F242)>$L$2),\"\",IF(OR(C242=\"\",D242=\"\"),\"\",OrdeUP100(H242)))","v":""},""]
[null,null,null,null,{"$f":"IF(OR(C243=\"\",D243=\"\"),\"\",RANK(D243,$D$2:$D$250)+(ROWS($A$1:A242)-1)/100)","v":""},{"$f":"IF(OR(C243=\"\",D243=\"\",ROWS($F$2:F243)>$L$2),\"\",INDEX($C$2:$C$250,MATCH(SMALL($E$2:$E$250,ROWS($F$2:F243)),$E$2:$E$250,0)))","v":""},{"$f":"IF(OR(C243=\"\",D243=\"\",ROWS($G$2:G243)>$L$2),\"\",IF(OR(C243=\"\",D243=\"\"),\"\",INDEX($D$2:$D$250,MATCH(F243,$C$2:$C$250,0))))","v":""},{"$f":"IF(OR(C243=\"\",D243=\"\",ROWS($H$2:H243)>$L$2),\"\",IF(OR(C243=\"\",D243=\"\"),\"\",SMALL($J$2:$J$250,ROWS($H$2:H243))))","v":""},{"$f":"IF(OR(C243=\"\",D243=\"\",ROWS($F$2:F243)>$L$2),\"\",IF(OR(C243=\"\",D243=\"\"),\"\",OrdeUP100(H243)))","v":""},""]
[null,null,null,null,{"$f":"IF(OR(C244=\"\",D244=\"\"),\"\",RANK(D244,$D$2:$D$250)+(ROWS($A$1:A243)-1)/100)","v":""},{"$f":"IF(OR(C244=\"\",D244=\"\",ROWS($F$2:F244)>$L$2),\"\",INDEX($C$2:$C$250,MATCH(SMALL($E$2:$E$250,ROWS($F$2:F244)),$E$2:$E$250,0)))","v":""},{"$f":"IF(OR(C244=\"\",D244=\"\",ROWS($G$2:G244)>$L$2),\"\",IF(OR(C244=\"\",D244=\"\"),\"\",INDEX($D$2:$D$250,MATCH(F244,$C$2:$C$250,0))))","v":""},{"$f":"IF(OR(C244=\"\",D244=\"\",ROWS($H$2:H244)>$L$2),\"\",IF(OR(C244=\"\",D244=\"\"),\"\",SMALL($J$2:$J$250,ROWS($H$2:H244))))","v":""},{"$f":"IF(OR(C244=\"\",D244=\"\",ROWS($F$2:F244)>$L$2),\"\",IF(OR(C244=\"\",D244=\"\"),\"\",OrdeUP100(H244)))","v":""},""]
[null,null,null,null,{"$f":"IF(OR(C245=\"\",D245=\"\"),\"\",RANK(D245,$D$2:$D$250)+(ROWS($A$1:A244)-1)/100)","v":""},{"$f":"IF(OR(C245=\"\",D245=\"\",ROWS($F$2:F245)>$L$2),\"\",INDEX($C$2:$C$250,MATCH(SMALL($E$2:$E$250,ROWS($F$2:F245)),$E$2:$E$250,0)))","v":""},{"$f":"IF(OR(C245=\"\",D245=\"\",ROWS($G$2:G245)>$L$2),\"\",IF(OR(C245=\"\",D245=\"\"),\"\",INDEX($D$2:$D$250,MATCH(F245,$C$2:$C$250,0))))","v":""},{"$f":"IF(OR(C245=\"\",D245=\"\",ROWS($H$2:H245)>$L$2),\"\",IF(OR(C245=\"\",D245=\"\"),\"\",SMALL($J$2:$J$250,ROWS($H$2:H245))))","v":""},{"$f":"IF(OR(C245=\"\",D245=\"\",ROWS($F$2:F245)>$L$2),\"\",IF(OR(C245=\"\",D245=\"\"),\"\",OrdeUP100(H245)))","v":""},""]
[null,null,null,null,{"$f":"IF(OR(C246=\"\",D246=\"\"),\"\",RANK(D246,$D$2:$D$250)+(ROWS($A$1:A245)-1)/100)","v":""},{"$f":"IF(OR(C246=\"\",D246=\"\",ROWS($F$2:F246)>$L$2),\"\",INDEX($C$2:$C$250,MATCH(SMALL($E$2:$E$250,ROWS($F$2:F246)),$E$2:$E$250,0)))","v":""},{"$f":"IF(OR(C246=\"\",D246=\"\",ROWS($G$2:G246)>$L$2),\"\",IF(OR(C246=\"\",D246=\"\"),\"\",INDEX($D$2:$D$250,MATCH(F246,$C$2:$C$250,0))))","v":""},{"$f":"IF(OR(C246=\"\",D246=\"\",ROWS($H$2:H246)>$L$2),\"\",IF(OR(C246=\"\",D246=\"\"),\"\",SMALL($J$2:$J$250,ROWS($H$2:H246))))","v":""},{"$f":"IF(OR(C246=\"\",D246=\"\",ROWS($F$2:F246)>$L$2),\"\",IF(OR(C246=\"\",D246=\"\"),\"\",OrdeUP100(H246)))","v":""},""]
[null,null,null,null,{"$f":"IF(OR(C247=\"\",D247=\"\"),\"\",RANK(D247,$D$2:$D$250)+(ROWS($A$1:A246)-1)/100)","v":""},{"$f":"IF(OR(C247=\"\",D247=\"\",ROWS($F$2:F247)>$L$2),\"\",INDEX($C$2:$C$250,MATCH(SMALL($E$2:$E$250,ROWS($F$2:F247)),$E$2:$E$250,0)))","v":""},{"$f":"IF(OR(C247=\"\",D247=\"\",ROWS($G$2:G247)>$L$2),\"\",IF(OR(C247=\"\",D247=\"\"),\"\",INDEX($D$2:$D$250,MATCH(F247,$C$2:$C$250,0))))","v":""},{"$f":"IF(OR(C247=\"\",D247=\"\",ROWS($H$2:H247)>$L$2),\"\",IF(OR(C247=\"\",D247=\"\"),\"\",SMALL($J$2:$J$250,ROWS($H$2:H247))))","v":""},{"$f":"IF(OR(C247=\"\",D247=\"\",ROWS($F$2:F247)>$L$2),\"\",IF(OR(C247=\"\",D247=\"\"),\"\",OrdeUP100(H247)))","v":""},""]
[null,null,null,null,{"$f":"IF(OR(C248=\"\",D248=\"\"),\"\",RANK(D248,$D$2:$D$250)+(ROWS($A$1:A247)-1)/100)","v":""},{"$f":"IF(OR(C248=\"\",D248=\"\",ROWS($F$2:F248)>$L$2),\"\",INDEX($C$2:$C$250,MATCH(SMALL($E$2:$E$250,ROWS($F$2:F248)),$E$2:$E$250,0)))","v":""},{"$f":"IF(OR(C248=\"\",D248=\"\",ROWS($G$2:G248)>$L$2),\"\",IF(OR(C248=\"\",D248=\"\"),\"\",INDEX($D$2:$D$250,MATCH(F248,$C$2:$C$250,0))))","v":""},{"$f":"IF(OR(C248=\"\",D248=\"\",ROWS($H$2:H248)>$L$2),\"\",IF(OR(C248=\"\",D248=\"\"),\"\",SMALL($J$2:$J$250,ROWS($H$2:H248))))","v":""},{"$f":"IF(OR(C248=\"\",D248=\"\",ROWS($F$2:F248)>$L$2),\"\",IF(OR(C248=\"\",D248=\"\"),\"\",OrdeUP100(H248)))","v":""},""]
[null,null,null,null,{"$f":"IF(OR(C249=\"\",D249=\"\"),\"\",RANK(D249,$D$2:$D$250)+(ROWS($A$1:A248)-1)/100)","v":""},{"$f":"IF(OR(C249=\"\",D249=\"\",ROWS($F$2:F249)>$L$2),\"\",INDEX($C$2:$C$250,MATCH(SMALL($E$2:$E$250,ROWS($F$2:F249)),$E$2:$E$250,0)))","v":""},{"$f":"IF(OR(C249=\"\",D249=\"\",ROWS($G$2:G249)>$L$2),\"\",IF(OR(C249=\"\",D249=\"\"),\"\",INDEX($D$2:$D$250,MATCH(F249,$C$2:$C$250,0))))","v":""},{"$f":"IF(OR(C249=\"\",D249=\"\",ROWS($H$2:H249)>$L$2),\"\",IF(OR(C249=\"\",D249=\"\"),\"\",SMALL($J$2:$J$250,ROWS($H$2:H249))))","v":""},{"$f":"IF(OR(C249=\"\",D249=\"\",ROWS($F$2:F249)>$L$2),\"\",IF(OR(C249=\"\",D249=\"\"),\"\",OrdeUP100(H249)))","v":""},""]
[null,null,null,null,{"$f":"IF(OR(C250=\"\",D250=\"\"),\"\",RANK(D250,$D$2:$D$250)+(ROWS($A$1:A249)-1)/100)","v":""},{"$f":"IF(OR(C250=\"\",D250=\"\",ROWS($F$2:F250)>$L$2),\"\",INDEX($C$2:$C$250,MATCH(SMALL($E$2:$E$250,ROWS($F$2:F250)),$E$2:$E$250,0)))","v":""},{"$f":"IF(OR(C250=\"\",D250=\"\",ROWS($G$2:G250)>$L$2),\"\",IF(OR(C250=\"\",D250=\"\"),\"\",INDEX($D$2:$D$250,MATCH(F250,$C$2:$C$250,0))))","v":""},{"$f":"IF(OR(C250=\"\",D250=\"\",ROWS($H$2:H250)>$L$2),\"\",IF(OR(C250=\"\",D250=\"\"),\"\",SMALL($J$2:$J$250,ROWS($H$2:H250))))","v":""},{"$f":"IF(OR(C250=\"\",D250=\"\",ROWS($F$2:F250)>$L$2),\"\",IF(OR(C250=\"\",D250=\"\"),\"\",OrdeUP100(H250)))","v":""},""]

{"sheet":"Sheet2","index":1,"n_rows":0,"n_cols":0,"rows_kept":0,"cut":false,"hidden":false,"merged":[]}

{"sheet":"Sheet3","index":2,"n_rows":0,"n_cols":0,"rows_kept":0,"cut":false,"hidden":false,"merged":[]}