{"text_format":"1","workbook":"xlsx","n_sheets":3,"sheets":["ورقة1","ورقة2","ورقة3"],"not_rendered":{"charts":0,"images":0,"macros":0,"external_links":0,"defined_names":0,"comments":0,"pivot_tables":0},"unopened":[],"bounds":{"document_bytes":16777216,"sheet_cells":100000,"rows_first":2000,"rows_last":500,"rows_between":2000,"halvings":0,"cell_chars":16384,"cell_head_chars":4096},"cells_cut":0,"cells_raw":0,"read":"whole","date_system":"1900"}

{"sheet":"ورقة1","index":0,"n_rows":37,"n_cols":8,"rows_kept":37,"cut":false,"hidden":false,"merged":[[7,7,11,12],[0,7,6,12],[3,2,5,2],[3,0,5,0],[3,1,5,1],[0,0,1,6],[2,0,2,6]]}
["درجات نصف العام الدراسى 2019 / 2020 ",null,null,null,null,null,null,"شرح الدالة   Vlookup"]
[]
["الصف السادس الابتدائى"]
["م","الاسم","رقم الجلوس","لغة عربية","رياضيات","دراسات","مج"]
[null,null,null,100,40,40,180]
[null,null,null,50,20,20,90]
[{"$f":"ROW()-6","v":1},"ابراهيم محمد ابراهيم حمدى",501,100,40,40,{"$f":"SUM(D7,E7,F7)","v":180}]
[{"$f":"ROW()-6","v":2},"احمد خالد احمد عبد القادر سلامه",502,95,35,36,{"$f":"SUM(D8,E8,F8)","v":166},"الدرس العاشر لشرح برنامج الاكسيل"]
[3,"احمد شريف عباس بريشة ",503,94,36,35,165]
[4,"احمد طارق حسين محمود عبد العال",504,98,36,26,160]
[5,"احمد عمرو احمد سمير ادم",505,87,25,35,147]
[6,"احمد محمد احمد الزواوى",506,57,36,34,127]
[7,"احمد محمد احمد محمد الشيخ",507,75,36,36,147]
[8,"احمد محمد هانى ابو شليب ",508,76,35,35,146]
[9,"احمد وائل كمال بخاتى",509,62,34,34,130]
[10,"احمد وائل محمد عبد النبى",510,26,25,15,66]
[11,"احمد وحيد محمد رحمى محمد احمد على",511,63,28,32,123]
[12,"احمد وليد محمود عبد الهادى هلالى",512,65,35,36,136]
[13,"احمد ياسر سعد احمد الجندى",513,68,35,34,137]
[14,"ادم حازم سعيد السيد فرج",514,86,34,39,159]
[15,"ادم ماجد محمد عبد المنعم ابو غصيبة ",515,86,34,38,158]
[16,"ادم محمد نجيب ذكى شعير",516,95,36,35,166]
[17,"ادهم ايمن ابراهيم سويلم",517,94,35,36,165]
[18,"ادهم بلال عبد الحميد دراذ",518,97,35,32,164]
[19,"ادهم طارق صالح عبد الحميد محمود",519,85,32,32,149]
[20,"ارسانى ريمون ميشيل صليب",520,52,32,23,107]
[21,"اسماعيل محمد اسماعيل محمد ابو ديب",521,56,23,35,114]
[22,"اندرو سامى نصيف نسيم نصيف",522,65,36,35,136]
[23,"اياد محمد سمير محمد جاد الكريم يوسف",523,99,35,33,167]
[24,"بافلى جورج مليكه جورج",524,100,36,36,172]
[25,"براء حاتم عبد الرحيم خليفه",525,25,36,38,99]
[26,"بيشوى عيسى مسعد سلامه رزق",526,96,35,34,165]
[27,"توماس اشرف شوقى عطا لوقا",527,95,35,35,165]
[28,"توماس يوسف نبيل يوسف صليب",528,93,21,9,123]
[29,"جان وجدى فانوس ميخائيل فانوس",529,99,12,36,147]
[30,"جوفانى اشرف عياد فرنسيس",530,95,25,35,155]
[null,null,null,null,null,null,0]

{"sheet":"ورقة2","index":1,"n_rows":9,"n_cols":9,"rows_kept":9,"cut":false,"hidden":false,"merged":[[0,0,0,5],[1,0,1,5],[9,2,9,5],[8,2,8,5],[3,0,5,0],[3,1,5,1],[6,1,7,1],[6,0,7,0],[2,0,2,5]]}
["درجات نصف العام الدراسى 2019 / 2020 ",null,null,null,null,null,null,null,1]
["الصف السادس الابتدائى"]
["مدرسة السلام الخاصة"]
["الاسم","رقم الجلوس","لغة عربية","رياضيات","دراسات","مج"]
[null,null,100,40,40,180]
[null,null,50,20,20,90]
[{"$f":"IF(ورقة1!A7=\"\",\"\",VLOOKUP(I1,ورقة1!A7:G36,2))","v":"ابراهيم محمد ابراهيم حمدى"},{"$f":"IF(ورقة1!A7=\"\",\"\",VLOOKUP(I1,ورقة1!A7:G36,3))","v":501},{"$f":"IF(ورقة1!A7=\"\",\"\",VLOOKUP(I1,ورقة1!A7:G36,4))","v":100},{"$f":"IF(ورقة1!A7=\"\",\"\",VLOOKUP(I1,ورقة1!A7:G36,5))","v":40},{"$f":"IF(ورقة1!A7=\"\",\"\",VLOOKUP(I1,ورقة1!A7:G36,6))","v":40},{"$f":"IF(ورقة1!A7=\"\",\"\",VLOOKUP(I1,ورقة1!A7:G36,7))","v":180}]
[]
["رئيس الكنترول",null,"مدير المدارس"]

{"sheet":"ورقة3","index":2,"n_rows":0,"n_cols":0,"rows_kept":0,"cut":false,"hidden":false,"merged":[]}