{"text_format":"1","workbook":"xlsx","n_sheets":6,"sheets":["job Order","التسليمات","كشف حساب عميل","الطباعه وطبقه حمايه","تقرير الطباعه","Sheet1"],"not_rendered":{"charts":0,"images":0,"macros":1,"external_links":0,"defined_names":6,"comments":0,"pivot_tables":0},"unopened":[],"bounds":{"document_bytes":16777216,"sheet_cells":100000,"rows_first":2000,"rows_last":500,"rows_between":2000,"halvings":0,"cell_chars":16384,"cell_head_chars":4096},"cells_cut":0,"cells_raw":0,"read":"whole","date_system":"1900"}

{"sheet":"job Order","index":0,"n_rows":327,"n_cols":77,"rows_kept":327,"cut":false,"hidden":false,"merged":[]}
[null,1,2,3,4,5,6,7,8,9,10,11,12,13,14,15,16,17,18,19,20,21,22,23,24,25,26,27,28,29,30,31,32,33,34,35,36,37,38,39,40,41,42,43,44,45,46,47,48,49,50,51,52,53,54,55,56,57,58,59,60,61,62,63,64,65,66,67,68,69,70]
[]
["مسلسل","رقم امر الشغل","التاريخ","اسم المنتج","اسم المصنع","اسم العميل","الكميه ","عدد الشرائح","نوع الشيت"," البكر","عرض البكر","طول","السنة الاولي","نوع الخامة","معامل السنه الاولي","جرام الورق","الوزن المطلوب","السنة الثانية ","نوع الخامة2","معامل السنه الثانيه","جرام الورق3","الوزن المطلوب4","الدهر الاول","جرام الورق5","الوزن المطلوب6","الدهر الثاني","جرام الورق7","الوزن المطلوب8","دوبلكس الطباعه","جرام الورق2","الوزن المطلوب9","اسم المطبعه","الوان الطباعه ","عدد الاطقم ","مورد طبقه الحمايه","طبقة الحماية","تشطيب","عدد الدبوس","عدد الربطه","عدد الكرسي","ارتفاع الربط ","رقم تليفون العميل","مكان التسليم ","نوع التحميل","مقاس البالته ","ارتفاع البالته ","مورد الفورمه ","رقم الفورمه ","طول10","عرض","ارتفاع","الطعم 1","الكميه 1","الطعم 2","الكميه 2","الطعم 3","الكميه 3","الطعم 4","الكميه 4","الطعم 5","الكميه 5","الطعم 6","الكميه 6","الطعم 7","الكميه 7","الطعم 8","الكميه 8","السعر ","سعر الصرف","ملاحظات","ملاحظات امر التوريد","الفرق في الكميه",null,null,"الكميه المنتجه","الكميه المسلمه","الفرق"]
[{"$f":"IF(D4<>\"\",MAX($A$1:A3)+1,\"\")","v":1},3,"2020-01-04","كرتون - هالك مقاس صغير  دوبل ",{"$f":"IFERROR(VLOOKUP($D4,table2,2,0),\"\")","v":""},"عميل نقدى",500,{"$f":"IFERROR(VLOOKUP($D4,table2,17,0)*$G4,\"\")","v":""},{"$f":"IFERROR(VLOOKUP($D4,table2,18,0),\"\")","v":""},{"$f":"IFERROR(VLOOKUP($D4,table2,14,0),\"\")","v":""},{"$f":"IFERROR(VLOOKUP($D4,table2,15,0),\"\")","v":""},{"$f":"IFERROR(VLOOKUP($D4,table2,16,0),\"\")","v":""},{"$f":"IFERROR(VLOOKUP($D4,table2,19,0),\"\")","v":""},{"$f":"IFERROR(VLOOKUP($D4,table2,20,0),\"\")","v":""},{"$f":"IFERROR(VLOOKUP($M4,#REF!,2,0),\"\")","v":""},null,{"$f":"IFERROR(ROUNDUP(($H4*$K4*$L4*$O4*$P4)/1000,),\"------\")","v":"------"},{"$f":"IFERROR(VLOOKUP($D4,table2,21,0),\"\")","v":""},{"$f":"IFERROR(VLOOKUP($D4,table2,22,0),\"\")","v":""},{"$f":"IFERROR(VLOOKUP($R4,#REF!,2,0),\"\")","v":""},null,{"$f":"IFERROR(ROUNDUP(($H4*$K4*$L4*$T4*$U4)/1000,),\"------\")","v":"------"},{"$f":"IFERROR(VLOOKUP($D4,table2,23,0),\"\")","v":""},null,{"$f":"IFERROR(ROUNDUP(($H4*$K4*$L4*$X4)/1000,),\"------\")","v":"------"},{"$f":"IFERROR(VLOOKUP($D4,table2,24,0),\"\")","v":""},null,{"$f":"IFERROR(ROUNDUP(($H4*$K4*$L4*$AA4)/1000,),\"------\")","v":"------"},{"$f":"IFERROR(VLOOKUP($D4,table2,25,0),\"\")","v":""},null,{"$f":"IFERROR(ROUNDUP(($H4*$K4*$L4*$AD4)/1000,),\"------\")","v":"------"},{"$f":"IFERROR(VLOOKUP($D4,table2,27,0),\"\")","v":""},{"$f":"IFERROR(VLOOKUP($D4,table2,28,0),\"\")","v":""},{"$f":"IFERROR(VLOOKUP($D4,table2,29,0),\"\")","v":""},{"$f":"IFERROR(VLOOKUP($D4,table2,30,0),\"\")","v":""},{"$f":"IFERROR(VLOOKUP($D4,table2,31,0),\"\")","v":""},{"$f":"IFERROR(VLOOKUP($D4,table2,32,0),\"\")","v":""},{"$f":"IFERROR(VLOOKUP($D4,table2,33,0),\"\")","v":""},{"$f":"IFERROR(VLOOKUP($D4,table2,34,0),\"\")","v":""},{"$f":"IFERROR(VLOOKUP($D4,table2,35,0),\"\")","v":""},{"$f":"IFERROR(VLOOKUP($D4,table2,36,0),\"\")","v":""},{"$f":"IFERROR(VLOOKUP($D4,table2,37,0),\"\")","v":""},{"$f":"IFERROR(VLOOKUP($D4,table2,38,0),\"\")","v":""},{"$f":"IFERROR(VLOOKUP($D4,table2,39,0),\"\")","v":""},{"$f":"IFERROR(VLOOKUP($D4,table2,40,0),\"\")","v":""},{"$f":"IFERROR(VLOOKUP($D4,table2,41,0),\"\")","v":""},{"$f":"IFERROR(VLOOKUP($D4,table2,5,0),\"\")","v":""},{"$f":"IFERROR(VLOOKUP($D4,table2,6,0),\"\")","v":""},{"$f":"IFERROR(VLOOKUP($D4,table2,11,0),\"\")","v":""},{"$f":"IFERROR(VLOOKUP($D4,table2,12,0),\"\")","v":""},{"$f":"IFERROR(VLOOKUP($D4,table2,13,0),\"\")","v":""},null,null,null,null,null,null,null,null,null,null,null,null,null,null,null,null,3,1,{"$f":"IFERROR(VLOOKUP($D4,table2,42,0),\"\")","v":""},null,null,null,null,{"$f":"IFERROR(VLOOKUP(Table4[[#This Row],[رقم امر الشغل]],table5,9,0),\"\")","v":""},{"$f":"IFERROR(VLOOKUP(Table4[[#This Row],[رقم امر الشغل]],table5,10,0),\"\")","v":""},{"$f":"IFERROR((BW4-BX4),\"\")","v":""}]
[{"$f":"IF(D5<>\"\",MAX($A$1:A4)+1,\"\")","v":2},3650,"2020-01-07","كوين - علبه شيكولاته 1 كيلو كرسبي وبالبن","عميل نقدى","عميل نقدى",100,"","","","","","","",{"$f":"IFERROR(VLOOKUP($M5,#REF!,2,0),\"\")","v":""},null,"------","","",{"$f":"IFERROR(VLOOKUP($R5,#REF!,2,0),\"\")","v":""},null,"------","",null,"------","",null,"------","",null,"------",null,null,null,null,null,null,null,null,null,null,null,null,"يدوي","","","","","","","",null,null,null,null,null,null,null,null,null,null,null,null,null,null,null,null,1.25,1,"","كوريشه هالك",-1,null,null,{"$f":"IFERROR(VLOOKUP(Table4[[#This Row],[رقم امر الشغل]],table5,9,0),\"\")","v":""},{"$f":"IFERROR(VLOOKUP(Table4[[#This Row],[رقم امر الشغل]],table5,10,0),\"\")","v":""},""]
[{"$f":"IF(D6<>\"\",MAX($A$1:A5)+1,\"\")","v":""},null,null,null,{"$f":"IFERROR(VLOOKUP($D6,table2,2,0),\"\")","v":""},{"$f":"IFERROR(VLOOKUP($D6,table2,3,0),\"\")","v":""},null,{"$f":"IFERROR(VLOOKUP($D6,table2,17,0)*$G6,\"\")","v":""},{"$f":"IFERROR(VLOOKUP($D6,table2,18,0),\"\")","v":""},{"$f":"IFERROR(VLOOKUP($D6,table2,14,0),\"\")","v":""},{"$f":"IFERROR(VLOOKUP($D6,table2,15,0),\"\")","v":""},{"$f":"IFERROR(VLOOKUP($D6,table2,16,0),\"\")","v":""},{"$f":"IFERROR(VLOOKUP($D6,table2,19,0),\"\")","v":""},{"$f":"IFERROR(VLOOKUP($D6,table2,20,0),\"\")","v":""},{"$f":"IFERROR(VLOOKUP($M6,#REF!,2,0),\"\")","v":""},null,{"$f":"IFERROR(ROUNDUP(($H6*$K6*$L6*$O6*$P6)/1000,),\"------\")","v":"------"},{"$f":"IFERROR(VLOOKUP($D6,table2,21,0),\"\")","v":""},{"$f":"IFERROR(VLOOKUP($D6,table2,22,0),\"\")","v":""},{"$f":"IFERROR(VLOOKUP($R6,#REF!,2,0),\"\")","v":""},null,{"$f":"IFERROR(ROUNDUP(($H6*$K6*$L6*$T6*$U6)/1000,),\"------\")","v":"------"},{"$f":"IFERROR(VLOOKUP($D6,table2,23,0),\"\")","v":""},null,{"$f":"IFERROR(ROUNDUP(($H6*$K6*$L6*$X6)/1000,),\"------\")","v":"------"},{"$f":"IFERROR(VLOOKUP($D6,table2,24,0),\"\")","v":""},null,{"$f":"IFERROR(ROUNDUP(($H6*$K6*$L6*$AA6)/1000,),\"------\")","v":"------"},{"$f":"IFERROR(VLOOKUP($D6,table2,25,0),\"\")","v":""},null,{"$f":"IFERROR(ROUNDUP(($H6*$K6*$L6*$AD6)/1000,),\"------\")","v":"------"},{"$f":"IFERROR(VLOOKUP($D6,table2,27,0),\"\")","v":""},{"$f":"IFERROR(VLOOKUP($D6,table2,28,0),\"\")","v":""},{"$f":"IFERROR(VLOOKUP($D6,table2,29,0),\"\")","v":""},{"$f":"IFERROR(VLOOKUP($D6,table2,30,0),\"\")","v":""},{"$f":"IFERROR(VLOOKUP($D6,table2,31,0),\"\")","v":""},{"$f":"IFERROR(VLOOKUP($D6,table2,32,0),\"\")","v":""},{"$f":"IFERROR(VLOOKUP($D6,table2,33,0),\"\")","v":""},{"$f":"IFERROR(VLOOKUP($D6,table2,34,0),\"\")","v":""},{"$f":"IFERROR(VLOOKUP($D6,table2,35,0),\"\")","v":""},{"$f":"IFERROR(VLOOKUP($D6,table2,36,0),\"\")","v":""},{"$f":"IFERROR(VLOOKUP($D6,table2,37,0),\"\")","v":""},{"$f":"IFERROR(VLOOKUP($D6,table2,38,0),\"\")","v":""},{"$f":"IFERROR(VLOOKUP($D6,table2,39,0),\"\")","v":""},{"$f":"IFERROR(VLOOKUP($D6,table2,40,0),\"\")","v":""},{"$f":"IFERROR(VLOOKUP($D6,table2,41,0),\"\")","v":""},{"$f":"IFERROR(VLOOKUP($D6,table2,5,0),\"\")","v":""},{"$f":"IFERROR(VLOOKUP($D6,table2,6,0),\"\")","v":""},{"$f":"IFERROR(VLOOKUP($D6,table2,11,0),\"\")","v":""},{"$f":"IFERROR(VLOOKUP($D6,table2,12,0),\"\")","v":""},{"$f":"IFERROR(VLOOKUP($D6,table2,13,0),\"\")","v":""},null,null,null,null,null,null,null,null,null,null,null,null,null,null,null,null,null,null,{"$f":"IFERROR(VLOOKUP($D6,table2,42,0),\"\")","v":""},null,null,null,null,{"$f":"IFERROR(VLOOKUP(Table4[[#This Row],[رقم امر الشغل]],table5,9,0),\"\")","v":""},{"$f":"IFERROR(VLOOKUP(Table4[[#This Row],[رقم امر الشغل]],table5,10,0),\"\")","v":""},{"$f":"IFERROR((BW6-BX6),\"\")","v":""}]
[{"$f":"IF(D7<>\"\",MAX($A$1:A6)+1,\"\")","v":""},null,null,null,"","",null,"","","","","","","",{"$f":"IFERROR(VLOOKUP($M7,#REF!,2,0),\"\")","v":""},null,"------","","",{"$f":"IFERROR(VLOOKUP($R7,#REF!,2,0),\"\")","v":""},null,"------","",null,"------","",null,"------","",null,"------","","","","","","","","","","","","","","","","","","","","",null,null,null,null,null,null,null,null,null,null,null,null,null,null,null,null,null,null,"",null,null,null,null,{"$f":"IFERROR(VLOOKUP(Table4[[#This Row],[رقم امر الشغل]],table5,9,0),\"\")","v":""},{"$f":"IFERROR(VLOOKUP(Table4[[#This Row],[رقم امر الشغل]],table5,10,0),\"\")","v":""},""]
[{"$f":"IF(D8<>\"\",MAX($A$1:A7)+1,\"\")","v":""},null,null,null,"","",null,"","","","","","","",{"$f":"IFERROR(VLOOKUP($M8,#REF!,2,0),\"\")","v":""},null,"------","","",{"$f":"IFERROR(VLOOKUP($R8,#REF!,2,0),\"\")","v":""},null,"------","",null,"------","",null,"------","",null,"------","","","","","","","","","","","","","","","","","","","","",null,null,null,null,null,null,null,null,null,null,null,null,null,null,null,null,null,null,"",null,null,null,null,{"$f":"IFERROR(VLOOKUP(Table4[[#This Row],[رقم امر الشغل]],table5,9,0),\"\")","v":""},{"$f":"IFERROR(VLOOKUP(Table4[[#This Row],[رقم امر الشغل]],table5,10,0),\"\")","v":""},""]
{"$rows_left_out":320}
{"sheet":"التسليمات","index":1,"n_rows":18,"n_cols":32,"rows_kept":18,"cut":false,"hidden":false,"merged":[]}
[null,null,null,null,null,null,null,null,null,null,null,null,null,null,null,null,null,null,null,null,null,null,null,null,null,null,null,null,null,null,"Data",{"$f":"TODAY()-43830","v":56}]
[]
["مسلسل","الشهر ","التاريخ ","نوع الاذن","رقم الاذن","رقم اذن العميل","رقم امر الشغل","اسم العميل","اسم المصنع","اسم المنتج ","النوع","الكميه ","مرتجع","صافي المبيعات","سعر استرشادي","السعر ","سعر الصرف ","الاجمالي","السيستم ","الفرق","فورم","زنكات","نقل","خصم مسموح به","الاجمالي","الضريبه القيمه المضافه","الاجمالي بعد القيمه المضافه","خصم واضافه","صافي المبيعات ","الاجمالي العام","اجمالي الوحدات"]
[{"$f":"IF(C4<>\"\",MAX($A$1:A3)+1,\"\")","v":1},{"$f":"MONTH(C4)","v":1},"2020-01-05",null,5890,{"$f":"IF($H4=\"انترناشيونال باك\",\"\",0)","v":0},"1909-12-23","سمير ","السعودي","حمص",{"$f":"IFERROR(VLOOKUP($G4,table3,51,0),0)","v":0},1417,null,{"$f":"L4-M4","v":1417},{"$f":"IFERROR(VLOOKUP($G4,table3,67,0),\"\")","v":""},23.5,1,{"$f":"IFERROR((P4*Q4)*N4,\"\")","v":33299.5},33299.5,{"$f":"R4-S4","v":0},null,null,null,null,{"$f":"R4+U4+V4+W4-X4","v":33299.5},{"$f":"(IF($D4=\"ضريبي\",$R4*0.14,0))","v":0},{"$f":"Z4+Y4","v":33299.5},null,{"$f":"AA4-AB4","v":33299.5},{"$f":"IFERROR(AC4,\"\")","v":33299.5},{"$f":"N4","v":1417}]
[{"$f":"IF(C5<>\"\",MAX($A$1:A4)+1,\"\")","v":2},1,"2020-01-06",null,5891,0,2,"سيد ","اليمني","سوداني ",0,1,null,{"$f":"L5-M5","v":1},"",0,1,{"$f":"IFERROR((P5*Q5)*N5,\"\")","v":0},null,{"$f":"R5-S5","v":0},null,null,null,null,{"$f":"R5+U5+V5+W5-X5","v":0},{"$f":"(IF($D5=\"ضريبي\",$R5*0.14,0))","v":0},{"$f":"Z5+Y5","v":0},null,{"$f":"AA5-AB5","v":0},{"$f":"IFERROR(AC5+AD4,\"\")","v":33299.5},{"$f":"AE4+N5","v":1418}]
[{"$f":"IF(C6<>\"\",MAX($A$1:A5)+1,\"\")","v":3},1,"2020-01-07","ضريبي",5892,0,3649,"مسعود","السوداني","لب",0,{"$f":"5250-93","v":5157},75,5082,"",4,1,20328,null,20328,null,null,null,null,20328,2845.92,23173.919999999998,null,{"$f":"AA6-AB6","v":23173.919999999998},{"$f":"IFERROR(AC6+AD5,\"\")","v":56473.42},{"$f":"AE5+N6","v":6500}]
[{"$f":"IF(C7<>\"\",MAX($A$1:A6)+1,\"\")","v":4},1,"2020-01-07",null,5893,0,3655,"سمير ","السعودي","حمص",0,40000,null,40000,"",0.03,1,1200,null,1200,null,null,null,null,1200,0,1200,null,1200,{"$f":"IFERROR(AC7+AD6,\"\")","v":57673.42},46500]
[{"$f":"IF(C8<>\"\",MAX($A$1:A7)+1,\"\")","v":5},1,"2020-01-08",null,5894,0,3650,"سيد ","اليمني","سوداني ",0,99,null,99,1.25,1.35,1,133.65,null,133.65,null,null,null,3.65,130,0,130,null,130,57803.42,46599]
{"$rows_left_out":11}
{"sheet":"كشف حساب عميل","index":2,"n_rows":8,"n_cols":29,"rows_kept":8,"cut":false,"hidden":false,"merged":[[0,4,0,8],[0,1,0,3],[2,4,2,5],[1,4,1,5],[2,6,2,7],[1,6,1,7],[1,1,1,3],[2,1,2,3]]}
["اسم العميل","سمير ",null,null,"نقوم باختيار اسم العميل من هنا "]
["من تاريخ","2020-01-01",null,null,"مدين ",null,"دائن",null,"الرصيد",null,null,null,{"$f":"Sheet1!$B$5:$B$12","v":{"$error":"#VALUE!"}}]
["الي تاريخ","2020-02-15",null,null,{"$f":"SUM(R4:R10000)","v":37789.5},null,{"$f":"SUM(T6:T10000)","v":1200},null,{"$f":"E3-G3","v":36589.5}]
[]
["مسلسل","الشهر ","التاريخ ","نوع الاذن","رقم الاذن","رقم اذن العميل","رقم امر الشغل","اسم العميل","اسم المصنع","اسم المنتج ","النوع","الكميه ","مرتجع","صافي المبيعات","سعر استرشادي","السعر ","سعر الصرف ","الاجمالي","السيستم ","الفرق","فورم","زنكات","نقل","خصم مسموح به","الاجمالي","الضريبه القيمه المضافه","الاجمالي بعد القيمه المضافه","خصم واضافه","صافي المبيعات "]
[{"$f":"IF(C6<>\"\",MAX($A$1:A5)+1,\"\")","v":1},{"$f":"MONTH(C6)","v":1},"2020-01-05",null,5890,{"$f":"IF($H6=\"انترناشيونال باك\",\"\",0)","v":0},"1909-12-23","سمير ","السعودي","حمص",{"$f":"IFERROR(VLOOKUP($G6,table3,51,0),0)","v":0},1417,null,{"$f":"L6-M6","v":1417},{"$f":"IFERROR(VLOOKUP($G6,table3,67,0),\"\")","v":""},23.5,1,{"$f":"IFERROR((P6*Q6)*N6,\"\")","v":33299.5},33299.5,{"$f":"R6-S6","v":0},null,null,null,null,{"$f":"R6+U6+V6+W6-X6","v":33299.5},{"$f":"(IF($D6=\"ضريبي\",$R6*0.14,0))","v":0},{"$f":"Z6+Y6","v":33299.5},null,{"$f":"AA6-AB6","v":33299.5}]
[{"$f":"IF(C7<>\"\",MAX($A$1:A6)+1,\"\")","v":2},1,"2020-01-07",null,5893,0,3655,"سمير ","السعودي","حمص",0,40000,null,{"$f":"L7-M7","v":40000},"",0.03,1,{"$f":"IFERROR((P7*Q7)*N7,\"\")","v":1200},null,{"$f":"R7-S7","v":1200},null,null,null,null,{"$f":"R7+U7+V7+W7-X7","v":1200},{"$f":"(IF($D7=\"ضريبي\",$R7*0.14,0))","v":0},{"$f":"Z7+Y7","v":1200},null,{"$f":"AA7-AB7","v":1200}]
[{"$f":"IF(C8<>\"\",MAX($A$1:A7)+1,\"\")","v":3},2,"2020-02-05",null,5958,4460,3692,"سمير ","السعودي","حمص",0,140,null,140,"",23.5,1,3290,3290,0,null,null,null,null,{"$f":"IFERROR(R8+U8+V8+W8-X8,\"\")","v":3290},0,{"$f":"IFERROR(Z8+Y8,\"\")","v":3290},null,{"$f":"IFERROR(AA8-AB8,\"\")","v":3290}]
{"$rows_left_out":1}
{"sheet":"الطباعه وطبقه حمايه","index":3,"n_rows":239,"n_cols":31,"rows_kept":239,"cut":false,"hidden":false,"merged":[]}
[1,2,3,4,5,6,7,8,9,10,11,12,13,14,15,16,17,18,19,20]
[]
["مسلسل","رقم امر الشغل ","الصنف",null,"التاريخ ","زنكات","اسم العميل ","اسم المصنع","اسم المنتج","عدد الالوان","اسم المورد ","طول","عرض","الكميه","الفرق ","اجمالي الكميه ","عدد الشيتات","الكميه الموردة","الفرق","اجمالي المورد","السعر ","الحد الادني ","الاجمالي ","زنكات ","الخصم","اجمالي ","دفعات ","الاجمالي العام ","اجمالي مرحل ","حساب المورد ","الفرق"]
[{"$f":"IF(I4<>\"\",MAX($A$3:A3)+1,\"\")","v":1},3628,{"$f":"IFERROR(VLOOKUP($K4,#REF!,5,0),\"غير مسجل\")","v":"غير مسجل"},null,"2020-01-01",6,{"$f":"IFERROR(VLOOKUP($B4,table3,5,0),\"غير مسجل\")","v":"غير مسجل"},{"$f":"IFERROR(VLOOKUP($B4,table3,4,0),\"غير مسجل\")","v":"غير مسجل"},{"$f":"IFERROR(VLOOKUP($B4,table3,3,0),\"غير مسجل\")","v":"غير مسجل"},{"$f":"IFERROR(VLOOKUP($B4,table3,32,0),\"غير مسجل\")","v":"غير مسجل"},"وحيد",{"$f":"IFERROR(VLOOKUP($B4,table3,10,0),\"غير مسجل\")","v":"غير مسجل"},{"$f":"IFERROR(VLOOKUP($B4,table3,11,0),\"غير مسجل\")","v":"غير مسجل"},2000,null,{"$f":"N4+O4","v":2000},{"$f":"IFERROR(VLOOKUP($I4,table2,17,0),\"\")","v":""},{"$f":"SUMIFS(التسليمات!$N:$N,التسليمات!$G:$G,B4)","v":0},null,{"$f":"IFERROR(($R4*$Q4)+$S4,\"\")","v":""},{"$f":"IFERROR(VLOOKUP($K4,#REF!,3,0),\"غير مسجل\")","v":"غير مسجل"},{"$f":"IFERROR(VLOOKUP($K4,#REF!,2,0),\"غير مسجل\")","v":"غير مسجل"},{"$f":"IF($C4=\"طباعه \",IF($V4>$P4,$V4*VLOOKUP($K4,#REF!,3,0),$P4*VLOOKUP($K4,#REF!,3,0)),IF($C4=\"يوفي \",($L4*$M4*$P4*10/7)*VLOOKUP($K4,#REF!,3,0),\"غير مسجل\"))","v":"غير مسجل"},{"$f":"IF($C4=\"طباعه \",VLOOKUP(K4,#REF!,4,0)*F4,\"0\")","v":"0"},null,{"$f":"IFERROR(W4+X4-Y4,\"0\")","v":"0"},null,{"$f":"Z4-AA4","v":0},{"$f":"SUMIFS($AB$4:AB4,$K$4:K4,K4)","v":0},null,{"$f":"AB4-AD4","v":0}]
[{"$f":"IF(I5<>\"\",MAX($A$3:A4)+1,\"\")","v":2},3628,{"$f":"IFERROR(VLOOKUP($K5,#REF!,5,0),\"غير مسجل\")","v":"غير مسجل"},null,"2020-01-01",null,"غير مسجل","غير مسجل","غير مسجل","غير مسجل","ابو اليزيد","غير مسجل","غير مسجل",2000,null,{"$f":"N5+O5","v":2000},"",{"$f":"SUMIFS(التسليمات!$N:$N,التسليمات!$G:$G,B5)","v":0},null,"",{"$f":"IFERROR(VLOOKUP($K5,#REF!,3,0),\"غير مسجل\")","v":"غير مسجل"},{"$f":"IFERROR(VLOOKUP($K5,#REF!,2,0),\"غير مسجل\")","v":"غير مسجل"},{"$f":"IF($C5=\"طباعه \",IF($V5>$P5,$V5*VLOOKUP($K5,#REF!,3,0),$P5*VLOOKUP($K5,#REF!,3,0)),IF($C5=\"يوفي \",($L5*$M5*$P5*10/7)*VLOOKUP($K5,#REF!,3,0),\"غير مسجل\"))","v":"غير مسجل"},{"$f":"IF($C5=\"طباعه \",VLOOKUP(K5,#REF!,4,0)*F5,\"0\")","v":"0"},-10,{"$f":"IFERROR(W5+X5-Y5,\"0\")","v":"0"},null,{"$f":"Z5-AA5","v":0},{"$f":"SUMIFS($AB$4:AB5,$K$4:K5,K5)","v":0},null,{"$f":"AB5-AD5","v":0}]
[{"$f":"IF(I6<>\"\",MAX($A$3:A5)+1,\"\")","v":3},3666,{"$f":"IFERROR(VLOOKUP($K6,#REF!,5,0),\"غير مسجل\")","v":"غير مسجل"},null,"2020-01-01",6,"غير مسجل","غير مسجل","غير مسجل","غير مسجل","وحيد","غير مسجل","غير مسجل",2000,null,2000,"",{"$f":"SUMIFS(التسليمات!$N:$N,التسليمات!$G:$G,B6)","v":0},null,"",{"$f":"IFERROR(VLOOKUP($K6,#REF!,3,0),\"غير مسجل\")","v":"غير مسجل"},{"$f":"IFERROR(VLOOKUP($K6,#REF!,2,0),\"غير مسجل\")","v":"غير مسجل"},{"$f":"IF($C6=\"طباعه \",IF($V6>$P6,$V6*VLOOKUP($K6,#REF!,3,0),$P6*VLOOKUP($K6,#REF!,3,0)),IF($C6=\"يوفي \",($L6*$M6*$P6*10/7)*VLOOKUP($K6,#REF!,3,0),\"غير مسجل\"))","v":"غير مسجل"},{"$f":"IF($C6=\"طباعه \",VLOOKUP(K6,#REF!,4,0)*F6,\"0\")","v":"0"},null,"0",null,{"$f":"Z6-AA6","v":0},{"$f":"SUMIFS($AB$4:AB6,$K$4:K6,K6)","v":0},null,0]
[{"$f":"IF(I7<>\"\",MAX($A$3:A6)+1,\"\")","v":4},3666,{"$f":"IFERROR(VLOOKUP($K7,#REF!,5,0),\"غير مسجل\")","v":"غير مسجل"},null,"2020-01-01",null,"غير مسجل","غير مسجل","غير مسجل","غير مسجل","ابو اليزيد","غير مسجل","غير مسجل",2150,null,2150,"",{"$f":"SUMIFS(التسليمات!$N:$N,التسليمات!$G:$G,B7)","v":0},null,"",{"$f":"IFERROR(VLOOKUP($K7,#REF!,3,0),\"غير مسجل\")","v":"غير مسجل"},{"$f":"IFERROR(VLOOKUP($K7,#REF!,2,0),\"غير مسجل\")","v":"غير مسجل"},{"$f":"IF($C7=\"طباعه \",IF($V7>$P7,$V7*VLOOKUP($K7,#REF!,3,0),$P7*VLOOKUP($K7,#REF!,3,0)),IF($C7=\"يوفي \",($L7*$M7*$P7*10/7)*VLOOKUP($K7,#REF!,3,0),\"غير مسجل\"))","v":"غير مسجل"},{"$f":"IF($C7=\"طباعه \",VLOOKUP(K7,#REF!,4,0)*F7,\"0\")","v":"0"},null,"0",null,0,{"$f":"SUMIFS($AB$4:AB7,$K$4:K7,K7)","v":0},null,0]
[{"$f":"IF(I8<>\"\",MAX($A$3:A7)+1,\"\")","v":5},3682,{"$f":"IFERROR(VLOOKUP($K8,#REF!,5,0),\"غير مسجل\")","v":"غير مسجل"},null,"2020-01-01",6,"غير مسجل","غير مسجل","غير مسجل","غير مسجل","وحيد","غير مسجل","غير مسجل",1500,null,1500,"",{"$f":"SUMIFS(التسليمات!$N:$N,التسليمات!$G:$G,B8)","v":0},null,"",{"$f":"IFERROR(VLOOKUP($K8,#REF!,3,0),\"غير مسجل\")","v":"غير مسجل"},{"$f":"IFERROR(VLOOKUP($K8,#REF!,2,0),\"غير مسجل\")","v":"غير مسجل"},{"$f":"IF($C8=\"طباعه \",IF($V8>$P8,$V8*VLOOKUP($K8,#REF!,3,0),$P8*VLOOKUP($K8,#REF!,3,0)),IF($C8=\"يوفي \",($L8*$M8*$P8*10/7)*VLOOKUP($K8,#REF!,3,0),\"غير مسجل\"))","v":"غير مسجل"},{"$f":"IF($C8=\"طباعه \",VLOOKUP(K8,#REF!,4,0)*F8,\"0\")","v":"0"},null,"0",null,0,{"$f":"SUMIFS($AB$4:AB8,$K$4:K8,K8)","v":0},null,0]
{"$rows_left_out":232}
{"sheet":"تقرير الطباعه","index":4,"n_rows":24,"n_cols":29,"rows_kept":24,"cut":false,"hidden":false,"merged":[[0,4,0,8],[1,4,1,5],[1,6,1,7],[2,4,2,5],[2,6,2,7]]}
["اسم العميل","وحيد",null,null,"نقوم باختيار اسم العميل من هنا "]
["من تاريخ","2020-01-01",null,null,"مدين ",null,"دائن",null,"الرصيد"]
["الي تاريخ","2020-02-02",null,null,{"$f":"SUM(R4:R10000)","v":0},null,{"$f":"SUM(T6:T10000)","v":0},null,{"$f":"E3-G3","v":0},null,null,{"$f":"Sheet1!$F$15:$F$19","v":{"$error":"#VALUE!"}}]
[]
["مسلسل","رقم امر الشغل ","الصنف",null,"التاريخ ","زنكات","اسم العميل ","اسم المصنع","اسم المنتج","عدد الالوان","اسم المورد ","طول","عرض","الكميه","الفرق ","اجمالي الكميه ","عدد الشيتات","الكميه الموردة","الفرق","اجمالي المورد","السعر ","الحد الادني ","الاجمالي ","زنكات ","الخصم","اجمالي ","دفعات ","الاجمالي العام ","اجمالي مرحل "]
[{"$f":"IF(I6<>\"\",MAX($A$3:A5)+1,\"\")","v":1},3628,{"$f":"IFERROR(VLOOKUP($K6,#REF!,5,0),\"غير مسجل\")","v":"غير مسجل"},null,"2020-01-01",6,{"$f":"IFERROR(VLOOKUP($B6,table3,5,0),\"غير مسجل\")","v":"غير مسجل"},{"$f":"IFERROR(VLOOKUP($B6,table3,4,0),\"غير مسجل\")","v":"غير مسجل"},{"$f":"IFERROR(VLOOKUP($B6,table3,3,0),\"غير مسجل\")","v":"غير مسجل"},{"$f":"IFERROR(VLOOKUP($B6,table3,32,0),\"غير مسجل\")","v":"غير مسجل"},"وحيد",{"$f":"IFERROR(VLOOKUP($B6,table3,10,0),\"غير مسجل\")","v":"غير مسجل"},{"$f":"IFERROR(VLOOKUP($B6,table3,11,0),\"غير مسجل\")","v":"غير مسجل"},2000,null,{"$f":"N6+O6","v":2000},{"$f":"IFERROR(VLOOKUP($I6,table2,17,0),\"\")","v":""},{"$f":"SUMIFS(التسليمات!$N:$N,التسليمات!$G:$G,B6)","v":0},null,{"$f":"IFERROR(($R6*$Q6)+$S6,\"\")","v":""},{"$f":"IFERROR(VLOOKUP($K6,#REF!,3,0),\"غير مسجل\")","v":"غير مسجل"},{"$f":"IFERROR(VLOOKUP($K6,#REF!,2,0),\"غير مسجل\")","v":"غير مسجل"},{"$f":"IF($C6=\"طباعه \",IF($V6>$P6,$V6*VLOOKUP($K6,#REF!,3,0),$P6*VLOOKUP($K6,#REF!,3,0)),IF($C6=\"يوفي \",($L6*$M6*$P6*10/7)*VLOOKUP($K6,#REF!,3,0),\"غير مسجل\"))","v":"غير مسجل"},{"$f":"IF($C6=\"طباعه \",VLOOKUP(K6,#REF!,4,0)*F6,\"0\")","v":"0"},null,{"$f":"IFERROR(W6+X6-Y6,\"0\")","v":"0"},null,{"$f":"Z6-AA6","v":0},{"$f":"SUMIFS($AB$4:AB6,$K$4:K6,K6)","v":0}]
[{"$f":"IF(I7<>\"\",MAX($A$3:A6)+1,\"\")","v":2},3666,{"$f":"IFERROR(VLOOKUP($K7,#REF!,5,0),\"غير مسجل\")","v":"غير مسجل"},null,"2020-01-01",6,"غير مسجل","غير مسجل","غير مسجل","غير مسجل","وحيد","غير مسجل","غير مسجل",2000,null,{"$f":"N7+O7","v":2000},"",{"$f":"SUMIFS(التسليمات!$N:$N,التسليمات!$G:$G,B7)","v":0},null,"",{"$f":"IFERROR(VLOOKUP($K7,#REF!,3,0),\"غير مسجل\")","v":"غير مسجل"},{"$f":"IFERROR(VLOOKUP($K7,#REF!,2,0),\"غير مسجل\")","v":"غير مسجل"},{"$f":"IF($C7=\"طباعه \",IF($V7>$P7,$V7*VLOOKUP($K7,#REF!,3,0),$P7*VLOOKUP($K7,#REF!,3,0)),IF($C7=\"يوفي \",($L7*$M7*$P7*10/7)*VLOOKUP($K7,#REF!,3,0),\"غير مسجل\"))","v":"غير مسجل"},{"$f":"IF($C7=\"طباعه \",VLOOKUP(K7,#REF!,4,0)*F7,\"0\")","v":"0"},null,{"$f":"IFERROR(W7+X7-Y7,\"0\")","v":"0"},null,{"$f":"Z7-AA7","v":0},{"$f":"SUMIFS($AB$4:AB7,$K$4:K7,K7)","v":0}]
[{"$f":"IF(I8<>\"\",MAX($A$3:A7)+1,\"\")","v":3},3682,{"$f":"IFERROR(VLOOKUP($K8,#REF!,5,0),\"غير مسجل\")","v":"غير مسجل"},null,"2020-01-01",6,"غير مسجل","غير مسجل","غير مسجل","غير مسجل","وحيد","غير مسجل","غير مسجل",1500,null,1500,"",{"$f":"SUMIFS(التسليمات!$N:$N,التسليمات!$G:$G,B8)","v":0},null,"",{"$f":"IFERROR(VLOOKUP($K8,#REF!,3,0),\"غير مسجل\")","v":"غير مسجل"},{"$f":"IFERROR(VLOOKUP($K8,#REF!,2,0),\"غير مسجل\")","v":"غير مسجل"},{"$f":"IF($C8=\"طباعه \",IF($V8>$P8,$V8*VLOOKUP($K8,#REF!,3,0),$P8*VLOOKUP($K8,#REF!,3,0)),IF($C8=\"يوفي \",($L8*$M8*$P8*10/7)*VLOOKUP($K8,#REF!,3,0),\"غير مسجل\"))","v":"غير مسجل"},{"$f":"IF($C8=\"طباعه \",VLOOKUP(K8,#REF!,4,0)*F8,\"0\")","v":"0"},null,"0",null,{"$f":"Z8-AA8","v":0},{"$f":"SUMIFS($AB$4:AB8,$K$4:K8,K8)","v":0}]
{"$rows_left_out":17}
{"sheet":"Sheet1","index":5,"n_rows":19,"n_cols":6,"rows_kept":19,"cut":false,"hidden":false,"merged":[]}
[]
[]
[]
[null,"اسماء العملاء"]
[null,"سمير "]
[null,"سيد "]
[null,"مسعود"]
[]
{"$rows_left_out":11}