{"text_format":"1","workbook":"xlsx","n_sheets":3,"sheets":["Data","المطلوب","Sheet3"],"not_rendered":{"charts":0,"images":0,"macros":1,"external_links":0,"defined_names":0,"comments":0,"pivot_tables":0},"unopened":[],"bounds":{"document_bytes":16777216,"sheet_cells":100000,"rows_first":2000,"rows_last":500,"rows_between":2000,"halvings":0,"cell_chars":16384,"cell_head_chars":4096},"cells_cut":0,"cells_raw":0,"read":"whole","date_system":"1900"}

{"sheet":"Data","index":0,"n_rows":12,"n_cols":19,"rows_kept":12,"cut":false,"hidden":false,"merged":[]}
["NO.","FP","المجموعة","ID No.","Full Name","Nick Name","Dept.","الراحة","Mobile","Medical Certificate","Date Of Work","    ","تاريخ الميلاد","النوع","Age","Government","الرقم التأمينى","Mo Name","الوقت"]
[1,27,"B",26801240200831,"جمال","جمال باريستا","باريستا","Mon",null,"ايصال 30-12-2019","2006-07-12",null,"1968-01-24","ذكر","52 سنة","الإسكندرية",null,null,"AM"]
[2,678,"B",29605040201872,"يوسف","يوسف محمد","كاشير","Tue",null,"2020-03-09","2019-09-08",null,"1996-05-04","ذكر","23 سنة","الإسكندرية",75545370,null,"AM"]
[3,null,"B",32408840202913,"سيد","A1","شيف","Wed",null,null,null,null,null,null,null,null,null,null,"PM"]
[4,null,"B",35212640203954,"عمرو","B1","كاشير","Thu",null,null,null,null,null,null,null,null,null,null,"PM"]
[5,null,"B",38016440204995,"احمد","C1","باريستا","Mon",null,null,null,null,null,null,null,null,null,null,"AM"]
[6,null,"A",40820240206036,"عمرو نبيل","D1","شيف","Sat",null,null,null,null,null,null,null,null,null,null,"AM"]
[]
[]
[null,null,null,null,null,"الوقت","الوظيفة","المجموعة","الراحة"]
[null,null,null,null,null,"AM","باريستا","B","Mon"]
[null,null,null,null,null,"s","G","C","H"]

{"sheet":"المطلوب","index":1,"n_rows":22,"n_cols":11,"rows_kept":22,"cut":false,"hidden":false,"merged":[]}
["الوقت","الوظيفة","المجموعة","الراحة"]
["am","باريستا","B","Mon",null,{"$f":"IFERROR(INDEX(Data!$F$2:$F$100,SMALL(IF(Data!$F$2:$F$100<>\"\",IF(Data!$S$2:$S$100=$A$2,IF(Data!$G$2:$G$100=$B$2,IF(Data!$C$2:$C$100=$C$2,IF(Data!$H$2:$H$100=$D$2,ROW(Data!$G$2:$G$100)-ROW($G$2)+1))))),ROWS($A$1:A1))),\"\")","v":"جمال باريستا"},null,"جمال",null,null,"جمال باريستا"]
[null,null,null,null,null,{"$f":"IFERROR(INDEX(Data!$F$2:$F$100,SMALL(IF(Data!$F$2:$F$100<>\"\",IF(Data!$S$2:$S$100=$A$2,IF(Data!$G$2:$G$100=$B$2,IF(Data!$C$2:$C$100=$C$2,IF(Data!$H$2:$H$100=$D$2,ROW(Data!$G$2:$G$100)-ROW($G$2)+1))))),ROWS($A$1:A2))),\"\")","v":"C1"},null,"احمد",null,null,"C1"]
[null,null,null,null,null,{"$f":"IFERROR(INDEX(Data!$F$2:$F$100,SMALL(IF(Data!$F$2:$F$100<>\"\",IF(Data!$S$2:$S$100=$A$2,IF(Data!$G$2:$G$100=$B$2,IF(Data!$C$2:$C$100=$C$2,IF(Data!$H$2:$H$100=$D$2,ROW(Data!$G$2:$G$100)-ROW($G$2)+1))))),ROWS($A$1:A3))),\"\")","v":""},null,null,{"$f":"IFERROR(INDEX(Data!$G$2:$G$100,SMALL(IF(Data!$G$2:$G$100<>\"\",IF(Data!$S$2:$S$100=$A$2,IF(Data!$G$2:$G$100=$B$2,IF(Data!$C$2:$C$100=$C$2,IF(Data!$H$2:$H$100=$D$2,ROW(Data!$G$2:$G$100)-ROW($G$2)+1))))),ROWS($A$1:A3))),\"\")","v":""}]
[null,null,null,null,null,{"$f":"IFERROR(INDEX(Data!$F$2:$F$100,SMALL(IF(Data!$F$2:$F$100<>\"\",IF(Data!$S$2:$S$100=$A$2,IF(Data!$G$2:$G$100=$B$2,IF(Data!$C$2:$C$100=$C$2,IF(Data!$H$2:$H$100=$D$2,ROW(Data!$G$2:$G$100)-ROW($G$2)+1))))),ROWS($A$1:A4))),\"\")","v":""},null,null,{"$f":"IFERROR(INDEX(Data!$G$2:$G$100,SMALL(IF(Data!$G$2:$G$100<>\"\",IF(Data!$S$2:$S$100=$A$2,IF(Data!$G$2:$G$100=$B$2,IF(Data!$C$2:$C$100=$C$2,IF(Data!$H$2:$H$100=$D$2,ROW(Data!$G$2:$G$100)-ROW($G$2)+1))))),ROWS($A$1:A4))),\"\")","v":""}]
[null,null,null,null,null,{"$f":"IFERROR(INDEX(Data!$F$2:$F$100,SMALL(IF(Data!$F$2:$F$100<>\"\",IF(Data!$S$2:$S$100=$A$2,IF(Data!$G$2:$G$100=$B$2,IF(Data!$C$2:$C$100=$C$2,IF(Data!$H$2:$H$100=$D$2,ROW(Data!$G$2:$G$100)-ROW($G$2)+1))))),ROWS($A$1:A5))),\"\")","v":""},null,null,{"$f":"IFERROR(INDEX(Data!$G$2:$G$100,SMALL(IF(Data!$G$2:$G$100<>\"\",IF(Data!$S$2:$S$100=$A$2,IF(Data!$G$2:$G$100=$B$2,IF(Data!$C$2:$C$100=$C$2,IF(Data!$H$2:$H$100=$D$2,ROW(Data!$G$2:$G$100)-ROW($G$2)+1))))),ROWS($A$1:A5))),\"\")","v":""}]
[null,null,null,null,null,{"$f":"IFERROR(INDEX(Data!$F$2:$F$100,SMALL(IF(Data!$F$2:$F$100<>\"\",IF(Data!$S$2:$S$100=$A$2,IF(Data!$G$2:$G$100=$B$2,IF(Data!$C$2:$C$100=$C$2,IF(Data!$H$2:$H$100=$D$2,ROW(Data!$G$2:$G$100)-ROW($G$2)+1))))),ROWS($A$1:A6))),\"\")","v":""}]
[null,null,null,null,null,{"$f":"IFERROR(INDEX(Data!$F$2:$F$100,SMALL(IF(Data!$F$2:$F$100<>\"\",IF(Data!$S$2:$S$100=$A$2,IF(Data!$G$2:$G$100=$B$2,IF(Data!$C$2:$C$100=$C$2,IF(Data!$H$2:$H$100=$D$2,ROW(Data!$G$2:$G$100)-ROW($G$2)+1))))),ROWS($A$1:A7))),\"\")","v":""}]
[null,null,null,null,null,{"$f":"IFERROR(INDEX(Data!$F$2:$F$100,SMALL(IF(Data!$F$2:$F$100<>\"\",IF(Data!$S$2:$S$100=$A$2,IF(Data!$G$2:$G$100=$B$2,IF(Data!$C$2:$C$100=$C$2,IF(Data!$H$2:$H$100=$D$2,ROW(Data!$G$2:$G$100)-ROW($G$2)+1))))),ROWS($A$1:A8))),\"\")","v":""}]
[null,null,null,null,null,{"$f":"IFERROR(INDEX(Data!$F$2:$F$100,SMALL(IF(Data!$F$2:$F$100<>\"\",IF(Data!$S$2:$S$100=$A$2,IF(Data!$G$2:$G$100=$B$2,IF(Data!$C$2:$C$100=$C$2,IF(Data!$H$2:$H$100=$D$2,ROW(Data!$G$2:$G$100)-ROW($G$2)+1))))),ROWS($A$1:A9))),\"\")","v":""}]
[null,null,null,null,null,{"$f":"IFERROR(INDEX(Data!$F$2:$F$100,SMALL(IF(Data!$F$2:$F$100<>\"\",IF(Data!$S$2:$S$100=$A$2,IF(Data!$G$2:$G$100=$B$2,IF(Data!$C$2:$C$100=$C$2,IF(Data!$H$2:$H$100=$D$2,ROW(Data!$G$2:$G$100)-ROW($G$2)+1))))),ROWS($A$1:A10))),\"\")","v":""}]
[null,null,null,null,null,{"$f":"IFERROR(INDEX(Data!$F$2:$F$100,SMALL(IF(Data!$F$2:$F$100<>\"\",IF(Data!$S$2:$S$100=$A$2,IF(Data!$G$2:$G$100=$B$2,IF(Data!$C$2:$C$100=$C$2,IF(Data!$H$2:$H$100=$D$2,ROW(Data!$G$2:$G$100)-ROW($G$2)+1))))),ROWS($A$1:A11))),\"\")","v":""}]
[null,null,null,null,null,{"$f":"IFERROR(INDEX(Data!$F$2:$F$100,SMALL(IF(Data!$F$2:$F$100<>\"\",IF(Data!$S$2:$S$100=$A$2,IF(Data!$G$2:$G$100=$B$2,IF(Data!$C$2:$C$100=$C$2,IF(Data!$H$2:$H$100=$D$2,ROW(Data!$G$2:$G$100)-ROW($G$2)+1))))),ROWS($A$1:A12))),\"\")","v":""}]
[null,null,null,null,null,{"$f":"IFERROR(INDEX(Data!$F$2:$F$100,SMALL(IF(Data!$F$2:$F$100<>\"\",IF(Data!$S$2:$S$100=$A$2,IF(Data!$G$2:$G$100=$B$2,IF(Data!$C$2:$C$100=$C$2,IF(Data!$H$2:$H$100=$D$2,ROW(Data!$G$2:$G$100)-ROW($G$2)+1))))),ROWS($A$1:A13))),\"\")","v":""}]
[null,null,null,null,null,{"$f":"IFERROR(INDEX(Data!$F$2:$F$100,SMALL(IF(Data!$F$2:$F$100<>\"\",IF(Data!$S$2:$S$100=$A$2,IF(Data!$G$2:$G$100=$B$2,IF(Data!$C$2:$C$100=$C$2,IF(Data!$H$2:$H$100=$D$2,ROW(Data!$G$2:$G$100)-ROW($G$2)+1))))),ROWS($A$1:A14))),\"\")","v":""}]
[null,null,null,null,null,{"$f":"IFERROR(INDEX(Data!$F$2:$F$100,SMALL(IF(Data!$F$2:$F$100<>\"\",IF(Data!$S$2:$S$100=$A$2,IF(Data!$G$2:$G$100=$B$2,IF(Data!$C$2:$C$100=$C$2,IF(Data!$H$2:$H$100=$D$2,ROW(Data!$G$2:$G$100)-ROW($G$2)+1))))),ROWS($A$1:A15))),\"\")","v":""}]
[null,null,null,null,null,{"$f":"IFERROR(INDEX(Data!$F$2:$F$100,SMALL(IF(Data!$F$2:$F$100<>\"\",IF(Data!$S$2:$S$100=$A$2,IF(Data!$G$2:$G$100=$B$2,IF(Data!$C$2:$C$100=$C$2,IF(Data!$H$2:$H$100=$D$2,ROW(Data!$G$2:$G$100)-ROW($G$2)+1))))),ROWS($A$1:A16))),\"\")","v":""}]
[null,null,null,null,null,{"$f":"IFERROR(INDEX(Data!$F$2:$F$100,SMALL(IF(Data!$F$2:$F$100<>\"\",IF(Data!$S$2:$S$100=$A$2,IF(Data!$G$2:$G$100=$B$2,IF(Data!$C$2:$C$100=$C$2,IF(Data!$H$2:$H$100=$D$2,ROW(Data!$G$2:$G$100)-ROW($G$2)+1))))),ROWS($A$1:A17))),\"\")","v":""}]
[null,null,null,null,null,{"$f":"IFERROR(INDEX(Data!$F$2:$F$100,SMALL(IF(Data!$F$2:$F$100<>\"\",IF(Data!$S$2:$S$100=$A$2,IF(Data!$G$2:$G$100=$B$2,IF(Data!$C$2:$C$100=$C$2,IF(Data!$H$2:$H$100=$D$2,ROW(Data!$G$2:$G$100)-ROW($G$2)+1))))),ROWS($A$1:A18))),\"\")","v":""}]
[null,null,null,null,null,{"$f":"IFERROR(INDEX(Data!$F$2:$F$100,SMALL(IF(Data!$F$2:$F$100<>\"\",IF(Data!$S$2:$S$100=$A$2,IF(Data!$G$2:$G$100=$B$2,IF(Data!$C$2:$C$100=$C$2,IF(Data!$H$2:$H$100=$D$2,ROW(Data!$G$2:$G$100)-ROW($G$2)+1))))),ROWS($A$1:A19))),\"\")","v":""}]
[null,null,null,null,null,{"$f":"IFERROR(INDEX(Data!$F$2:$F$100,SMALL(IF(Data!$F$2:$F$100<>\"\",IF(Data!$S$2:$S$100=$A$2,IF(Data!$G$2:$G$100=$B$2,IF(Data!$C$2:$C$100=$C$2,IF(Data!$H$2:$H$100=$D$2,ROW(Data!$G$2:$G$100)-ROW($G$2)+1))))),ROWS($A$1:A20))),\"\")","v":""}]
[null,null,null,null,null,{"$f":"IFERROR(INDEX(Data!$F$2:$F$100,SMALL(IF(Data!$F$2:$F$100<>\"\",IF(Data!$S$2:$S$100=$A$2,IF(Data!$G$2:$G$100=$B$2,IF(Data!$C$2:$C$100=$C$2,IF(Data!$H$2:$H$100=$D$2,ROW(Data!$G$2:$G$100)-ROW($G$2)+1))))),ROWS($A$1:A21))),\"\")","v":""}]

{"sheet":"Sheet3","index":2,"n_rows":0,"n_cols":0,"rows_kept":0,"cut":false,"hidden":false,"merged":[]}