{"text_format":"1","workbook":"xlsx","n_sheets":3,"sheets":["Sheet1","Sheet2","Sheet3"],"not_rendered":{"charts":0,"images":0,"macros":1,"external_links":0,"defined_names":0,"comments":0,"pivot_tables":0},"unopened":[],"bounds":{"document_bytes":16777216,"sheet_cells":100000,"rows_first":2000,"rows_last":500,"rows_between":2000,"halvings":0,"cell_chars":16384,"cell_head_chars":4096},"cells_cut":0,"cells_raw":0,"read":"whole","date_system":"1900"}

{"sheet":"Sheet1","index":0,"n_rows":47,"n_cols":7,"rows_kept":47,"cut":false,"hidden":false,"merged":[]}
[]
[]
[]
[null,null,null,null,"معادلة 1","معادلة 2"]
["Column 1","Column 2","Column 3","Column 4","Column 5","Column 6","Remark"]
["A1","B1",null,2,{"$f":"SUMIFS(Sheet2!$G$5:$G$4999,Sheet2!$B$5:$B$4999,B6,Sheet2!$A$5:$A$4999,A6)","v":19},{"$f":"+E6-D6","v":17}]
["A1","B1",null,3,19,16]
["A1","B1",null,68,19,{"$f":"+E8-D8","v":-49}]
["A1","B1",null,59,19,-40]
["A1","B1",null,456,{"$f":"SUMIFS(Sheet2!$G$5:$G$4999,Sheet2!$B$5:$B$4999,B10,Sheet2!$A$5:$A$4999,A10)","v":19},-437]
["A1","B1",null,120,19,-101]
["A1","B1",null,1346,{"$f":"SUMIFS(Sheet2!$G$5:$G$4999,Sheet2!$B$5:$B$4999,B12,Sheet2!$A$5:$A$4999,A12)","v":19},-1327]
["A1","B1",null,2,19,17]
["A1","B1",null,3,{"$f":"SUMIFS(Sheet2!$G$5:$G$4999,Sheet2!$B$5:$B$4999,B14,Sheet2!$A$5:$A$4999,A14)","v":19},16]
["A1","B1",null,68,19,-49]
["A1","V2",null,59,{"$f":"SUMIFS(Sheet2!$G$5:$G$4999,Sheet2!$B$5:$B$4999,B16,Sheet2!$A$5:$A$4999,A16)","v":1},-58]
["A1","B1",null,456,{"$f":"SUMIFS(Sheet2!$G$5:$G$4999,Sheet2!$B$5:$B$4999,B17,Sheet2!$A$5:$A$4999,A17)","v":19},-437]
["A1","B1",null,2,19,17]
["A1","B1",null,3,{"$f":"SUMIFS(Sheet2!$G$5:$G$4999,Sheet2!$B$5:$B$4999,B19,Sheet2!$A$5:$A$4999,A19)","v":19},16]
["A1","B1",null,68,{"$f":"SUMIFS(Sheet2!$G$5:$G$4999,Sheet2!$B$5:$B$4999,B20,Sheet2!$A$5:$A$4999,A20)","v":19},-49]
["A1","B1",null,59,{"$f":"SUMIFS(Sheet2!$G$5:$G$4999,Sheet2!$B$5:$B$4999,B21,Sheet2!$A$5:$A$4999,A21)","v":19},-40]
["A1","B1",null,456,{"$f":"SUMIFS(Sheet2!$G$5:$G$4999,Sheet2!$B$5:$B$4999,B22,Sheet2!$A$5:$A$4999,A22)","v":19},-437]
["A1","B1",null,2,{"$f":"SUMIFS(Sheet2!$G$5:$G$4999,Sheet2!$B$5:$B$4999,B23,Sheet2!$A$5:$A$4999,A23)","v":19},17]
["A1","B1",null,3,{"$f":"SUMIFS(Sheet2!$G$5:$G$4999,Sheet2!$B$5:$B$4999,B24,Sheet2!$A$5:$A$4999,A24)","v":19},16]
["A1","B1",null,68,{"$f":"SUMIFS(Sheet2!$G$5:$G$4999,Sheet2!$B$5:$B$4999,B25,Sheet2!$A$5:$A$4999,A25)","v":19},-49]
["A1","B1",null,59,{"$f":"SUMIFS(Sheet2!$G$5:$G$4999,Sheet2!$B$5:$B$4999,B26,Sheet2!$A$5:$A$4999,A26)","v":19},-40]
["A1","B1",null,456,19,-40]
["A1","B1",null,2,19,17]
["A1","B1",null,3,{"$f":"SUMIFS(Sheet2!$G$5:$G$4999,Sheet2!$B$5:$B$4999,B29,Sheet2!$A$5:$A$4999,A29)","v":19},16]
["A1","B1",null,68,19,-49]
["A1","B1",null,59,{"$f":"SUMIFS(Sheet2!$G$5:$G$4999,Sheet2!$B$5:$B$4999,B31,Sheet2!$A$5:$A$4999,A31)","v":19},-40]
["A1","B1",null,456,{"$f":"SUMIFS(Sheet2!$G$5:$G$4999,Sheet2!$B$5:$B$4999,B32,Sheet2!$A$5:$A$4999,A32)","v":19},-437]
["A1","B1",null,2,{"$f":"SUMIFS(Sheet2!$G$5:$G$4999,Sheet2!$B$5:$B$4999,B33,Sheet2!$A$5:$A$4999,A33)","v":19},17]
["A1","B1",null,3,{"$f":"SUMIFS(Sheet2!$G$5:$G$4999,Sheet2!$B$5:$B$4999,B34,Sheet2!$A$5:$A$4999,A34)","v":19},16]
["A1","B1",null,68,{"$f":"SUMIFS(Sheet2!$G$5:$G$4999,Sheet2!$B$5:$B$4999,B35,Sheet2!$A$5:$A$4999,A35)","v":19},-49]
["A1","B1",null,59,{"$f":"SUMIFS(Sheet2!$G$5:$G$4999,Sheet2!$B$5:$B$4999,B36,Sheet2!$A$5:$A$4999,A36)","v":19},-40]
["A2","B2",null,456,{"$f":"SUMIFS(Sheet2!$G$5:$G$4999,Sheet2!$B$5:$B$4999,B37,Sheet2!$A$5:$A$4999,A37)","v":17},-439]
["A2","B2",null,2,{"$f":"SUMIFS(Sheet2!$G$5:$G$4999,Sheet2!$B$5:$B$4999,B38,Sheet2!$A$5:$A$4999,A38)","v":17},15]
["A2","B2",null,3,{"$f":"SUMIFS(Sheet2!$G$5:$G$4999,Sheet2!$B$5:$B$4999,B39,Sheet2!$A$5:$A$4999,A39)","v":17},14]
["A2","B2",null,68,{"$f":"SUMIFS(Sheet2!$G$5:$G$4999,Sheet2!$B$5:$B$4999,B40,Sheet2!$A$5:$A$4999,A40)","v":17},-51]
["A2","B2",null,59,{"$f":"SUMIFS(Sheet2!$G$5:$G$4999,Sheet2!$B$5:$B$4999,B41,Sheet2!$A$5:$A$4999,A41)","v":17},-42]
["A2","B2",null,456,{"$f":"SUMIFS(Sheet2!$G$5:$G$4999,Sheet2!$B$5:$B$4999,B42,Sheet2!$A$5:$A$4999,A42)","v":17},-439]
[null,null,null,457,0,-439]
[null,null,null,458,0,-439]
[null,null,null,459,0,-439]
[null,null,null,460,{"$f":"SUMIFS(Sheet2!$G$5:$G$4999,Sheet2!$B$5:$B$4999,B46,Sheet2!$A$5:$A$4999,A46)","v":0},-439]
[null,null,null,461,0,-439]

{"sheet":"Sheet2","index":1,"n_rows":502,"n_cols":10,"rows_kept":502,"cut":false,"hidden":false,"merged":[]}
[]
[]
[]
[]
[null,null,null,null,null,"معادلة 3","معادلة 4"]
["Column 1","Column 2","Column 3","Column 4","Column 5","Column 6","Column 7","Column 8","Column 9","Remark"]
["A1","B1",null,null,3,3,1]
["A2","B2",null,null,2,{"$f":"IF(E8=0,\"\",VLOOKUP(E8,Sheet3!$A$3:$A$10000,1,0))","v":2},{"$f":"IFERROR(VLOOKUP(F8,Sheet3!$A$3:$C$10000,3,0),0)","v":1}]
["A1","B1",null,null,5,5,1]
["A2","B2",null,null,4,{"$f":"IF(E10=0,\"\",VLOOKUP(E10,Sheet3!$A$3:$A$10000,1,0))","v":4},{"$f":"IFERROR(VLOOKUP(F10,Sheet3!$A$3:$C$10000,3,0),0)","v":1}]
["A1","B1",null,null,6,{"$f":"IF(E11=0,\"\",VLOOKUP(E11,Sheet3!$A$3:$A$10000,1,0))","v":6},{"$f":"IFERROR(VLOOKUP(F11,Sheet3!$A$3:$C$10000,3,0),0)","v":1}]
["A2","B2",null,null,7,{"$f":"IF(E12=0,\"\",VLOOKUP(E12,Sheet3!$A$3:$A$10000,1,0))","v":7},{"$f":"IFERROR(VLOOKUP(F12,Sheet3!$A$3:$C$10000,3,0),0)","v":1}]
["A1","B1",null,null,8,8,{"$f":"IFERROR(VLOOKUP(F13,Sheet3!$A$3:$C$10000,3,0),0)","v":1}]
["A2","B2",null,null,9,{"$f":"IF(E14=0,\"\",VLOOKUP(E14,Sheet3!$A$3:$A$10000,1,0))","v":9},{"$f":"IFERROR(VLOOKUP(F14,Sheet3!$A$3:$C$10000,3,0),0)","v":1}]
["A1","B1",null,null,2,{"$f":"IF(E15=0,\"\",VLOOKUP(E15,Sheet3!$A$3:$A$10000,1,0))","v":2},{"$f":"IFERROR(VLOOKUP(F15,Sheet3!$A$3:$C$10000,3,0),0)","v":1}]
["A2","B2",null,null,5,{"$f":"IF(E16=0,\"\",VLOOKUP(E16,Sheet3!$A$3:$A$10000,1,0))","v":5},{"$f":"IFERROR(VLOOKUP(F16,Sheet3!$A$3:$C$10000,3,0),0)","v":1}]
["A1","B1",null,null,6,{"$f":"IF(E17=0,\"\",VLOOKUP(E17,Sheet3!$A$3:$A$10000,1,0))","v":6},{"$f":"IFERROR(VLOOKUP(F17,Sheet3!$A$3:$C$10000,3,0),0)","v":1}]
["A2","B2",null,null,3,{"$f":"IF(E18=0,\"\",VLOOKUP(E18,Sheet3!$A$3:$A$10000,1,0))","v":3},{"$f":"IFERROR(VLOOKUP(F18,Sheet3!$A$3:$C$10000,3,0),0)","v":1}]
["A1","B1",null,null,2,{"$f":"IF(E19=0,\"\",VLOOKUP(E19,Sheet3!$A$3:$A$10000,1,0))","v":2},{"$f":"IFERROR(VLOOKUP(F19,Sheet3!$A$3:$C$10000,3,0),0)","v":1}]
["A2","B2",null,null,4,{"$f":"IF(E20=0,\"\",VLOOKUP(E20,Sheet3!$A$3:$A$10000,1,0))","v":4},{"$f":"IFERROR(VLOOKUP(F20,Sheet3!$A$3:$C$10000,3,0),0)","v":1}]
["A1","B1",null,null,5,{"$f":"IF(E21=0,\"\",VLOOKUP(E21,Sheet3!$A$3:$A$10000,1,0))","v":5},{"$f":"IFERROR(VLOOKUP(F21,Sheet3!$A$3:$C$10000,3,0),0)","v":1}]
["A2","B2",null,null,6,{"$f":"IF(E22=0,\"\",VLOOKUP(E22,Sheet3!$A$3:$A$10000,1,0))","v":6},{"$f":"IFERROR(VLOOKUP(F22,Sheet3!$A$3:$C$10000,3,0),0)","v":1}]
["A1","B1",null,null,7,{"$f":"IF(E23=0,\"\",VLOOKUP(E23,Sheet3!$A$3:$A$10000,1,0))","v":7},{"$f":"IFERROR(VLOOKUP(F23,Sheet3!$A$3:$C$10000,3,0),0)","v":1}]
["A1","V2",null,null,8,{"$f":"IF(E24=0,\"\",VLOOKUP(E24,Sheet3!$A$3:$A$10000,1,0))","v":8},{"$f":"IFERROR(VLOOKUP(F24,Sheet3!$A$3:$C$10000,3,0),0)","v":1}]
["A1","B1",null,null,9,{"$f":"IF(E25=0,\"\",VLOOKUP(E25,Sheet3!$A$3:$A$10000,1,0))","v":9},{"$f":"IFERROR(VLOOKUP(F25,Sheet3!$A$3:$C$10000,3,0),0)","v":1}]
["A2","B2",null,null,10,{"$f":"IF(E26=0,\"\",VLOOKUP(E26,Sheet3!$A$3:$A$10000,1,0))","v":10},{"$f":"IFERROR(VLOOKUP(F26,Sheet3!$A$3:$C$10000,3,0),0)","v":1}]
["A1","B1",null,null,11,{"$f":"IF(E27=0,\"\",VLOOKUP(E27,Sheet3!$A$3:$A$10000,1,0))","v":11},{"$f":"IFERROR(VLOOKUP(F27,Sheet3!$A$3:$C$10000,3,0),0)","v":1}]
["A2","B2",null,null,12,{"$f":"IF(E28=0,\"\",VLOOKUP(E28,Sheet3!$A$3:$A$10000,1,0))","v":12},{"$f":"IFERROR(VLOOKUP(F28,Sheet3!$A$3:$C$10000,3,0),0)","v":1}]
["A1","B1",null,null,13,{"$f":"IF(E29=0,\"\",VLOOKUP(E29,Sheet3!$A$3:$A$10000,1,0))","v":13},{"$f":"IFERROR(VLOOKUP(F29,Sheet3!$A$3:$C$10000,3,0),0)","v":1}]
["A2","B2",null,null,14,{"$f":"IF(E30=0,\"\",VLOOKUP(E30,Sheet3!$A$3:$A$10000,1,0))","v":14},{"$f":"IFERROR(VLOOKUP(F30,Sheet3!$A$3:$C$10000,3,0),0)","v":1}]
["A1","B1",null,null,15,{"$f":"IF(E31=0,\"\",VLOOKUP(E31,Sheet3!$A$3:$A$10000,1,0))","v":15},{"$f":"IFERROR(VLOOKUP(F31,Sheet3!$A$3:$C$10000,3,0),0)","v":1}]
["A2","B2",null,null,16,{"$f":"IF(E32=0,\"\",VLOOKUP(E32,Sheet3!$A$3:$A$10000,1,0))","v":16},{"$f":"IFERROR(VLOOKUP(F32,Sheet3!$A$3:$C$10000,3,0),0)","v":1}]
["A1","B1",null,null,17,{"$f":"IF(E33=0,\"\",VLOOKUP(E33,Sheet3!$A$3:$A$10000,1,0))","v":17},{"$f":"IFERROR(VLOOKUP(F33,Sheet3!$A$3:$C$10000,3,0),0)","v":1}]
["A2","B2",null,null,18,{"$f":"IF(E34=0,\"\",VLOOKUP(E34,Sheet3!$A$3:$A$10000,1,0))","v":18},{"$f":"IFERROR(VLOOKUP(F34,Sheet3!$A$3:$C$10000,3,0),0)","v":1}]
["A1","B1",null,null,19,{"$f":"IF(E35=0,\"\",VLOOKUP(E35,Sheet3!$A$3:$A$10000,1,0))","v":19},{"$f":"IFERROR(VLOOKUP(F35,Sheet3!$A$3:$C$10000,3,0),0)","v":1}]
["A2","B2",null,null,20,{"$f":"IF(E36=0,\"\",VLOOKUP(E36,Sheet3!$A$3:$A$10000,1,0))","v":20},{"$f":"IFERROR(VLOOKUP(F36,Sheet3!$A$3:$C$10000,3,0),0)","v":1}]
["A1","B1",null,null,21,{"$f":"IF(E37=0,\"\",VLOOKUP(E37,Sheet3!$A$3:$A$10000,1,0))","v":21},{"$f":"IFERROR(VLOOKUP(F37,Sheet3!$A$3:$C$10000,3,0),0)","v":1}]
["A2","B2",null,null,22,{"$f":"IF(E38=0,\"\",VLOOKUP(E38,Sheet3!$A$3:$A$10000,1,0))","v":22},{"$f":"IFERROR(VLOOKUP(F38,Sheet3!$A$3:$C$10000,3,0),0)","v":1}]
["A1","B1",null,null,23,{"$f":"IF(E39=0,\"\",VLOOKUP(E39,Sheet3!$A$3:$A$10000,1,0))","v":23},{"$f":"IFERROR(VLOOKUP(F39,Sheet3!$A$3:$C$10000,3,0),0)","v":1}]
["A2","B2",null,null,24,{"$f":"IF(E40=0,\"\",VLOOKUP(E40,Sheet3!$A$3:$A$10000,1,0))","v":24},{"$f":"IFERROR(VLOOKUP(F40,Sheet3!$A$3:$C$10000,3,0),0)","v":1}]
["A1","B1",null,null,25,{"$f":"IF(E41=0,\"\",VLOOKUP(E41,Sheet3!$A$3:$A$10000,1,0))","v":25},{"$f":"IFERROR(VLOOKUP(F41,Sheet3!$A$3:$C$10000,3,0),0)","v":1}]
["A2","B2",null,null,26,{"$f":"IF(E42=0,\"\",VLOOKUP(E42,Sheet3!$A$3:$A$10000,1,0))","v":26},{"$f":"IFERROR(VLOOKUP(F42,Sheet3!$A$3:$C$10000,3,0),0)","v":1}]
["A1","B1",null,null,27,{"$f":"IF(E43=0,\"\",VLOOKUP(E43,Sheet3!$A$3:$A$10000,1,0))","v":27},{"$f":"IFERROR(VLOOKUP(F43,Sheet3!$A$3:$C$10000,3,0),0)","v":1}]
[null,null,null,null,null,{"$f":"IF(E44=0,\"\",VLOOKUP(E44,Sheet3!$A$3:$A$10000,1,0))","v":""},{"$f":"IFERROR(VLOOKUP(F44,Sheet3!$A$3:$C$10000,3,0),0)","v":0}]
[null,null,null,null,null,{"$f":"IF(E45=0,\"\",VLOOKUP(E45,Sheet3!$A$3:$A$10000,1,0))","v":""},{"$f":"IFERROR(VLOOKUP(F45,Sheet3!$A$3:$C$10000,3,0),0)","v":0}]
[null,null,null,null,null,{"$f":"IF(E46=0,\"\",VLOOKUP(E46,Sheet3!$A$3:$A$10000,1,0))","v":""},{"$f":"IFERROR(VLOOKUP(F46,Sheet3!$A$3:$C$10000,3,0),0)","v":0}]
[null,null,null,null,null,{"$f":"IF(E47=0,\"\",VLOOKUP(E47,Sheet3!$A$3:$A$10000,1,0))","v":""},{"$f":"IFERROR(VLOOKUP(F47,Sheet3!$A$3:$C$10000,3,0),0)","v":0}]
[null,null,null,null,null,{"$f":"IF(E48=0,\"\",VLOOKUP(E48,Sheet3!$A$3:$A$10000,1,0))","v":""},{"$f":"IFERROR(VLOOKUP(F48,Sheet3!$A$3:$C$10000,3,0),0)","v":0}]
[null,null,null,null,null,{"$f":"IF(E49=0,\"\",VLOOKUP(E49,Sheet3!$A$3:$A$10000,1,0))","v":""},{"$f":"IFERROR(VLOOKUP(F49,Sheet3!$A$3:$C$10000,3,0),0)","v":0}]
[null,null,null,null,null,{"$f":"IF(E50=0,\"\",VLOOKUP(E50,Sheet3!$A$3:$A$10000,1,0))","v":""},{"$f":"IFERROR(VLOOKUP(F50,Sheet3!$A$3:$C$10000,3,0),0)","v":0}]
[null,null,null,null,null,{"$f":"IF(E51=0,\"\",VLOOKUP(E51,Sheet3!$A$3:$A$10000,1,0))","v":""},{"$f":"IFERROR(VLOOKUP(F51,Sheet3!$A$3:$C$10000,3,0),0)","v":0}]
[null,null,null,null,null,{"$f":"IF(E52=0,\"\",VLOOKUP(E52,Sheet3!$A$3:$A$10000,1,0))","v":""},{"$f":"IFERROR(VLOOKUP(F52,Sheet3!$A$3:$C$10000,3,0),0)","v":0}]
[null,null,null,null,null,{"$f":"IF(E53=0,\"\",VLOOKUP(E53,Sheet3!$A$3:$A$10000,1,0))","v":""},{"$f":"IFERROR(VLOOKUP(F53,Sheet3!$A$3:$C$10000,3,0),0)","v":0}]
[null,null,null,null,null,{"$f":"IF(E54=0,\"\",VLOOKUP(E54,Sheet3!$A$3:$A$10000,1,0))","v":""},{"$f":"IFERROR(VLOOKUP(F54,Sheet3!$A$3:$C$10000,3,0),0)","v":0}]
[null,null,null,null,null,{"$f":"IF(E55=0,\"\",VLOOKUP(E55,Sheet3!$A$3:$A$10000,1,0))","v":""},{"$f":"IFERROR(VLOOKUP(F55,Sheet3!$A$3:$C$10000,3,0),0)","v":0}]
[null,null,null,null,null,{"$f":"IF(E56=0,\"\",VLOOKUP(E56,Sheet3!$A$3:$A$10000,1,0))","v":""},{"$f":"IFERROR(VLOOKUP(F56,Sheet3!$A$3:$C$10000,3,0),0)","v":0}]
[null,null,null,null,null,{"$f":"IF(E57=0,\"\",VLOOKUP(E57,Sheet3!$A$3:$A$10000,1,0))","v":""},{"$f":"IFERROR(VLOOKUP(F57,Sheet3!$A$3:$C$10000,3,0),0)","v":0}]
[null,null,null,null,null,{"$f":"IF(E58=0,\"\",VLOOKUP(E58,Sheet3!$A$3:$A$10000,1,0))","v":""},{"$f":"IFERROR(VLOOKUP(F58,Sheet3!$A$3:$C$10000,3,0),0)","v":0}]
[null,null,null,null,null,{"$f":"IF(E59=0,\"\",VLOOKUP(E59,Sheet3!$A$3:$A$10000,1,0))","v":""},{"$f":"IFERROR(VLOOKUP(F59,Sheet3!$A$3:$C$10000,3,0),0)","v":0}]
[null,null,null,null,null,{"$f":"IF(E60=0,\"\",VLOOKUP(E60,Sheet3!$A$3:$A$10000,1,0))","v":""},{"$f":"IFERROR(VLOOKUP(F60,Sheet3!$A$3:$C$10000,3,0),0)","v":0}]
[null,null,null,null,null,{"$f":"IF(E61=0,\"\",VLOOKUP(E61,Sheet3!$A$3:$A$10000,1,0))","v":""},{"$f":"IFERROR(VLOOKUP(F61,Sheet3!$A$3:$C$10000,3,0),0)","v":0}]
[null,null,null,null,null,{"$f":"IF(E62=0,\"\",VLOOKUP(E62,Sheet3!$A$3:$A$10000,1,0))","v":""},{"$f":"IFERROR(VLOOKUP(F62,Sheet3!$A$3:$C$10000,3,0),0)","v":0}]
[null,null,null,null,null,{"$f":"IF(E63=0,\"\",VLOOKUP(E63,Sheet3!$A$3:$A$10000,1,0))","v":""},{"$f":"IFERROR(VLOOKUP(F63,Sheet3!$A$3:$C$10000,3,0),0)","v":0}]
[null,null,null,null,null,{"$f":"IF(E64=0,\"\",VLOOKUP(E64,Sheet3!$A$3:$A$10000,1,0))","v":""},{"$f":"IFERROR(VLOOKUP(F64,Sheet3!$A$3:$C$10000,3,0),0)","v":0}]
[null,null,null,null,null,{"$f":"IF(E65=0,\"\",VLOOKUP(E65,Sheet3!$A$3:$A$10000,1,0))","v":""},{"$f":"IFERROR(VLOOKUP(F65,Sheet3!$A$3:$C$10000,3,0),0)","v":0}]
[null,null,null,null,null,{"$f":"IF(E66=0,\"\",VLOOKUP(E66,Sheet3!$A$3:$A$10000,1,0))","v":""},{"$f":"IFERROR(VLOOKUP(F66,Sheet3!$A$3:$C$10000,3,0),0)","v":0}]
[null,null,null,null,null,{"$f":"IF(E67=0,\"\",VLOOKUP(E67,Sheet3!$A$3:$A$10000,1,0))","v":""},{"$f":"IFERROR(VLOOKUP(F67,Sheet3!$A$3:$C$10000,3,0),0)","v":0}]
[null,null,null,null,null,{"$f":"IF(E68=0,\"\",VLOOKUP(E68,Sheet3!$A$3:$A$10000,1,0))","v":""},{"$f":"IFERROR(VLOOKUP(F68,Sheet3!$A$3:$C$10000,3,0),0)","v":0}]
[null,null,null,null,null,{"$f":"IF(E69=0,\"\",VLOOKUP(E69,Sheet3!$A$3:$A$10000,1,0))","v":""},{"$f":"IFERROR(VLOOKUP(F69,Sheet3!$A$3:$C$10000,3,0),0)","v":0}]
[null,null,null,null,null,{"$f":"IF(E70=0,\"\",VLOOKUP(E70,Sheet3!$A$3:$A$10000,1,0))","v":""},{"$f":"IFERROR(VLOOKUP(F70,Sheet3!$A$3:$C$10000,3,0),0)","v":0}]
[null,null,null,null,null,{"$f":"IF(E71=0,\"\",VLOOKUP(E71,Sheet3!$A$3:$A$10000,1,0))","v":""},{"$f":"IFERROR(VLOOKUP(F71,Sheet3!$A$3:$C$10000,3,0),0)","v":0}]
[null,null,null,null,null,{"$f":"IF(E72=0,\"\",VLOOKUP(E72,Sheet3!$A$3:$A$10000,1,0))","v":""},{"$f":"IFERROR(VLOOKUP(F72,Sheet3!$A$3:$C$10000,3,0),0)","v":0}]
[null,null,null,null,null,{"$f":"IF(E73=0,\"\",VLOOKUP(E73,Sheet3!$A$3:$A$10000,1,0))","v":""},{"$f":"IFERROR(VLOOKUP(F73,Sheet3!$A$3:$C$10000,3,0),0)","v":0}]
[null,null,null,null,null,{"$f":"IF(E74=0,\"\",VLOOKUP(E74,Sheet3!$A$3:$A$10000,1,0))","v":""},{"$f":"IFERROR(VLOOKUP(F74,Sheet3!$A$3:$C$10000,3,0),0)","v":0}]
[null,null,null,null,null,{"$f":"IF(E75=0,\"\",VLOOKUP(E75,Sheet3!$A$3:$A$10000,1,0))","v":""},{"$f":"IFERROR(VLOOKUP(F75,Sheet3!$A$3:$C$10000,3,0),0)","v":0}]
[null,null,null,null,null,{"$f":"IF(E76=0,\"\",VLOOKUP(E76,Sheet3!$A$3:$A$10000,1,0))","v":""},{"$f":"IFERROR(VLOOKUP(F76,Sheet3!$A$3:$C$10000,3,0),0)","v":0}]
[null,null,null,null,null,{"$f":"IF(E77=0,\"\",VLOOKUP(E77,Sheet3!$A$3:$A$10000,1,0))","v":""},{"$f":"IFERROR(VLOOKUP(F77,Sheet3!$A$3:$C$10000,3,0),0)","v":0}]
[null,null,null,null,null,{"$f":"IF(E78=0,\"\",VLOOKUP(E78,Sheet3!$A$3:$A$10000,1,0))","v":""},{"$f":"IFERROR(VLOOKUP(F78,Sheet3!$A$3:$C$10000,3,0),0)","v":0}]
[null,null,null,null,null,{"$f":"IF(E79=0,\"\",VLOOKUP(E79,Sheet3!$A$3:$A$10000,1,0))","v":""},{"$f":"IFERROR(VLOOKUP(F79,Sheet3!$A$3:$C$10000,3,0),0)","v":0}]
[null,null,null,null,null,{"$f":"IF(E80=0,\"\",VLOOKUP(E80,Sheet3!$A$3:$A$10000,1,0))","v":""},{"$f":"IFERROR(VLOOKUP(F80,Sheet3!$A$3:$C$10000,3,0),0)","v":0}]
[null,null,null,null,null,{"$f":"IF(E81=0,\"\",VLOOKUP(E81,Sheet3!$A$3:$A$10000,1,0))","v":""},{"$f":"IFERROR(VLOOKUP(F81,Sheet3!$A$3:$C$10000,3,0),0)","v":0}]
[null,null,null,null,null,{"$f":"IF(E82=0,\"\",VLOOKUP(E82,Sheet3!$A$3:$A$10000,1,0))","v":""},{"$f":"IFERROR(VLOOKUP(F82,Sheet3!$A$3:$C$10000,3,0),0)","v":0}]
[null,null,null,null,null,{"$f":"IF(E83=0,\"\",VLOOKUP(E83,Sheet3!$A$3:$A$10000,1,0))","v":""},{"$f":"IFERROR(VLOOKUP(F83,Sheet3!$A$3:$C$10000,3,0),0)","v":0}]
[null,null,null,null,null,{"$f":"IF(E84=0,\"\",VLOOKUP(E84,Sheet3!$A$3:$A$10000,1,0))","v":""},{"$f":"IFERROR(VLOOKUP(F84,Sheet3!$A$3:$C$10000,3,0),0)","v":0}]
[null,null,null,null,null,{"$f":"IF(E85=0,\"\",VLOOKUP(E85,Sheet3!$A$3:$A$10000,1,0))","v":""},{"$f":"IFERROR(VLOOKUP(F85,Sheet3!$A$3:$C$10000,3,0),0)","v":0}]
[null,null,null,null,null,{"$f":"IF(E86=0,\"\",VLOOKUP(E86,Sheet3!$A$3:$A$10000,1,0))","v":""},{"$f":"IFERROR(VLOOKUP(F86,Sheet3!$A$3:$C$10000,3,0),0)","v":0}]
[null,null,null,null,null,{"$f":"IF(E87=0,\"\",VLOOKUP(E87,Sheet3!$A$3:$A$10000,1,0))","v":""},{"$f":"IFERROR(VLOOKUP(F87,Sheet3!$A$3:$C$10000,3,0),0)","v":0}]
[null,null,null,null,null,{"$f":"IF(E88=0,\"\",VLOOKUP(E88,Sheet3!$A$3:$A$10000,1,0))","v":""},{"$f":"IFERROR(VLOOKUP(F88,Sheet3!$A$3:$C$10000,3,0),0)","v":0}]
[null,null,null,null,null,{"$f":"IF(E89=0,\"\",VLOOKUP(E89,Sheet3!$A$3:$A$10000,1,0))","v":""},{"$f":"IFERROR(VLOOKUP(F89,Sheet3!$A$3:$C$10000,3,0),0)","v":0}]
[null,null,null,null,null,{"$f":"IF(E90=0,\"\",VLOOKUP(E90,Sheet3!$A$3:$A$10000,1,0))","v":""},{"$f":"IFERROR(VLOOKUP(F90,Sheet3!$A$3:$C$10000,3,0),0)","v":0}]
[null,null,null,null,null,{"$f":"IF(E91=0,\"\",VLOOKUP(E91,Sheet3!$A$3:$A$10000,1,0))","v":""},{"$f":"IFERROR(VLOOKUP(F91,Sheet3!$A$3:$C$10000,3,0),0)","v":0}]
[null,null,null,null,null,{"$f":"IF(E92=0,\"\",VLOOKUP(E92,Sheet3!$A$3:$A$10000,1,0))","v":""},{"$f":"IFERROR(VLOOKUP(F92,Sheet3!$A$3:$C$10000,3,0),0)","v":0}]
[null,null,null,null,null,{"$f":"IF(E93=0,\"\",VLOOKUP(E93,Sheet3!$A$3:$A$10000,1,0))","v":""},{"$f":"IFERROR(VLOOKUP(F93,Sheet3!$A$3:$C$10000,3,0),0)","v":0}]
[null,null,null,null,null,{"$f":"IF(E94=0,\"\",VLOOKUP(E94,Sheet3!$A$3:$A$10000,1,0))","v":""},{"$f":"IFERROR(VLOOKUP(F94,Sheet3!$A$3:$C$10000,3,0),0)","v":0}]
[null,null,null,null,null,{"$f":"IF(E95=0,\"\",VLOOKUP(E95,Sheet3!$A$3:$A$10000,1,0))","v":""},{"$f":"IFERROR(VLOOKUP(F95,Sheet3!$A$3:$C$10000,3,0),0)","v":0}]
[null,null,null,null,null,{"$f":"IF(E96=0,\"\",VLOOKUP(E96,Sheet3!$A$3:$A$10000,1,0))","v":""},{"$f":"IFERROR(VLOOKUP(F96,Sheet3!$A$3:$C$10000,3,0),0)","v":0}]
[null,null,null,null,null,{"$f":"IF(E97=0,\"\",VLOOKUP(E97,Sheet3!$A$3:$A$10000,1,0))","v":""},{"$f":"IFERROR(VLOOKUP(F97,Sheet3!$A$3:$C$10000,3,0),0)","v":0}]
[null,null,null,null,null,{"$f":"IF(E98=0,\"\",VLOOKUP(E98,Sheet3!$A$3:$A$10000,1,0))","v":""},{"$f":"IFERROR(VLOOKUP(F98,Sheet3!$A$3:$C$10000,3,0),0)","v":0}]
[null,null,null,null,null,{"$f":"IF(E99=0,\"\",VLOOKUP(E99,Sheet3!$A$3:$A$10000,1,0))","v":""},{"$f":"IFERROR(VLOOKUP(F99,Sheet3!$A$3:$C$10000,3,0),0)","v":0}]
[null,null,null,null,null,{"$f":"IF(E100=0,\"\",VLOOKUP(E100,Sheet3!$A$3:$A$10000,1,0))","v":""},{"$f":"IFERROR(VLOOKUP(F100,Sheet3!$A$3:$C$10000,3,0),0)","v":0}]
[null,null,null,null,null,{"$f":"IF(E101=0,\"\",VLOOKUP(E101,Sheet3!$A$3:$A$10000,1,0))","v":""},{"$f":"IFERROR(VLOOKUP(F101,Sheet3!$A$3:$C$10000,3,0),0)","v":0}]
[null,null,null,null,null,{"$f":"IF(E102=0,\"\",VLOOKUP(E102,Sheet3!$A$3:$A$10000,1,0))","v":""},{"$f":"IFERROR(VLOOKUP(F102,Sheet3!$A$3:$C$10000,3,0),0)","v":0}]
[null,null,null,null,null,{"$f":"IF(E103=0,\"\",VLOOKUP(E103,Sheet3!$A$3:$A$10000,1,0))","v":""},{"$f":"IFERROR(VLOOKUP(F103,Sheet3!$A$3:$C$10000,3,0),0)","v":0}]
[null,null,null,null,null,{"$f":"IF(E104=0,\"\",VLOOKUP(E104,Sheet3!$A$3:$A$10000,1,0))","v":""},{"$f":"IFERROR(VLOOKUP(F104,Sheet3!$A$3:$C$10000,3,0),0)","v":0}]
[null,null,null,null,null,{"$f":"IF(E105=0,\"\",VLOOKUP(E105,Sheet3!$A$3:$A$10000,1,0))","v":""},{"$f":"IFERROR(VLOOKUP(F105,Sheet3!$A$3:$C$10000,3,0),0)","v":0}]
[null,null,null,null,null,{"$f":"IF(E106=0,\"\",VLOOKUP(E106,Sheet3!$A$3:$A$10000,1,0))","v":""},{"$f":"IFERROR(VLOOKUP(F106,Sheet3!$A$3:$C$10000,3,0),0)","v":0}]
[null,null,null,null,null,{"$f":"IF(E107=0,\"\",VLOOKUP(E107,Sheet3!$A$3:$A$10000,1,0))","v":""},{"$f":"IFERROR(VLOOKUP(F107,Sheet3!$A$3:$C$10000,3,0),0)","v":0}]
[null,null,null,null,null,{"$f":"IF(E108=0,\"\",VLOOKUP(E108,Sheet3!$A$3:$A$10000,1,0))","v":""},{"$f":"IFERROR(VLOOKUP(F108,Sheet3!$A$3:$C$10000,3,0),0)","v":0}]
[null,null,null,null,null,{"$f":"IF(E109=0,\"\",VLOOKUP(E109,Sheet3!$A$3:$A$10000,1,0))","v":""},{"$f":"IFERROR(VLOOKUP(F109,Sheet3!$A$3:$C$10000,3,0),0)","v":0}]
[null,null,null,null,null,{"$f":"IF(E110=0,\"\",VLOOKUP(E110,Sheet3!$A$3:$A$10000,1,0))","v":""},{"$f":"IFERROR(VLOOKUP(F110,Sheet3!$A$3:$C$10000,3,0),0)","v":0}]
[null,null,null,null,null,{"$f":"IF(E111=0,\"\",VLOOKUP(E111,Sheet3!$A$3:$A$10000,1,0))","v":""},{"$f":"IFERROR(VLOOKUP(F111,Sheet3!$A$3:$C$10000,3,0),0)","v":0}]
[null,null,null,null,null,{"$f":"IF(E112=0,\"\",VLOOKUP(E112,Sheet3!$A$3:$A$10000,1,0))","v":""},{"$f":"IFERROR(VLOOKUP(F112,Sheet3!$A$3:$C$10000,3,0),0)","v":0}]
[null,null,null,null,null,{"$f":"IF(E113=0,\"\",VLOOKUP(E113,Sheet3!$A$3:$A$10000,1,0))","v":""},{"$f":"IFERROR(VLOOKUP(F113,Sheet3!$A$3:$C$10000,3,0),0)","v":0}]
[null,null,null,null,null,{"$f":"IF(E114=0,\"\",VLOOKUP(E114,Sheet3!$A$3:$A$10000,1,0))","v":""},{"$f":"IFERROR(VLOOKUP(F114,Sheet3!$A$3:$C$10000,3,0),0)","v":0}]
[null,null,null,null,null,{"$f":"IF(E115=0,\"\",VLOOKUP(E115,Sheet3!$A$3:$A$10000,1,0))","v":""},{"$f":"IFERROR(VLOOKUP(F115,Sheet3!$A$3:$C$10000,3,0),0)","v":0}]
[null,null,null,null,null,{"$f":"IF(E116=0,\"\",VLOOKUP(E116,Sheet3!$A$3:$A$10000,1,0))","v":""},{"$f":"IFERROR(VLOOKUP(F116,Sheet3!$A$3:$C$10000,3,0),0)","v":0}]
[null,null,null,null,null,{"$f":"IF(E117=0,\"\",VLOOKUP(E117,Sheet3!$A$3:$A$10000,1,0))","v":""},{"$f":"IFERROR(VLOOKUP(F117,Sheet3!$A$3:$C$10000,3,0),0)","v":0}]
[null,null,null,null,null,{"$f":"IF(E118=0,\"\",VLOOKUP(E118,Sheet3!$A$3:$A$10000,1,0))","v":""},{"$f":"IFERROR(VLOOKUP(F118,Sheet3!$A$3:$C$10000,3,0),0)","v":0}]
[null,null,null,null,null,{"$f":"IF(E119=0,\"\",VLOOKUP(E119,Sheet3!$A$3:$A$10000,1,0))","v":""},{"$f":"IFERROR(VLOOKUP(F119,Sheet3!$A$3:$C$10000,3,0),0)","v":0}]
[null,null,null,null,null,{"$f":"IF(E120=0,\"\",VLOOKUP(E120,Sheet3!$A$3:$A$10000,1,0))","v":""},{"$f":"IFERROR(VLOOKUP(F120,Sheet3!$A$3:$C$10000,3,0),0)","v":0}]
[null,null,null,null,null,{"$f":"IF(E121=0,\"\",VLOOKUP(E121,Sheet3!$A$3:$A$10000,1,0))","v":""},{"$f":"IFERROR(VLOOKUP(F121,Sheet3!$A$3:$C$10000,3,0),0)","v":0}]
[null,null,null,null,null,{"$f":"IF(E122=0,\"\",VLOOKUP(E122,Sheet3!$A$3:$A$10000,1,0))","v":""},{"$f":"IFERROR(VLOOKUP(F122,Sheet3!$A$3:$C$10000,3,0),0)","v":0}]
[null,null,null,null,null,{"$f":"IF(E123=0,\"\",VLOOKUP(E123,Sheet3!$A$3:$A$10000,1,0))","v":""},{"$f":"IFERROR(VLOOKUP(F123,Sheet3!$A$3:$C$10000,3,0),0)","v":0}]
[null,null,null,null,null,{"$f":"IF(E124=0,\"\",VLOOKUP(E124,Sheet3!$A$3:$A$10000,1,0))","v":""},{"$f":"IFERROR(VLOOKUP(F124,Sheet3!$A$3:$C$10000,3,0),0)","v":0}]
[null,null,null,null,null,{"$f":"IF(E125=0,\"\",VLOOKUP(E125,Sheet3!$A$3:$A$10000,1,0))","v":""},{"$f":"IFERROR(VLOOKUP(F125,Sheet3!$A$3:$C$10000,3,0),0)","v":0}]
[null,null,null,null,null,{"$f":"IF(E126=0,\"\",VLOOKUP(E126,Sheet3!$A$3:$A$10000,1,0))","v":""},{"$f":"IFERROR(VLOOKUP(F126,Sheet3!$A$3:$C$10000,3,0),0)","v":0}]
[null,null,null,null,null,{"$f":"IF(E127=0,\"\",VLOOKUP(E127,Sheet3!$A$3:$A$10000,1,0))","v":""},{"$f":"IFERROR(VLOOKUP(F127,Sheet3!$A$3:$C$10000,3,0),0)","v":0}]
[null,null,null,null,null,{"$f":"IF(E128=0,\"\",VLOOKUP(E128,Sheet3!$A$3:$A$10000,1,0))","v":""},{"$f":"IFERROR(VLOOKUP(F128,Sheet3!$A$3:$C$10000,3,0),0)","v":0}]
[null,null,null,null,null,{"$f":"IF(E129=0,\"\",VLOOKUP(E129,Sheet3!$A$3:$A$10000,1,0))","v":""},{"$f":"IFERROR(VLOOKUP(F129,Sheet3!$A$3:$C$10000,3,0),0)","v":0}]
[null,null,null,null,null,{"$f":"IF(E130=0,\"\",VLOOKUP(E130,Sheet3!$A$3:$A$10000,1,0))","v":""},{"$f":"IFERROR(VLOOKUP(F130,Sheet3!$A$3:$C$10000,3,0),0)","v":0}]
[null,null,null,null,null,{"$f":"IF(E131=0,\"\",VLOOKUP(E131,Sheet3!$A$3:$A$10000,1,0))","v":""},{"$f":"IFERROR(VLOOKUP(F131,Sheet3!$A$3:$C$10000,3,0),0)","v":0}]
[null,null,null,null,null,{"$f":"IF(E132=0,\"\",VLOOKUP(E132,Sheet3!$A$3:$A$10000,1,0))","v":""},{"$f":"IFERROR(VLOOKUP(F132,Sheet3!$A$3:$C$10000,3,0),0)","v":0}]
[null,null,null,null,null,{"$f":"IF(E133=0,\"\",VLOOKUP(E133,Sheet3!$A$3:$A$10000,1,0))","v":""},{"$f":"IFERROR(VLOOKUP(F133,Sheet3!$A$3:$C$10000,3,0),0)","v":0}]
[null,null,null,null,null,{"$f":"IF(E134=0,\"\",VLOOKUP(E134,Sheet3!$A$3:$A$10000,1,0))","v":""},{"$f":"IFERROR(VLOOKUP(F134,Sheet3!$A$3:$C$10000,3,0),0)","v":0}]
[null,null,null,null,null,{"$f":"IF(E135=0,\"\",VLOOKUP(E135,Sheet3!$A$3:$A$10000,1,0))","v":""},{"$f":"IFERROR(VLOOKUP(F135,Sheet3!$A$3:$C$10000,3,0),0)","v":0}]
[null,null,null,null,null,{"$f":"IF(E136=0,\"\",VLOOKUP(E136,Sheet3!$A$3:$A$10000,1,0))","v":""},{"$f":"IFERROR(VLOOKUP(F136,Sheet3!$A$3:$C$10000,3,0),0)","v":0}]
[null,null,null,null,null,{"$f":"IF(E137=0,\"\",VLOOKUP(E137,Sheet3!$A$3:$A$10000,1,0))","v":""},{"$f":"IFERROR(VLOOKUP(F137,Sheet3!$A$3:$C$10000,3,0),0)","v":0}]
[null,null,null,null,null,{"$f":"IF(E138=0,\"\",VLOOKUP(E138,Sheet3!$A$3:$A$10000,1,0))","v":""},{"$f":"IFERROR(VLOOKUP(F138,Sheet3!$A$3:$C$10000,3,0),0)","v":0}]
[null,null,null,null,null,{"$f":"IF(E139=0,\"\",VLOOKUP(E139,Sheet3!$A$3:$A$10000,1,0))","v":""},{"$f":"IFERROR(VLOOKUP(F139,Sheet3!$A$3:$C$10000,3,0),0)","v":0}]
[null,null,null,null,null,{"$f":"IF(E140=0,\"\",VLOOKUP(E140,Sheet3!$A$3:$A$10000,1,0))","v":""},{"$f":"IFERROR(VLOOKUP(F140,Sheet3!$A$3:$C$10000,3,0),0)","v":0}]
[null,null,null,null,null,{"$f":"IF(E141=0,\"\",VLOOKUP(E141,Sheet3!$A$3:$A$10000,1,0))","v":""},{"$f":"IFERROR(VLOOKUP(F141,Sheet3!$A$3:$C$10000,3,0),0)","v":0}]
[null,null,null,null,null,{"$f":"IF(E142=0,\"\",VLOOKUP(E142,Sheet3!$A$3:$A$10000,1,0))","v":""},{"$f":"IFERROR(VLOOKUP(F142,Sheet3!$A$3:$C$10000,3,0),0)","v":0}]
[null,null,null,null,null,{"$f":"IF(E143=0,\"\",VLOOKUP(E143,Sheet3!$A$3:$A$10000,1,0))","v":""},{"$f":"IFERROR(VLOOKUP(F143,Sheet3!$A$3:$C$10000,3,0),0)","v":0}]
[null,null,null,null,null,{"$f":"IF(E144=0,\"\",VLOOKUP(E144,Sheet3!$A$3:$A$10000,1,0))","v":""},{"$f":"IFERROR(VLOOKUP(F144,Sheet3!$A$3:$C$10000,3,0),0)","v":0}]
[null,null,null,null,null,{"$f":"IF(E145=0,\"\",VLOOKUP(E145,Sheet3!$A$3:$A$10000,1,0))","v":""},{"$f":"IFERROR(VLOOKUP(F145,Sheet3!$A$3:$C$10000,3,0),0)","v":0}]
[null,null,null,null,null,{"$f":"IF(E146=0,\"\",VLOOKUP(E146,Sheet3!$A$3:$A$10000,1,0))","v":""},{"$f":"IFERROR(VLOOKUP(F146,Sheet3!$A$3:$C$10000,3,0),0)","v":0}]
[null,null,null,null,null,{"$f":"IF(E147=0,\"\",VLOOKUP(E147,Sheet3!$A$3:$A$10000,1,0))","v":""},{"$f":"IFERROR(VLOOKUP(F147,Sheet3!$A$3:$C$10000,3,0),0)","v":0}]
[null,null,null,null,null,{"$f":"IF(E148=0,\"\",VLOOKUP(E148,Sheet3!$A$3:$A$10000,1,0))","v":""},{"$f":"IFERROR(VLOOKUP(F148,Sheet3!$A$3:$C$10000,3,0),0)","v":0}]
[null,null,null,null,null,{"$f":"IF(E149=0,\"\",VLOOKUP(E149,Sheet3!$A$3:$A$10000,1,0))","v":""},{"$f":"IFERROR(VLOOKUP(F149,Sheet3!$A$3:$C$10000,3,0),0)","v":0}]
[null,null,null,null,null,{"$f":"IF(E150=0,\"\",VLOOKUP(E150,Sheet3!$A$3:$A$10000,1,0))","v":""},{"$f":"IFERROR(VLOOKUP(F150,Sheet3!$A$3:$C$10000,3,0),0)","v":0}]
[null,null,null,null,null,{"$f":"IF(E151=0,\"\",VLOOKUP(E151,Sheet3!$A$3:$A$10000,1,0))","v":""},{"$f":"IFERROR(VLOOKUP(F151,Sheet3!$A$3:$C$10000,3,0),0)","v":0}]
[null,null,null,null,null,{"$f":"IF(E152=0,\"\",VLOOKUP(E152,Sheet3!$A$3:$A$10000,1,0))","v":""},{"$f":"IFERROR(VLOOKUP(F152,Sheet3!$A$3:$C$10000,3,0),0)","v":0}]
[null,null,null,null,null,{"$f":"IF(E153=0,\"\",VLOOKUP(E153,Sheet3!$A$3:$A$10000,1,0))","v":""},{"$f":"IFERROR(VLOOKUP(F153,Sheet3!$A$3:$C$10000,3,0),0)","v":0}]
[null,null,null,null,null,{"$f":"IF(E154=0,\"\",VLOOKUP(E154,Sheet3!$A$3:$A$10000,1,0))","v":""},{"$f":"IFERROR(VLOOKUP(F154,Sheet3!$A$3:$C$10000,3,0),0)","v":0}]
[null,null,null,null,null,{"$f":"IF(E155=0,\"\",VLOOKUP(E155,Sheet3!$A$3:$A$10000,1,0))","v":""},{"$f":"IFERROR(VLOOKUP(F155,Sheet3!$A$3:$C$10000,3,0),0)","v":0}]
[null,null,null,null,null,{"$f":"IF(E156=0,\"\",VLOOKUP(E156,Sheet3!$A$3:$A$10000,1,0))","v":""},{"$f":"IFERROR(VLOOKUP(F156,Sheet3!$A$3:$C$10000,3,0),0)","v":0}]
[null,null,null,null,null,{"$f":"IF(E157=0,\"\",VLOOKUP(E157,Sheet3!$A$3:$A$10000,1,0))","v":""},{"$f":"IFERROR(VLOOKUP(F157,Sheet3!$A$3:$C$10000,3,0),0)","v":0}]
[null,null,null,null,null,{"$f":"IF(E158=0,\"\",VLOOKUP(E158,Sheet3!$A$3:$A$10000,1,0))","v":""},{"$f":"IFERROR(VLOOKUP(F158,Sheet3!$A$3:$C$10000,3,0),0)","v":0}]
[null,null,null,null,null,{"$f":"IF(E159=0,\"\",VLOOKUP(E159,Sheet3!$A$3:$A$10000,1,0))","v":""},{"$f":"IFERROR(VLOOKUP(F159,Sheet3!$A$3:$C$10000,3,0),0)","v":0}]
[null,null,null,null,null,{"$f":"IF(E160=0,\"\",VLOOKUP(E160,Sheet3!$A$3:$A$10000,1,0))","v":""},{"$f":"IFERROR(VLOOKUP(F160,Sheet3!$A$3:$C$10000,3,0),0)","v":0}]
[null,null,null,null,null,{"$f":"IF(E161=0,\"\",VLOOKUP(E161,Sheet3!$A$3:$A$10000,1,0))","v":""},{"$f":"IFERROR(VLOOKUP(F161,Sheet3!$A$3:$C$10000,3,0),0)","v":0}]
[null,null,null,null,null,{"$f":"IF(E162=0,\"\",VLOOKUP(E162,Sheet3!$A$3:$A$10000,1,0))","v":""},{"$f":"IFERROR(VLOOKUP(F162,Sheet3!$A$3:$C$10000,3,0),0)","v":0}]
[null,null,null,null,null,{"$f":"IF(E163=0,\"\",VLOOKUP(E163,Sheet3!$A$3:$A$10000,1,0))","v":""},{"$f":"IFERROR(VLOOKUP(F163,Sheet3!$A$3:$C$10000,3,0),0)","v":0}]
[null,null,null,null,null,{"$f":"IF(E164=0,\"\",VLOOKUP(E164,Sheet3!$A$3:$A$10000,1,0))","v":""},{"$f":"IFERROR(VLOOKUP(F164,Sheet3!$A$3:$C$10000,3,0),0)","v":0}]
[null,null,null,null,null,{"$f":"IF(E165=0,\"\",VLOOKUP(E165,Sheet3!$A$3:$A$10000,1,0))","v":""},{"$f":"IFERROR(VLOOKUP(F165,Sheet3!$A$3:$C$10000,3,0),0)","v":0}]
[null,null,null,null,null,{"$f":"IF(E166=0,\"\",VLOOKUP(E166,Sheet3!$A$3:$A$10000,1,0))","v":""},{"$f":"IFERROR(VLOOKUP(F166,Sheet3!$A$3:$C$10000,3,0),0)","v":0}]
[null,null,null,null,null,{"$f":"IF(E167=0,\"\",VLOOKUP(E167,Sheet3!$A$3:$A$10000,1,0))","v":""},{"$f":"IFERROR(VLOOKUP(F167,Sheet3!$A$3:$C$10000,3,0),0)","v":0}]
[null,null,null,null,null,{"$f":"IF(E168=0,\"\",VLOOKUP(E168,Sheet3!$A$3:$A$10000,1,0))","v":""},{"$f":"IFERROR(VLOOKUP(F168,Sheet3!$A$3:$C$10000,3,0),0)","v":0}]
[null,null,null,null,null,{"$f":"IF(E169=0,\"\",VLOOKUP(E169,Sheet3!$A$3:$A$10000,1,0))","v":""},{"$f":"IFERROR(VLOOKUP(F169,Sheet3!$A$3:$C$10000,3,0),0)","v":0}]
[null,null,null,null,null,{"$f":"IF(E170=0,\"\",VLOOKUP(E170,Sheet3!$A$3:$A$10000,1,0))","v":""},{"$f":"IFERROR(VLOOKUP(F170,Sheet3!$A$3:$C$10000,3,0),0)","v":0}]
[null,null,null,null,null,{"$f":"IF(E171=0,\"\",VLOOKUP(E171,Sheet3!$A$3:$A$10000,1,0))","v":""},{"$f":"IFERROR(VLOOKUP(F171,Sheet3!$A$3:$C$10000,3,0),0)","v":0}]
[null,null,null,null,null,{"$f":"IF(E172=0,\"\",VLOOKUP(E172,Sheet3!$A$3:$A$10000,1,0))","v":""},{"$f":"IFERROR(VLOOKUP(F172,Sheet3!$A$3:$C$10000,3,0),0)","v":0}]
[null,null,null,null,null,{"$f":"IF(E173=0,\"\",VLOOKUP(E173,Sheet3!$A$3:$A$10000,1,0))","v":""},{"$f":"IFERROR(VLOOKUP(F173,Sheet3!$A$3:$C$10000,3,0),0)","v":0}]
[null,null,null,null,null,{"$f":"IF(E174=0,\"\",VLOOKUP(E174,Sheet3!$A$3:$A$10000,1,0))","v":""},{"$f":"IFERROR(VLOOKUP(F174,Sheet3!$A$3:$C$10000,3,0),0)","v":0}]
[null,null,null,null,null,{"$f":"IF(E175=0,\"\",VLOOKUP(E175,Sheet3!$A$3:$A$10000,1,0))","v":""},{"$f":"IFERROR(VLOOKUP(F175,Sheet3!$A$3:$C$10000,3,0),0)","v":0}]
[null,null,null,null,null,{"$f":"IF(E176=0,\"\",VLOOKUP(E176,Sheet3!$A$3:$A$10000,1,0))","v":""},{"$f":"IFERROR(VLOOKUP(F176,Sheet3!$A$3:$C$10000,3,0),0)","v":0}]
[null,null,null,null,null,{"$f":"IF(E177=0,\"\",VLOOKUP(E177,Sheet3!$A$3:$A$10000,1,0))","v":""},{"$f":"IFERROR(VLOOKUP(F177,Sheet3!$A$3:$C$10000,3,0),0)","v":0}]
[null,null,null,null,null,{"$f":"IF(E178=0,\"\",VLOOKUP(E178,Sheet3!$A$3:$A$10000,1,0))","v":""},{"$f":"IFERROR(VLOOKUP(F178,Sheet3!$A$3:$C$10000,3,0),0)","v":0}]
[null,null,null,null,null,{"$f":"IF(E179=0,\"\",VLOOKUP(E179,Sheet3!$A$3:$A$10000,1,0))","v":""},{"$f":"IFERROR(VLOOKUP(F179,Sheet3!$A$3:$C$10000,3,0),0)","v":0}]
[null,null,null,null,null,{"$f":"IF(E180=0,\"\",VLOOKUP(E180,Sheet3!$A$3:$A$10000,1,0))","v":""},{"$f":"IFERROR(VLOOKUP(F180,Sheet3!$A$3:$C$10000,3,0),0)","v":0}]
[null,null,null,null,null,{"$f":"IF(E181=0,\"\",VLOOKUP(E181,Sheet3!$A$3:$A$10000,1,0))","v":""},{"$f":"IFERROR(VLOOKUP(F181,Sheet3!$A$3:$C$10000,3,0),0)","v":0}]
[null,null,null,null,null,{"$f":"IF(E182=0,\"\",VLOOKUP(E182,Sheet3!$A$3:$A$10000,1,0))","v":""},{"$f":"IFERROR(VLOOKUP(F182,Sheet3!$A$3:$C$10000,3,0),0)","v":0}]
[null,null,null,null,null,{"$f":"IF(E183=0,\"\",VLOOKUP(E183,Sheet3!$A$3:$A$10000,1,0))","v":""},{"$f":"IFERROR(VLOOKUP(F183,Sheet3!$A$3:$C$10000,3,0),0)","v":0}]
[null,null,null,null,null,{"$f":"IF(E184=0,\"\",VLOOKUP(E184,Sheet3!$A$3:$A$10000,1,0))","v":""},{"$f":"IFERROR(VLOOKUP(F184,Sheet3!$A$3:$C$10000,3,0),0)","v":0}]
[null,null,null,null,null,{"$f":"IF(E185=0,\"\",VLOOKUP(E185,Sheet3!$A$3:$A$10000,1,0))","v":""},{"$f":"IFERROR(VLOOKUP(F185,Sheet3!$A$3:$C$10000,3,0),0)","v":0}]
[null,null,null,null,null,{"$f":"IF(E186=0,\"\",VLOOKUP(E186,Sheet3!$A$3:$A$10000,1,0))","v":""},{"$f":"IFERROR(VLOOKUP(F186,Sheet3!$A$3:$C$10000,3,0),0)","v":0}]
[null,null,null,null,null,{"$f":"IF(E187=0,\"\",VLOOKUP(E187,Sheet3!$A$3:$A$10000,1,0))","v":""},{"$f":"IFERROR(VLOOKUP(F187,Sheet3!$A$3:$C$10000,3,0),0)","v":0}]
[null,null,null,null,null,{"$f":"IF(E188=0,\"\",VLOOKUP(E188,Sheet3!$A$3:$A$10000,1,0))","v":""},{"$f":"IFERROR(VLOOKUP(F188,Sheet3!$A$3:$C$10000,3,0),0)","v":0}]
[null,null,null,null,null,{"$f":"IF(E189=0,\"\",VLOOKUP(E189,Sheet3!$A$3:$A$10000,1,0))","v":""},{"$f":"IFERROR(VLOOKUP(F189,Sheet3!$A$3:$C$10000,3,0),0)","v":0}]
[null,null,null,null,null,{"$f":"IF(E190=0,\"\",VLOOKUP(E190,Sheet3!$A$3:$A$10000,1,0))","v":""},{"$f":"IFERROR(VLOOKUP(F190,Sheet3!$A$3:$C$10000,3,0),0)","v":0}]
[null,null,null,null,null,{"$f":"IF(E191=0,\"\",VLOOKUP(E191,Sheet3!$A$3:$A$10000,1,0))","v":""},{"$f":"IFERROR(VLOOKUP(F191,Sheet3!$A$3:$C$10000,3,0),0)","v":0}]
[null,null,null,null,null,{"$f":"IF(E192=0,\"\",VLOOKUP(E192,Sheet3!$A$3:$A$10000,1,0))","v":""},{"$f":"IFERROR(VLOOKUP(F192,Sheet3!$A$3:$C$10000,3,0),0)","v":0}]
[null,null,null,null,null,{"$f":"IF(E193=0,\"\",VLOOKUP(E193,Sheet3!$A$3:$A$10000,1,0))","v":""},{"$f":"IFERROR(VLOOKUP(F193,Sheet3!$A$3:$C$10000,3,0),0)","v":0}]
[null,null,null,null,null,{"$f":"IF(E194=0,\"\",VLOOKUP(E194,Sheet3!$A$3:$A$10000,1,0))","v":""},{"$f":"IFERROR(VLOOKUP(F194,Sheet3!$A$3:$C$10000,3,0),0)","v":0}]
[null,null,null,null,null,{"$f":"IF(E195=0,\"\",VLOOKUP(E195,Sheet3!$A$3:$A$10000,1,0))","v":""},{"$f":"IFERROR(VLOOKUP(F195,Sheet3!$A$3:$C$10000,3,0),0)","v":0}]
[null,null,null,null,null,{"$f":"IF(E196=0,\"\",VLOOKUP(E196,Sheet3!$A$3:$A$10000,1,0))","v":""},{"$f":"IFERROR(VLOOKUP(F196,Sheet3!$A$3:$C$10000,3,0),0)","v":0}]
[null,null,null,null,null,{"$f":"IF(E197=0,\"\",VLOOKUP(E197,Sheet3!$A$3:$A$10000,1,0))","v":""},{"$f":"IFERROR(VLOOKUP(F197,Sheet3!$A$3:$C$10000,3,0),0)","v":0}]
[null,null,null,null,null,{"$f":"IF(E198=0,\"\",VLOOKUP(E198,Sheet3!$A$3:$A$10000,1,0))","v":""},{"$f":"IFERROR(VLOOKUP(F198,Sheet3!$A$3:$C$10000,3,0),0)","v":0}]
[null,null,null,null,null,{"$f":"IF(E199=0,\"\",VLOOKUP(E199,Sheet3!$A$3:$A$10000,1,0))","v":""},{"$f":"IFERROR(VLOOKUP(F199,Sheet3!$A$3:$C$10000,3,0),0)","v":0}]
[null,null,null,null,null,{"$f":"IF(E200=0,\"\",VLOOKUP(E200,Sheet3!$A$3:$A$10000,1,0))","v":""},{"$f":"IFERROR(VLOOKUP(F200,Sheet3!$A$3:$C$10000,3,0),0)","v":0}]
[null,null,null,null,null,{"$f":"IF(E201=0,\"\",VLOOKUP(E201,Sheet3!$A$3:$A$10000,1,0))","v":""},{"$f":"IFERROR(VLOOKUP(F201,Sheet3!$A$3:$C$10000,3,0),0)","v":0}]
[null,null,null,null,null,{"$f":"IF(E202=0,\"\",VLOOKUP(E202,Sheet3!$A$3:$A$10000,1,0))","v":""},{"$f":"IFERROR(VLOOKUP(F202,Sheet3!$A$3:$C$10000,3,0),0)","v":0}]
[null,null,null,null,null,{"$f":"IF(E203=0,\"\",VLOOKUP(E203,Sheet3!$A$3:$A$10000,1,0))","v":""},{"$f":"IFERROR(VLOOKUP(F203,Sheet3!$A$3:$C$10000,3,0),0)","v":0}]
[null,null,null,null,null,{"$f":"IF(E204=0,\"\",VLOOKUP(E204,Sheet3!$A$3:$A$10000,1,0))","v":""},{"$f":"IFERROR(VLOOKUP(F204,Sheet3!$A$3:$C$10000,3,0),0)","v":0}]
[null,null,null,null,null,{"$f":"IF(E205=0,\"\",VLOOKUP(E205,Sheet3!$A$3:$A$10000,1,0))","v":""},{"$f":"IFERROR(VLOOKUP(F205,Sheet3!$A$3:$C$10000,3,0),0)","v":0}]
[null,null,null,null,null,{"$f":"IF(E206=0,\"\",VLOOKUP(E206,Sheet3!$A$3:$A$10000,1,0))","v":""},{"$f":"IFERROR(VLOOKUP(F206,Sheet3!$A$3:$C$10000,3,0),0)","v":0}]
[null,null,null,null,null,{"$f":"IF(E207=0,\"\",VLOOKUP(E207,Sheet3!$A$3:$A$10000,1,0))","v":""},{"$f":"IFERROR(VLOOKUP(F207,Sheet3!$A$3:$C$10000,3,0),0)","v":0}]
[null,null,null,null,null,{"$f":"IF(E208=0,\"\",VLOOKUP(E208,Sheet3!$A$3:$A$10000,1,0))","v":""},{"$f":"IFERROR(VLOOKUP(F208,Sheet3!$A$3:$C$10000,3,0),0)","v":0}]
[null,null,null,null,null,{"$f":"IF(E209=0,\"\",VLOOKUP(E209,Sheet3!$A$3:$A$10000,1,0))","v":""},{"$f":"IFERROR(VLOOKUP(F209,Sheet3!$A$3:$C$10000,3,0),0)","v":0}]
[null,null,null,null,null,{"$f":"IF(E210=0,\"\",VLOOKUP(E210,Sheet3!$A$3:$A$10000,1,0))","v":""},{"$f":"IFERROR(VLOOKUP(F210,Sheet3!$A$3:$C$10000,3,0),0)","v":0}]
[null,null,null,null,null,{"$f":"IF(E211=0,\"\",VLOOKUP(E211,Sheet3!$A$3:$A$10000,1,0))","v":""},{"$f":"IFERROR(VLOOKUP(F211,Sheet3!$A$3:$C$10000,3,0),0)","v":0}]
[null,null,null,null,null,{"$f":"IF(E212=0,\"\",VLOOKUP(E212,Sheet3!$A$3:$A$10000,1,0))","v":""},{"$f":"IFERROR(VLOOKUP(F212,Sheet3!$A$3:$C$10000,3,0),0)","v":0}]
[null,null,null,null,null,{"$f":"IF(E213=0,\"\",VLOOKUP(E213,Sheet3!$A$3:$A$10000,1,0))","v":""},{"$f":"IFERROR(VLOOKUP(F213,Sheet3!$A$3:$C$10000,3,0),0)","v":0}]
[null,null,null,null,null,{"$f":"IF(E214=0,\"\",VLOOKUP(E214,Sheet3!$A$3:$A$10000,1,0))","v":""},{"$f":"IFERROR(VLOOKUP(F214,Sheet3!$A$3:$C$10000,3,0),0)","v":0}]
[null,null,null,null,null,{"$f":"IF(E215=0,\"\",VLOOKUP(E215,Sheet3!$A$3:$A$10000,1,0))","v":""},{"$f":"IFERROR(VLOOKUP(F215,Sheet3!$A$3:$C$10000,3,0),0)","v":0}]
[null,null,null,null,null,{"$f":"IF(E216=0,\"\",VLOOKUP(E216,Sheet3!$A$3:$A$10000,1,0))","v":""},{"$f":"IFERROR(VLOOKUP(F216,Sheet3!$A$3:$C$10000,3,0),0)","v":0}]
[null,null,null,null,null,{"$f":"IF(E217=0,\"\",VLOOKUP(E217,Sheet3!$A$3:$A$10000,1,0))","v":""},{"$f":"IFERROR(VLOOKUP(F217,Sheet3!$A$3:$C$10000,3,0),0)","v":0}]
[null,null,null,null,null,{"$f":"IF(E218=0,\"\",VLOOKUP(E218,Sheet3!$A$3:$A$10000,1,0))","v":""},{"$f":"IFERROR(VLOOKUP(F218,Sheet3!$A$3:$C$10000,3,0),0)","v":0}]
[null,null,null,null,null,{"$f":"IF(E219=0,\"\",VLOOKUP(E219,Sheet3!$A$3:$A$10000,1,0))","v":""},{"$f":"IFERROR(VLOOKUP(F219,Sheet3!$A$3:$C$10000,3,0),0)","v":0}]
[null,null,null,null,null,{"$f":"IF(E220=0,\"\",VLOOKUP(E220,Sheet3!$A$3:$A$10000,1,0))","v":""},{"$f":"IFERROR(VLOOKUP(F220,Sheet3!$A$3:$C$10000,3,0),0)","v":0}]
[null,null,null,null,null,{"$f":"IF(E221=0,\"\",VLOOKUP(E221,Sheet3!$A$3:$A$10000,1,0))","v":""},{"$f":"IFERROR(VLOOKUP(F221,Sheet3!$A$3:$C$10000,3,0),0)","v":0}]
[null,null,null,null,null,{"$f":"IF(E222=0,\"\",VLOOKUP(E222,Sheet3!$A$3:$A$10000,1,0))","v":""},{"$f":"IFERROR(VLOOKUP(F222,Sheet3!$A$3:$C$10000,3,0),0)","v":0}]
[null,null,null,null,null,{"$f":"IF(E223=0,\"\",VLOOKUP(E223,Sheet3!$A$3:$A$10000,1,0))","v":""},{"$f":"IFERROR(VLOOKUP(F223,Sheet3!$A$3:$C$10000,3,0),0)","v":0}]
[null,null,null,null,null,{"$f":"IF(E224=0,\"\",VLOOKUP(E224,Sheet3!$A$3:$A$10000,1,0))","v":""},{"$f":"IFERROR(VLOOKUP(F224,Sheet3!$A$3:$C$10000,3,0),0)","v":0}]
[null,null,null,null,null,{"$f":"IF(E225=0,\"\",VLOOKUP(E225,Sheet3!$A$3:$A$10000,1,0))","v":""},{"$f":"IFERROR(VLOOKUP(F225,Sheet3!$A$3:$C$10000,3,0),0)","v":0}]
[null,null,null,null,null,{"$f":"IF(E226=0,\"\",VLOOKUP(E226,Sheet3!$A$3:$A$10000,1,0))","v":""},{"$f":"IFERROR(VLOOKUP(F226,Sheet3!$A$3:$C$10000,3,0),0)","v":0}]
[null,null,null,null,null,{"$f":"IF(E227=0,\"\",VLOOKUP(E227,Sheet3!$A$3:$A$10000,1,0))","v":""},{"$f":"IFERROR(VLOOKUP(F227,Sheet3!$A$3:$C$10000,3,0),0)","v":0}]
[null,null,null,null,null,{"$f":"IF(E228=0,\"\",VLOOKUP(E228,Sheet3!$A$3:$A$10000,1,0))","v":""},{"$f":"IFERROR(VLOOKUP(F228,Sheet3!$A$3:$C$10000,3,0),0)","v":0}]
[null,null,null,null,null,{"$f":"IF(E229=0,\"\",VLOOKUP(E229,Sheet3!$A$3:$A$10000,1,0))","v":""},{"$f":"IFERROR(VLOOKUP(F229,Sheet3!$A$3:$C$10000,3,0),0)","v":0}]
[null,null,null,null,null,{"$f":"IF(E230=0,\"\",VLOOKUP(E230,Sheet3!$A$3:$A$10000,1,0))","v":""},{"$f":"IFERROR(VLOOKUP(F230,Sheet3!$A$3:$C$10000,3,0),0)","v":0}]
[null,null,null,null,null,{"$f":"IF(E231=0,\"\",VLOOKUP(E231,Sheet3!$A$3:$A$10000,1,0))","v":""},{"$f":"IFERROR(VLOOKUP(F231,Sheet3!$A$3:$C$10000,3,0),0)","v":0}]
[null,null,null,null,null,{"$f":"IF(E232=0,\"\",VLOOKUP(E232,Sheet3!$A$3:$A$10000,1,0))","v":""},{"$f":"IFERROR(VLOOKUP(F232,Sheet3!$A$3:$C$10000,3,0),0)","v":0}]
[null,null,null,null,null,{"$f":"IF(E233=0,\"\",VLOOKUP(E233,Sheet3!$A$3:$A$10000,1,0))","v":""},{"$f":"IFERROR(VLOOKUP(F233,Sheet3!$A$3:$C$10000,3,0),0)","v":0}]
[null,null,null,null,null,{"$f":"IF(E234=0,\"\",VLOOKUP(E234,Sheet3!$A$3:$A$10000,1,0))","v":""},{"$f":"IFERROR(VLOOKUP(F234,Sheet3!$A$3:$C$10000,3,0),0)","v":0}]
[null,null,null,null,null,{"$f":"IF(E235=0,\"\",VLOOKUP(E235,Sheet3!$A$3:$A$10000,1,0))","v":""},{"$f":"IFERROR(VLOOKUP(F235,Sheet3!$A$3:$C$10000,3,0),0)","v":0}]
[null,null,null,null,null,{"$f":"IF(E236=0,\"\",VLOOKUP(E236,Sheet3!$A$3:$A$10000,1,0))","v":""},{"$f":"IFERROR(VLOOKUP(F236,Sheet3!$A$3:$C$10000,3,0),0)","v":0}]
[null,null,null,null,null,{"$f":"IF(E237=0,\"\",VLOOKUP(E237,Sheet3!$A$3:$A$10000,1,0))","v":""},{"$f":"IFERROR(VLOOKUP(F237,Sheet3!$A$3:$C$10000,3,0),0)","v":0}]
[null,null,null,null,null,{"$f":"IF(E238=0,\"\",VLOOKUP(E238,Sheet3!$A$3:$A$10000,1,0))","v":""},{"$f":"IFERROR(VLOOKUP(F238,Sheet3!$A$3:$C$10000,3,0),0)","v":0}]
[null,null,null,null,null,{"$f":"IF(E239=0,\"\",VLOOKUP(E239,Sheet3!$A$3:$A$10000,1,0))","v":""},{"$f":"IFERROR(VLOOKUP(F239,Sheet3!$A$3:$C$10000,3,0),0)","v":0}]
[null,null,null,null,null,{"$f":"IF(E240=0,\"\",VLOOKUP(E240,Sheet3!$A$3:$A$10000,1,0))","v":""},{"$f":"IFERROR(VLOOKUP(F240,Sheet3!$A$3:$C$10000,3,0),0)","v":0}]
[null,null,null,null,null,{"$f":"IF(E241=0,\"\",VLOOKUP(E241,Sheet3!$A$3:$A$10000,1,0))","v":""},{"$f":"IFERROR(VLOOKUP(F241,Sheet3!$A$3:$C$10000,3,0),0)","v":0}]
[null,null,null,null,null,{"$f":"IF(E242=0,\"\",VLOOKUP(E242,Sheet3!$A$3:$A$10000,1,0))","v":""},{"$f":"IFERROR(VLOOKUP(F242,Sheet3!$A$3:$C$10000,3,0),0)","v":0}]
[null,null,null,null,null,{"$f":"IF(E243=0,\"\",VLOOKUP(E243,Sheet3!$A$3:$A$10000,1,0))","v":""},{"$f":"IFERROR(VLOOKUP(F243,Sheet3!$A$3:$C$10000,3,0),0)","v":0}]
[null,null,null,null,null,{"$f":"IF(E244=0,\"\",VLOOKUP(E244,Sheet3!$A$3:$A$10000,1,0))","v":""},{"$f":"IFERROR(VLOOKUP(F244,Sheet3!$A$3:$C$10000,3,0),0)","v":0}]
[null,null,null,null,null,{"$f":"IF(E245=0,\"\",VLOOKUP(E245,Sheet3!$A$3:$A$10000,1,0))","v":""},{"$f":"IFERROR(VLOOKUP(F245,Sheet3!$A$3:$C$10000,3,0),0)","v":0}]
[null,null,null,null,null,{"$f":"IF(E246=0,\"\",VLOOKUP(E246,Sheet3!$A$3:$A$10000,1,0))","v":""},{"$f":"IFERROR(VLOOKUP(F246,Sheet3!$A$3:$C$10000,3,0),0)","v":0}]
[null,null,null,null,null,{"$f":"IF(E247=0,\"\",VLOOKUP(E247,Sheet3!$A$3:$A$10000,1,0))","v":""},{"$f":"IFERROR(VLOOKUP(F247,Sheet3!$A$3:$C$10000,3,0),0)","v":0}]
[null,null,null,null,null,{"$f":"IF(E248=0,\"\",VLOOKUP(E248,Sheet3!$A$3:$A$10000,1,0))","v":""},{"$f":"IFERROR(VLOOKUP(F248,Sheet3!$A$3:$C$10000,3,0),0)","v":0}]
[null,null,null,null,null,{"$f":"IF(E249=0,\"\",VLOOKUP(E249,Sheet3!$A$3:$A$10000,1,0))","v":""},{"$f":"IFERROR(VLOOKUP(F249,Sheet3!$A$3:$C$10000,3,0),0)","v":0}]
[null,null,null,null,null,{"$f":"IF(E250=0,\"\",VLOOKUP(E250,Sheet3!$A$3:$A$10000,1,0))","v":""},{"$f":"IFERROR(VLOOKUP(F250,Sheet3!$A$3:$C$10000,3,0),0)","v":0}]
[null,null,null,null,null,{"$f":"IF(E251=0,\"\",VLOOKUP(E251,Sheet3!$A$3:$A$10000,1,0))","v":""},{"$f":"IFERROR(VLOOKUP(F251,Sheet3!$A$3:$C$10000,3,0),0)","v":0}]
[null,null,null,null,null,{"$f":"IF(E252=0,\"\",VLOOKUP(E252,Sheet3!$A$3:$A$10000,1,0))","v":""},{"$f":"IFERROR(VLOOKUP(F252,Sheet3!$A$3:$C$10000,3,0),0)","v":0}]
[null,null,null,null,null,{"$f":"IF(E253=0,\"\",VLOOKUP(E253,Sheet3!$A$3:$A$10000,1,0))","v":""},{"$f":"IFERROR(VLOOKUP(F253,Sheet3!$A$3:$C$10000,3,0),0)","v":0}]
[null,null,null,null,null,{"$f":"IF(E254=0,\"\",VLOOKUP(E254,Sheet3!$A$3:$A$10000,1,0))","v":""},{"$f":"IFERROR(VLOOKUP(F254,Sheet3!$A$3:$C$10000,3,0),0)","v":0}]
[null,null,null,null,null,{"$f":"IF(E255=0,\"\",VLOOKUP(E255,Sheet3!$A$3:$A$10000,1,0))","v":""},{"$f":"IFERROR(VLOOKUP(F255,Sheet3!$A$3:$C$10000,3,0),0)","v":0}]
[null,null,null,null,null,{"$f":"IF(E256=0,\"\",VLOOKUP(E256,Sheet3!$A$3:$A$10000,1,0))","v":""},{"$f":"IFERROR(VLOOKUP(F256,Sheet3!$A$3:$C$10000,3,0),0)","v":0}]
[null,null,null,null,null,{"$f":"IF(E257=0,\"\",VLOOKUP(E257,Sheet3!$A$3:$A$10000,1,0))","v":""},{"$f":"IFERROR(VLOOKUP(F257,Sheet3!$A$3:$C$10000,3,0),0)","v":0}]
[null,null,null,null,null,{"$f":"IF(E258=0,\"\",VLOOKUP(E258,Sheet3!$A$3:$A$10000,1,0))","v":""},{"$f":"IFERROR(VLOOKUP(F258,Sheet3!$A$3:$C$10000,3,0),0)","v":0}]
[null,null,null,null,null,{"$f":"IF(E259=0,\"\",VLOOKUP(E259,Sheet3!$A$3:$A$10000,1,0))","v":""},{"$f":"IFERROR(VLOOKUP(F259,Sheet3!$A$3:$C$10000,3,0),0)","v":0}]
[null,null,null,null,null,{"$f":"IF(E260=0,\"\",VLOOKUP(E260,Sheet3!$A$3:$A$10000,1,0))","v":""},{"$f":"IFERROR(VLOOKUP(F260,Sheet3!$A$3:$C$10000,3,0),0)","v":0}]
[null,null,null,null,null,{"$f":"IF(E261=0,\"\",VLOOKUP(E261,Sheet3!$A$3:$A$10000,1,0))","v":""},{"$f":"IFERROR(VLOOKUP(F261,Sheet3!$A$3:$C$10000,3,0),0)","v":0}]
[null,null,null,null,null,{"$f":"IF(E262=0,\"\",VLOOKUP(E262,Sheet3!$A$3:$A$10000,1,0))","v":""},{"$f":"IFERROR(VLOOKUP(F262,Sheet3!$A$3:$C$10000,3,0),0)","v":0}]
[null,null,null,null,null,{"$f":"IF(E263=0,\"\",VLOOKUP(E263,Sheet3!$A$3:$A$10000,1,0))","v":""},{"$f":"IFERROR(VLOOKUP(F263,Sheet3!$A$3:$C$10000,3,0),0)","v":0}]
[null,null,null,null,null,{"$f":"IF(E264=0,\"\",VLOOKUP(E264,Sheet3!$A$3:$A$10000,1,0))","v":""},{"$f":"IFERROR(VLOOKUP(F264,Sheet3!$A$3:$C$10000,3,0),0)","v":0}]
[null,null,null,null,null,{"$f":"IF(E265=0,\"\",VLOOKUP(E265,Sheet3!$A$3:$A$10000,1,0))","v":""},{"$f":"IFERROR(VLOOKUP(F265,Sheet3!$A$3:$C$10000,3,0),0)","v":0}]
[null,null,null,null,null,{"$f":"IF(E266=0,\"\",VLOOKUP(E266,Sheet3!$A$3:$A$10000,1,0))","v":""},{"$f":"IFERROR(VLOOKUP(F266,Sheet3!$A$3:$C$10000,3,0),0)","v":0}]
[null,null,null,null,null,{"$f":"IF(E267=0,\"\",VLOOKUP(E267,Sheet3!$A$3:$A$10000,1,0))","v":""},{"$f":"IFERROR(VLOOKUP(F267,Sheet3!$A$3:$C$10000,3,0),0)","v":0}]
[null,null,null,null,null,{"$f":"IF(E268=0,\"\",VLOOKUP(E268,Sheet3!$A$3:$A$10000,1,0))","v":""},{"$f":"IFERROR(VLOOKUP(F268,Sheet3!$A$3:$C$10000,3,0),0)","v":0}]
[null,null,null,null,null,{"$f":"IF(E269=0,\"\",VLOOKUP(E269,Sheet3!$A$3:$A$10000,1,0))","v":""},{"$f":"IFERROR(VLOOKUP(F269,Sheet3!$A$3:$C$10000,3,0),0)","v":0}]
[null,null,null,null,null,{"$f":"IF(E270=0,\"\",VLOOKUP(E270,Sheet3!$A$3:$A$10000,1,0))","v":""},{"$f":"IFERROR(VLOOKUP(F270,Sheet3!$A$3:$C$10000,3,0),0)","v":0}]
[null,null,null,null,null,{"$f":"IF(E271=0,\"\",VLOOKUP(E271,Sheet3!$A$3:$A$10000,1,0))","v":""},{"$f":"IFERROR(VLOOKUP(F271,Sheet3!$A$3:$C$10000,3,0),0)","v":0}]
[null,null,null,null,null,{"$f":"IF(E272=0,\"\",VLOOKUP(E272,Sheet3!$A$3:$A$10000,1,0))","v":""},{"$f":"IFERROR(VLOOKUP(F272,Sheet3!$A$3:$C$10000,3,0),0)","v":0}]
[null,null,null,null,null,{"$f":"IF(E273=0,\"\",VLOOKUP(E273,Sheet3!$A$3:$A$10000,1,0))","v":""},{"$f":"IFERROR(VLOOKUP(F273,Sheet3!$A$3:$C$10000,3,0),0)","v":0}]
[null,null,null,null,null,{"$f":"IF(E274=0,\"\",VLOOKUP(E274,Sheet3!$A$3:$A$10000,1,0))","v":""},{"$f":"IFERROR(VLOOKUP(F274,Sheet3!$A$3:$C$10000,3,0),0)","v":0}]
[null,null,null,null,null,{"$f":"IF(E275=0,\"\",VLOOKUP(E275,Sheet3!$A$3:$A$10000,1,0))","v":""},{"$f":"IFERROR(VLOOKUP(F275,Sheet3!$A$3:$C$10000,3,0),0)","v":0}]
[null,null,null,null,null,{"$f":"IF(E276=0,\"\",VLOOKUP(E276,Sheet3!$A$3:$A$10000,1,0))","v":""},{"$f":"IFERROR(VLOOKUP(F276,Sheet3!$A$3:$C$10000,3,0),0)","v":0}]
[null,null,null,null,null,{"$f":"IF(E277=0,\"\",VLOOKUP(E277,Sheet3!$A$3:$A$10000,1,0))","v":""},{"$f":"IFERROR(VLOOKUP(F277,Sheet3!$A$3:$C$10000,3,0),0)","v":0}]
[null,null,null,null,null,{"$f":"IF(E278=0,\"\",VLOOKUP(E278,Sheet3!$A$3:$A$10000,1,0))","v":""},{"$f":"IFERROR(VLOOKUP(F278,Sheet3!$A$3:$C$10000,3,0),0)","v":0}]
[null,null,null,null,null,{"$f":"IF(E279=0,\"\",VLOOKUP(E279,Sheet3!$A$3:$A$10000,1,0))","v":""},{"$f":"IFERROR(VLOOKUP(F279,Sheet3!$A$3:$C$10000,3,0),0)","v":0}]
[null,null,null,null,null,{"$f":"IF(E280=0,\"\",VLOOKUP(E280,Sheet3!$A$3:$A$10000,1,0))","v":""},{"$f":"IFERROR(VLOOKUP(F280,Sheet3!$A$3:$C$10000,3,0),0)","v":0}]
[null,null,null,null,null,{"$f":"IF(E281=0,\"\",VLOOKUP(E281,Sheet3!$A$3:$A$10000,1,0))","v":""},{"$f":"IFERROR(VLOOKUP(F281,Sheet3!$A$3:$C$10000,3,0),0)","v":0}]
[null,null,null,null,null,{"$f":"IF(E282=0,\"\",VLOOKUP(E282,Sheet3!$A$3:$A$10000,1,0))","v":""},{"$f":"IFERROR(VLOOKUP(F282,Sheet3!$A$3:$C$10000,3,0),0)","v":0}]
[null,null,null,null,null,{"$f":"IF(E283=0,\"\",VLOOKUP(E283,Sheet3!$A$3:$A$10000,1,0))","v":""},{"$f":"IFERROR(VLOOKUP(F283,Sheet3!$A$3:$C$10000,3,0),0)","v":0}]
[null,null,null,null,null,{"$f":"IF(E284=0,\"\",VLOOKUP(E284,Sheet3!$A$3:$A$10000,1,0))","v":""},{"$f":"IFERROR(VLOOKUP(F284,Sheet3!$A$3:$C$10000,3,0),0)","v":0}]
[null,null,null,null,null,{"$f":"IF(E285=0,\"\",VLOOKUP(E285,Sheet3!$A$3:$A$10000,1,0))","v":""},{"$f":"IFERROR(VLOOKUP(F285,Sheet3!$A$3:$C$10000,3,0),0)","v":0}]
[null,null,null,null,null,{"$f":"IF(E286=0,\"\",VLOOKUP(E286,Sheet3!$A$3:$A$10000,1,0))","v":""},{"$f":"IFERROR(VLOOKUP(F286,Sheet3!$A$3:$C$10000,3,0),0)","v":0}]
[null,null,null,null,null,{"$f":"IF(E287=0,\"\",VLOOKUP(E287,Sheet3!$A$3:$A$10000,1,0))","v":""},{"$f":"IFERROR(VLOOKUP(F287,Sheet3!$A$3:$C$10000,3,0),0)","v":0}]
[null,null,null,null,null,{"$f":"IF(E288=0,\"\",VLOOKUP(E288,Sheet3!$A$3:$A$10000,1,0))","v":""},{"$f":"IFERROR(VLOOKUP(F288,Sheet3!$A$3:$C$10000,3,0),0)","v":0}]
[null,null,null,null,null,{"$f":"IF(E289=0,\"\",VLOOKUP(E289,Sheet3!$A$3:$A$10000,1,0))","v":""},{"$f":"IFERROR(VLOOKUP(F289,Sheet3!$A$3:$C$10000,3,0),0)","v":0}]
[null,null,null,null,null,{"$f":"IF(E290=0,\"\",VLOOKUP(E290,Sheet3!$A$3:$A$10000,1,0))","v":""},{"$f":"IFERROR(VLOOKUP(F290,Sheet3!$A$3:$C$10000,3,0),0)","v":0}]
[null,null,null,null,null,{"$f":"IF(E291=0,\"\",VLOOKUP(E291,Sheet3!$A$3:$A$10000,1,0))","v":""},{"$f":"IFERROR(VLOOKUP(F291,Sheet3!$A$3:$C$10000,3,0),0)","v":0}]
[null,null,null,null,null,{"$f":"IF(E292=0,\"\",VLOOKUP(E292,Sheet3!$A$3:$A$10000,1,0))","v":""},{"$f":"IFERROR(VLOOKUP(F292,Sheet3!$A$3:$C$10000,3,0),0)","v":0}]
[null,null,null,null,null,{"$f":"IF(E293=0,\"\",VLOOKUP(E293,Sheet3!$A$3:$A$10000,1,0))","v":""},{"$f":"IFERROR(VLOOKUP(F293,Sheet3!$A$3:$C$10000,3,0),0)","v":0}]
[null,null,null,null,null,{"$f":"IF(E294=0,\"\",VLOOKUP(E294,Sheet3!$A$3:$A$10000,1,0))","v":""},{"$f":"IFERROR(VLOOKUP(F294,Sheet3!$A$3:$C$10000,3,0),0)","v":0}]
[null,null,null,null,null,{"$f":"IF(E295=0,\"\",VLOOKUP(E295,Sheet3!$A$3:$A$10000,1,0))","v":""},{"$f":"IFERROR(VLOOKUP(F295,Sheet3!$A$3:$C$10000,3,0),0)","v":0}]
[null,null,null,null,null,{"$f":"IF(E296=0,\"\",VLOOKUP(E296,Sheet3!$A$3:$A$10000,1,0))","v":""},{"$f":"IFERROR(VLOOKUP(F296,Sheet3!$A$3:$C$10000,3,0),0)","v":0}]
[null,null,null,null,null,{"$f":"IF(E297=0,\"\",VLOOKUP(E297,Sheet3!$A$3:$A$10000,1,0))","v":""},{"$f":"IFERROR(VLOOKUP(F297,Sheet3!$A$3:$C$10000,3,0),0)","v":0}]
[null,null,null,null,null,{"$f":"IF(E298=0,\"\",VLOOKUP(E298,Sheet3!$A$3:$A$10000,1,0))","v":""},{"$f":"IFERROR(VLOOKUP(F298,Sheet3!$A$3:$C$10000,3,0),0)","v":0}]
[null,null,null,null,null,{"$f":"IF(E299=0,\"\",VLOOKUP(E299,Sheet3!$A$3:$A$10000,1,0))","v":""},{"$f":"IFERROR(VLOOKUP(F299,Sheet3!$A$3:$C$10000,3,0),0)","v":0}]
[null,null,null,null,null,{"$f":"IF(E300=0,\"\",VLOOKUP(E300,Sheet3!$A$3:$A$10000,1,0))","v":""},{"$f":"IFERROR(VLOOKUP(F300,Sheet3!$A$3:$C$10000,3,0),0)","v":0}]
[null,null,null,null,null,{"$f":"IF(E301=0,\"\",VLOOKUP(E301,Sheet3!$A$3:$A$10000,1,0))","v":""},{"$f":"IFERROR(VLOOKUP(F301,Sheet3!$A$3:$C$10000,3,0),0)","v":0}]
[null,null,null,null,null,{"$f":"IF(E302=0,\"\",VLOOKUP(E302,Sheet3!$A$3:$A$10000,1,0))","v":""},{"$f":"IFERROR(VLOOKUP(F302,Sheet3!$A$3:$C$10000,3,0),0)","v":0}]
[null,null,null,null,null,{"$f":"IF(E303=0,\"\",VLOOKUP(E303,Sheet3!$A$3:$A$10000,1,0))","v":""},{"$f":"IFERROR(VLOOKUP(F303,Sheet3!$A$3:$C$10000,3,0),0)","v":0}]
[null,null,null,null,null,{"$f":"IF(E304=0,\"\",VLOOKUP(E304,Sheet3!$A$3:$A$10000,1,0))","v":""},{"$f":"IFERROR(VLOOKUP(F304,Sheet3!$A$3:$C$10000,3,0),0)","v":0}]
[null,null,null,null,null,{"$f":"IF(E305=0,\"\",VLOOKUP(E305,Sheet3!$A$3:$A$10000,1,0))","v":""},{"$f":"IFERROR(VLOOKUP(F305,Sheet3!$A$3:$C$10000,3,0),0)","v":0}]
[null,null,null,null,null,{"$f":"IF(E306=0,\"\",VLOOKUP(E306,Sheet3!$A$3:$A$10000,1,0))","v":""},{"$f":"IFERROR(VLOOKUP(F306,Sheet3!$A$3:$C$10000,3,0),0)","v":0}]
[null,null,null,null,null,{"$f":"IF(E307=0,\"\",VLOOKUP(E307,Sheet3!$A$3:$A$10000,1,0))","v":""},{"$f":"IFERROR(VLOOKUP(F307,Sheet3!$A$3:$C$10000,3,0),0)","v":0}]
[null,null,null,null,null,{"$f":"IF(E308=0,\"\",VLOOKUP(E308,Sheet3!$A$3:$A$10000,1,0))","v":""},{"$f":"IFERROR(VLOOKUP(F308,Sheet3!$A$3:$C$10000,3,0),0)","v":0}]
[null,null,null,null,null,{"$f":"IF(E309=0,\"\",VLOOKUP(E309,Sheet3!$A$3:$A$10000,1,0))","v":""},{"$f":"IFERROR(VLOOKUP(F309,Sheet3!$A$3:$C$10000,3,0),0)","v":0}]
[null,null,null,null,null,{"$f":"IF(E310=0,\"\",VLOOKUP(E310,Sheet3!$A$3:$A$10000,1,0))","v":""},{"$f":"IFERROR(VLOOKUP(F310,Sheet3!$A$3:$C$10000,3,0),0)","v":0}]
[null,null,null,null,null,{"$f":"IF(E311=0,\"\",VLOOKUP(E311,Sheet3!$A$3:$A$10000,1,0))","v":""},{"$f":"IFERROR(VLOOKUP(F311,Sheet3!$A$3:$C$10000,3,0),0)","v":0}]
[null,null,null,null,null,{"$f":"IF(E312=0,\"\",VLOOKUP(E312,Sheet3!$A$3:$A$10000,1,0))","v":""},{"$f":"IFERROR(VLOOKUP(F312,Sheet3!$A$3:$C$10000,3,0),0)","v":0}]
[null,null,null,null,null,{"$f":"IF(E313=0,\"\",VLOOKUP(E313,Sheet3!$A$3:$A$10000,1,0))","v":""},{"$f":"IFERROR(VLOOKUP(F313,Sheet3!$A$3:$C$10000,3,0),0)","v":0}]
[null,null,null,null,null,{"$f":"IF(E314=0,\"\",VLOOKUP(E314,Sheet3!$A$3:$A$10000,1,0))","v":""},{"$f":"IFERROR(VLOOKUP(F314,Sheet3!$A$3:$C$10000,3,0),0)","v":0}]
[null,null,null,null,null,{"$f":"IF(E315=0,\"\",VLOOKUP(E315,Sheet3!$A$3:$A$10000,1,0))","v":""},{"$f":"IFERROR(VLOOKUP(F315,Sheet3!$A$3:$C$10000,3,0),0)","v":0}]
[null,null,null,null,null,{"$f":"IF(E316=0,\"\",VLOOKUP(E316,Sheet3!$A$3:$A$10000,1,0))","v":""},{"$f":"IFERROR(VLOOKUP(F316,Sheet3!$A$3:$C$10000,3,0),0)","v":0}]
[null,null,null,null,null,{"$f":"IF(E317=0,\"\",VLOOKUP(E317,Sheet3!$A$3:$A$10000,1,0))","v":""},{"$f":"IFERROR(VLOOKUP(F317,Sheet3!$A$3:$C$10000,3,0),0)","v":0}]
[null,null,null,null,null,{"$f":"IF(E318=0,\"\",VLOOKUP(E318,Sheet3!$A$3:$A$10000,1,0))","v":""},{"$f":"IFERROR(VLOOKUP(F318,Sheet3!$A$3:$C$10000,3,0),0)","v":0}]
[null,null,null,null,null,{"$f":"IF(E319=0,\"\",VLOOKUP(E319,Sheet3!$A$3:$A$10000,1,0))","v":""},{"$f":"IFERROR(VLOOKUP(F319,Sheet3!$A$3:$C$10000,3,0),0)","v":0}]
[null,null,null,null,null,{"$f":"IF(E320=0,\"\",VLOOKUP(E320,Sheet3!$A$3:$A$10000,1,0))","v":""},{"$f":"IFERROR(VLOOKUP(F320,Sheet3!$A$3:$C$10000,3,0),0)","v":0}]
[null,null,null,null,null,{"$f":"IF(E321=0,\"\",VLOOKUP(E321,Sheet3!$A$3:$A$10000,1,0))","v":""},{"$f":"IFERROR(VLOOKUP(F321,Sheet3!$A$3:$C$10000,3,0),0)","v":0}]
[null,null,null,null,null,{"$f":"IF(E322=0,\"\",VLOOKUP(E322,Sheet3!$A$3:$A$10000,1,0))","v":""},{"$f":"IFERROR(VLOOKUP(F322,Sheet3!$A$3:$C$10000,3,0),0)","v":0}]
[null,null,null,null,null,{"$f":"IF(E323=0,\"\",VLOOKUP(E323,Sheet3!$A$3:$A$10000,1,0))","v":""},{"$f":"IFERROR(VLOOKUP(F323,Sheet3!$A$3:$C$10000,3,0),0)","v":0}]
[null,null,null,null,null,{"$f":"IF(E324=0,\"\",VLOOKUP(E324,Sheet3!$A$3:$A$10000,1,0))","v":""},{"$f":"IFERROR(VLOOKUP(F324,Sheet3!$A$3:$C$10000,3,0),0)","v":0}]
[null,null,null,null,null,{"$f":"IF(E325=0,\"\",VLOOKUP(E325,Sheet3!$A$3:$A$10000,1,0))","v":""},{"$f":"IFERROR(VLOOKUP(F325,Sheet3!$A$3:$C$10000,3,0),0)","v":0}]
[null,null,null,null,null,{"$f":"IF(E326=0,\"\",VLOOKUP(E326,Sheet3!$A$3:$A$10000,1,0))","v":""},{"$f":"IFERROR(VLOOKUP(F326,Sheet3!$A$3:$C$10000,3,0),0)","v":0}]
[null,null,null,null,null,{"$f":"IF(E327=0,\"\",VLOOKUP(E327,Sheet3!$A$3:$A$10000,1,0))","v":""},{"$f":"IFERROR(VLOOKUP(F327,Sheet3!$A$3:$C$10000,3,0),0)","v":0}]
[null,null,null,null,null,{"$f":"IF(E328=0,\"\",VLOOKUP(E328,Sheet3!$A$3:$A$10000,1,0))","v":""},{"$f":"IFERROR(VLOOKUP(F328,Sheet3!$A$3:$C$10000,3,0),0)","v":0}]
[null,null,null,null,null,{"$f":"IF(E329=0,\"\",VLOOKUP(E329,Sheet3!$A$3:$A$10000,1,0))","v":""},{"$f":"IFERROR(VLOOKUP(F329,Sheet3!$A$3:$C$10000,3,0),0)","v":0}]
[null,null,null,null,null,{"$f":"IF(E330=0,\"\",VLOOKUP(E330,Sheet3!$A$3:$A$10000,1,0))","v":""},{"$f":"IFERROR(VLOOKUP(F330,Sheet3!$A$3:$C$10000,3,0),0)","v":0}]
[null,null,null,null,null,{"$f":"IF(E331=0,\"\",VLOOKUP(E331,Sheet3!$A$3:$A$10000,1,0))","v":""},{"$f":"IFERROR(VLOOKUP(F331,Sheet3!$A$3:$C$10000,3,0),0)","v":0}]
[null,null,null,null,null,{"$f":"IF(E332=0,\"\",VLOOKUP(E332,Sheet3!$A$3:$A$10000,1,0))","v":""},{"$f":"IFERROR(VLOOKUP(F332,Sheet3!$A$3:$C$10000,3,0),0)","v":0}]
[null,null,null,null,null,{"$f":"IF(E333=0,\"\",VLOOKUP(E333,Sheet3!$A$3:$A$10000,1,0))","v":""},{"$f":"IFERROR(VLOOKUP(F333,Sheet3!$A$3:$C$10000,3,0),0)","v":0}]
[null,null,null,null,null,{"$f":"IF(E334=0,\"\",VLOOKUP(E334,Sheet3!$A$3:$A$10000,1,0))","v":""},{"$f":"IFERROR(VLOOKUP(F334,Sheet3!$A$3:$C$10000,3,0),0)","v":0}]
[null,null,null,null,null,{"$f":"IF(E335=0,\"\",VLOOKUP(E335,Sheet3!$A$3:$A$10000,1,0))","v":""},{"$f":"IFERROR(VLOOKUP(F335,Sheet3!$A$3:$C$10000,3,0),0)","v":0}]
[null,null,null,null,null,{"$f":"IF(E336=0,\"\",VLOOKUP(E336,Sheet3!$A$3:$A$10000,1,0))","v":""},{"$f":"IFERROR(VLOOKUP(F336,Sheet3!$A$3:$C$10000,3,0),0)","v":0}]
[null,null,null,null,null,{"$f":"IF(E337=0,\"\",VLOOKUP(E337,Sheet3!$A$3:$A$10000,1,0))","v":""},{"$f":"IFERROR(VLOOKUP(F337,Sheet3!$A$3:$C$10000,3,0),0)","v":0}]
[null,null,null,null,null,{"$f":"IF(E338=0,\"\",VLOOKUP(E338,Sheet3!$A$3:$A$10000,1,0))","v":""},{"$f":"IFERROR(VLOOKUP(F338,Sheet3!$A$3:$C$10000,3,0),0)","v":0}]
[null,null,null,null,null,{"$f":"IF(E339=0,\"\",VLOOKUP(E339,Sheet3!$A$3:$A$10000,1,0))","v":""},{"$f":"IFERROR(VLOOKUP(F339,Sheet3!$A$3:$C$10000,3,0),0)","v":0}]
[null,null,null,null,null,{"$f":"IF(E340=0,\"\",VLOOKUP(E340,Sheet3!$A$3:$A$10000,1,0))","v":""},{"$f":"IFERROR(VLOOKUP(F340,Sheet3!$A$3:$C$10000,3,0),0)","v":0}]
[null,null,null,null,null,{"$f":"IF(E341=0,\"\",VLOOKUP(E341,Sheet3!$A$3:$A$10000,1,0))","v":""},{"$f":"IFERROR(VLOOKUP(F341,Sheet3!$A$3:$C$10000,3,0),0)","v":0}]
[null,null,null,null,null,{"$f":"IF(E342=0,\"\",VLOOKUP(E342,Sheet3!$A$3:$A$10000,1,0))","v":""},{"$f":"IFERROR(VLOOKUP(F342,Sheet3!$A$3:$C$10000,3,0),0)","v":0}]
[null,null,null,null,null,{"$f":"IF(E343=0,\"\",VLOOKUP(E343,Sheet3!$A$3:$A$10000,1,0))","v":""},{"$f":"IFERROR(VLOOKUP(F343,Sheet3!$A$3:$C$10000,3,0),0)","v":0}]
[null,null,null,null,null,{"$f":"IF(E344=0,\"\",VLOOKUP(E344,Sheet3!$A$3:$A$10000,1,0))","v":""},{"$f":"IFERROR(VLOOKUP(F344,Sheet3!$A$3:$C$10000,3,0),0)","v":0}]
[null,null,null,null,null,{"$f":"IF(E345=0,\"\",VLOOKUP(E345,Sheet3!$A$3:$A$10000,1,0))","v":""},{"$f":"IFERROR(VLOOKUP(F345,Sheet3!$A$3:$C$10000,3,0),0)","v":0}]
[null,null,null,null,null,{"$f":"IF(E346=0,\"\",VLOOKUP(E346,Sheet3!$A$3:$A$10000,1,0))","v":""},{"$f":"IFERROR(VLOOKUP(F346,Sheet3!$A$3:$C$10000,3,0),0)","v":0}]
[null,null,null,null,null,{"$f":"IF(E347=0,\"\",VLOOKUP(E347,Sheet3!$A$3:$A$10000,1,0))","v":""},{"$f":"IFERROR(VLOOKUP(F347,Sheet3!$A$3:$C$10000,3,0),0)","v":0}]
[null,null,null,null,null,{"$f":"IF(E348=0,\"\",VLOOKUP(E348,Sheet3!$A$3:$A$10000,1,0))","v":""},{"$f":"IFERROR(VLOOKUP(F348,Sheet3!$A$3:$C$10000,3,0),0)","v":0}]
[null,null,null,null,null,{"$f":"IF(E349=0,\"\",VLOOKUP(E349,Sheet3!$A$3:$A$10000,1,0))","v":""},{"$f":"IFERROR(VLOOKUP(F349,Sheet3!$A$3:$C$10000,3,0),0)","v":0}]
[null,null,null,null,null,{"$f":"IF(E350=0,\"\",VLOOKUP(E350,Sheet3!$A$3:$A$10000,1,0))","v":""},{"$f":"IFERROR(VLOOKUP(F350,Sheet3!$A$3:$C$10000,3,0),0)","v":0}]
[null,null,null,null,null,{"$f":"IF(E351=0,\"\",VLOOKUP(E351,Sheet3!$A$3:$A$10000,1,0))","v":""},{"$f":"IFERROR(VLOOKUP(F351,Sheet3!$A$3:$C$10000,3,0),0)","v":0}]
[null,null,null,null,null,{"$f":"IF(E352=0,\"\",VLOOKUP(E352,Sheet3!$A$3:$A$10000,1,0))","v":""},{"$f":"IFERROR(VLOOKUP(F352,Sheet3!$A$3:$C$10000,3,0),0)","v":0}]
[null,null,null,null,null,{"$f":"IF(E353=0,\"\",VLOOKUP(E353,Sheet3!$A$3:$A$10000,1,0))","v":""},{"$f":"IFERROR(VLOOKUP(F353,Sheet3!$A$3:$C$10000,3,0),0)","v":0}]
[null,null,null,null,null,{"$f":"IF(E354=0,\"\",VLOOKUP(E354,Sheet3!$A$3:$A$10000,1,0))","v":""},{"$f":"IFERROR(VLOOKUP(F354,Sheet3!$A$3:$C$10000,3,0),0)","v":0}]
[null,null,null,null,null,{"$f":"IF(E355=0,\"\",VLOOKUP(E355,Sheet3!$A$3:$A$10000,1,0))","v":""},{"$f":"IFERROR(VLOOKUP(F355,Sheet3!$A$3:$C$10000,3,0),0)","v":0}]
[null,null,null,null,null,{"$f":"IF(E356=0,\"\",VLOOKUP(E356,Sheet3!$A$3:$A$10000,1,0))","v":""},{"$f":"IFERROR(VLOOKUP(F356,Sheet3!$A$3:$C$10000,3,0),0)","v":0}]
[null,null,null,null,null,{"$f":"IF(E357=0,\"\",VLOOKUP(E357,Sheet3!$A$3:$A$10000,1,0))","v":""},{"$f":"IFERROR(VLOOKUP(F357,Sheet3!$A$3:$C$10000,3,0),0)","v":0}]
[null,null,null,null,null,{"$f":"IF(E358=0,\"\",VLOOKUP(E358,Sheet3!$A$3:$A$10000,1,0))","v":""},{"$f":"IFERROR(VLOOKUP(F358,Sheet3!$A$3:$C$10000,3,0),0)","v":0}]
[null,null,null,null,null,{"$f":"IF(E359=0,\"\",VLOOKUP(E359,Sheet3!$A$3:$A$10000,1,0))","v":""},{"$f":"IFERROR(VLOOKUP(F359,Sheet3!$A$3:$C$10000,3,0),0)","v":0}]
[null,null,null,null,null,{"$f":"IF(E360=0,\"\",VLOOKUP(E360,Sheet3!$A$3:$A$10000,1,0))","v":""},{"$f":"IFERROR(VLOOKUP(F360,Sheet3!$A$3:$C$10000,3,0),0)","v":0}]
[null,null,null,null,null,{"$f":"IF(E361=0,\"\",VLOOKUP(E361,Sheet3!$A$3:$A$10000,1,0))","v":""},{"$f":"IFERROR(VLOOKUP(F361,Sheet3!$A$3:$C$10000,3,0),0)","v":0}]
[null,null,null,null,null,{"$f":"IF(E362=0,\"\",VLOOKUP(E362,Sheet3!$A$3:$A$10000,1,0))","v":""},{"$f":"IFERROR(VLOOKUP(F362,Sheet3!$A$3:$C$10000,3,0),0)","v":0}]
[null,null,null,null,null,{"$f":"IF(E363=0,\"\",VLOOKUP(E363,Sheet3!$A$3:$A$10000,1,0))","v":""},{"$f":"IFERROR(VLOOKUP(F363,Sheet3!$A$3:$C$10000,3,0),0)","v":0}]
[null,null,null,null,null,{"$f":"IF(E364=0,\"\",VLOOKUP(E364,Sheet3!$A$3:$A$10000,1,0))","v":""},{"$f":"IFERROR(VLOOKUP(F364,Sheet3!$A$3:$C$10000,3,0),0)","v":0}]
[null,null,null,null,null,{"$f":"IF(E365=0,\"\",VLOOKUP(E365,Sheet3!$A$3:$A$10000,1,0))","v":""},{"$f":"IFERROR(VLOOKUP(F365,Sheet3!$A$3:$C$10000,3,0),0)","v":0}]
[null,null,null,null,null,{"$f":"IF(E366=0,\"\",VLOOKUP(E366,Sheet3!$A$3:$A$10000,1,0))","v":""},{"$f":"IFERROR(VLOOKUP(F366,Sheet3!$A$3:$C$10000,3,0),0)","v":0}]
[null,null,null,null,null,{"$f":"IF(E367=0,\"\",VLOOKUP(E367,Sheet3!$A$3:$A$10000,1,0))","v":""},{"$f":"IFERROR(VLOOKUP(F367,Sheet3!$A$3:$C$10000,3,0),0)","v":0}]
[null,null,null,null,null,{"$f":"IF(E368=0,\"\",VLOOKUP(E368,Sheet3!$A$3:$A$10000,1,0))","v":""},{"$f":"IFERROR(VLOOKUP(F368,Sheet3!$A$3:$C$10000,3,0),0)","v":0}]
[null,null,null,null,null,{"$f":"IF(E369=0,\"\",VLOOKUP(E369,Sheet3!$A$3:$A$10000,1,0))","v":""},{"$f":"IFERROR(VLOOKUP(F369,Sheet3!$A$3:$C$10000,3,0),0)","v":0}]
[null,null,null,null,null,{"$f":"IF(E370=0,\"\",VLOOKUP(E370,Sheet3!$A$3:$A$10000,1,0))","v":""},{"$f":"IFERROR(VLOOKUP(F370,Sheet3!$A$3:$C$10000,3,0),0)","v":0}]
[null,null,null,null,null,{"$f":"IF(E371=0,\"\",VLOOKUP(E371,Sheet3!$A$3:$A$10000,1,0))","v":""},{"$f":"IFERROR(VLOOKUP(F371,Sheet3!$A$3:$C$10000,3,0),0)","v":0}]
[null,null,null,null,null,{"$f":"IF(E372=0,\"\",VLOOKUP(E372,Sheet3!$A$3:$A$10000,1,0))","v":""},{"$f":"IFERROR(VLOOKUP(F372,Sheet3!$A$3:$C$10000,3,0),0)","v":0}]
[null,null,null,null,null,{"$f":"IF(E373=0,\"\",VLOOKUP(E373,Sheet3!$A$3:$A$10000,1,0))","v":""},{"$f":"IFERROR(VLOOKUP(F373,Sheet3!$A$3:$C$10000,3,0),0)","v":0}]
[null,null,null,null,null,{"$f":"IF(E374=0,\"\",VLOOKUP(E374,Sheet3!$A$3:$A$10000,1,0))","v":""},{"$f":"IFERROR(VLOOKUP(F374,Sheet3!$A$3:$C$10000,3,0),0)","v":0}]
[null,null,null,null,null,{"$f":"IF(E375=0,\"\",VLOOKUP(E375,Sheet3!$A$3:$A$10000,1,0))","v":""},{"$f":"IFERROR(VLOOKUP(F375,Sheet3!$A$3:$C$10000,3,0),0)","v":0}]
[null,null,null,null,null,{"$f":"IF(E376=0,\"\",VLOOKUP(E376,Sheet3!$A$3:$A$10000,1,0))","v":""},{"$f":"IFERROR(VLOOKUP(F376,Sheet3!$A$3:$C$10000,3,0),0)","v":0}]
[null,null,null,null,null,{"$f":"IF(E377=0,\"\",VLOOKUP(E377,Sheet3!$A$3:$A$10000,1,0))","v":""},{"$f":"IFERROR(VLOOKUP(F377,Sheet3!$A$3:$C$10000,3,0),0)","v":0}]
[null,null,null,null,null,{"$f":"IF(E378=0,\"\",VLOOKUP(E378,Sheet3!$A$3:$A$10000,1,0))","v":""},{"$f":"IFERROR(VLOOKUP(F378,Sheet3!$A$3:$C$10000,3,0),0)","v":0}]
[null,null,null,null,null,{"$f":"IF(E379=0,\"\",VLOOKUP(E379,Sheet3!$A$3:$A$10000,1,0))","v":""},{"$f":"IFERROR(VLOOKUP(F379,Sheet3!$A$3:$C$10000,3,0),0)","v":0}]
[null,null,null,null,null,{"$f":"IF(E380=0,\"\",VLOOKUP(E380,Sheet3!$A$3:$A$10000,1,0))","v":""},{"$f":"IFERROR(VLOOKUP(F380,Sheet3!$A$3:$C$10000,3,0),0)","v":0}]
[null,null,null,null,null,{"$f":"IF(E381=0,\"\",VLOOKUP(E381,Sheet3!$A$3:$A$10000,1,0))","v":""},{"$f":"IFERROR(VLOOKUP(F381,Sheet3!$A$3:$C$10000,3,0),0)","v":0}]
[null,null,null,null,null,{"$f":"IF(E382=0,\"\",VLOOKUP(E382,Sheet3!$A$3:$A$10000,1,0))","v":""},{"$f":"IFERROR(VLOOKUP(F382,Sheet3!$A$3:$C$10000,3,0),0)","v":0}]
[null,null,null,null,null,{"$f":"IF(E383=0,\"\",VLOOKUP(E383,Sheet3!$A$3:$A$10000,1,0))","v":""},{"$f":"IFERROR(VLOOKUP(F383,Sheet3!$A$3:$C$10000,3,0),0)","v":0}]
[null,null,null,null,null,{"$f":"IF(E384=0,\"\",VLOOKUP(E384,Sheet3!$A$3:$A$10000,1,0))","v":""},{"$f":"IFERROR(VLOOKUP(F384,Sheet3!$A$3:$C$10000,3,0),0)","v":0}]
[null,null,null,null,null,{"$f":"IF(E385=0,\"\",VLOOKUP(E385,Sheet3!$A$3:$A$10000,1,0))","v":""},{"$f":"IFERROR(VLOOKUP(F385,Sheet3!$A$3:$C$10000,3,0),0)","v":0}]
[null,null,null,null,null,{"$f":"IF(E386=0,\"\",VLOOKUP(E386,Sheet3!$A$3:$A$10000,1,0))","v":""},{"$f":"IFERROR(VLOOKUP(F386,Sheet3!$A$3:$C$10000,3,0),0)","v":0}]
[null,null,null,null,null,{"$f":"IF(E387=0,\"\",VLOOKUP(E387,Sheet3!$A$3:$A$10000,1,0))","v":""},{"$f":"IFERROR(VLOOKUP(F387,Sheet3!$A$3:$C$10000,3,0),0)","v":0}]
[null,null,null,null,null,{"$f":"IF(E388=0,\"\",VLOOKUP(E388,Sheet3!$A$3:$A$10000,1,0))","v":""},{"$f":"IFERROR(VLOOKUP(F388,Sheet3!$A$3:$C$10000,3,0),0)","v":0}]
[null,null,null,null,null,{"$f":"IF(E389=0,\"\",VLOOKUP(E389,Sheet3!$A$3:$A$10000,1,0))","v":""},{"$f":"IFERROR(VLOOKUP(F389,Sheet3!$A$3:$C$10000,3,0),0)","v":0}]
[null,null,null,null,null,{"$f":"IF(E390=0,\"\",VLOOKUP(E390,Sheet3!$A$3:$A$10000,1,0))","v":""},{"$f":"IFERROR(VLOOKUP(F390,Sheet3!$A$3:$C$10000,3,0),0)","v":0}]
[null,null,null,null,null,{"$f":"IF(E391=0,\"\",VLOOKUP(E391,Sheet3!$A$3:$A$10000,1,0))","v":""},{"$f":"IFERROR(VLOOKUP(F391,Sheet3!$A$3:$C$10000,3,0),0)","v":0}]
[null,null,null,null,null,{"$f":"IF(E392=0,\"\",VLOOKUP(E392,Sheet3!$A$3:$A$10000,1,0))","v":""},{"$f":"IFERROR(VLOOKUP(F392,Sheet3!$A$3:$C$10000,3,0),0)","v":0}]
[null,null,null,null,null,{"$f":"IF(E393=0,\"\",VLOOKUP(E393,Sheet3!$A$3:$A$10000,1,0))","v":""},{"$f":"IFERROR(VLOOKUP(F393,Sheet3!$A$3:$C$10000,3,0),0)","v":0}]
[null,null,null,null,null,{"$f":"IF(E394=0,\"\",VLOOKUP(E394,Sheet3!$A$3:$A$10000,1,0))","v":""},{"$f":"IFERROR(VLOOKUP(F394,Sheet3!$A$3:$C$10000,3,0),0)","v":0}]
[null,null,null,null,null,{"$f":"IF(E395=0,\"\",VLOOKUP(E395,Sheet3!$A$3:$A$10000,1,0))","v":""},{"$f":"IFERROR(VLOOKUP(F395,Sheet3!$A$3:$C$10000,3,0),0)","v":0}]
[null,null,null,null,null,{"$f":"IF(E396=0,\"\",VLOOKUP(E396,Sheet3!$A$3:$A$10000,1,0))","v":""},{"$f":"IFERROR(VLOOKUP(F396,Sheet3!$A$3:$C$10000,3,0),0)","v":0}]
[null,null,null,null,null,{"$f":"IF(E397=0,\"\",VLOOKUP(E397,Sheet3!$A$3:$A$10000,1,0))","v":""},{"$f":"IFERROR(VLOOKUP(F397,Sheet3!$A$3:$C$10000,3,0),0)","v":0}]
[null,null,null,null,null,{"$f":"IF(E398=0,\"\",VLOOKUP(E398,Sheet3!$A$3:$A$10000,1,0))","v":""},{"$f":"IFERROR(VLOOKUP(F398,Sheet3!$A$3:$C$10000,3,0),0)","v":0}]
[null,null,null,null,null,{"$f":"IF(E399=0,\"\",VLOOKUP(E399,Sheet3!$A$3:$A$10000,1,0))","v":""},{"$f":"IFERROR(VLOOKUP(F399,Sheet3!$A$3:$C$10000,3,0),0)","v":0}]
[null,null,null,null,null,{"$f":"IF(E400=0,\"\",VLOOKUP(E400,Sheet3!$A$3:$A$10000,1,0))","v":""},{"$f":"IFERROR(VLOOKUP(F400,Sheet3!$A$3:$C$10000,3,0),0)","v":0}]
[null,null,null,null,null,{"$f":"IF(E401=0,\"\",VLOOKUP(E401,Sheet3!$A$3:$A$10000,1,0))","v":""},{"$f":"IFERROR(VLOOKUP(F401,Sheet3!$A$3:$C$10000,3,0),0)","v":0}]
[null,null,null,null,null,{"$f":"IF(E402=0,\"\",VLOOKUP(E402,Sheet3!$A$3:$A$10000,1,0))","v":""},{"$f":"IFERROR(VLOOKUP(F402,Sheet3!$A$3:$C$10000,3,0),0)","v":0}]
[null,null,null,null,null,{"$f":"IF(E403=0,\"\",VLOOKUP(E403,Sheet3!$A$3:$A$10000,1,0))","v":""},{"$f":"IFERROR(VLOOKUP(F403,Sheet3!$A$3:$C$10000,3,0),0)","v":0}]
[null,null,null,null,null,{"$f":"IF(E404=0,\"\",VLOOKUP(E404,Sheet3!$A$3:$A$10000,1,0))","v":""},{"$f":"IFERROR(VLOOKUP(F404,Sheet3!$A$3:$C$10000,3,0),0)","v":0}]
[null,null,null,null,null,{"$f":"IF(E405=0,\"\",VLOOKUP(E405,Sheet3!$A$3:$A$10000,1,0))","v":""},{"$f":"IFERROR(VLOOKUP(F405,Sheet3!$A$3:$C$10000,3,0),0)","v":0}]
[null,null,null,null,null,{"$f":"IF(E406=0,\"\",VLOOKUP(E406,Sheet3!$A$3:$A$10000,1,0))","v":""},{"$f":"IFERROR(VLOOKUP(F406,Sheet3!$A$3:$C$10000,3,0),0)","v":0}]
[null,null,null,null,null,{"$f":"IF(E407=0,\"\",VLOOKUP(E407,Sheet3!$A$3:$A$10000,1,0))","v":""},{"$f":"IFERROR(VLOOKUP(F407,Sheet3!$A$3:$C$10000,3,0),0)","v":0}]
[null,null,null,null,null,{"$f":"IF(E408=0,\"\",VLOOKUP(E408,Sheet3!$A$3:$A$10000,1,0))","v":""},{"$f":"IFERROR(VLOOKUP(F408,Sheet3!$A$3:$C$10000,3,0),0)","v":0}]
[null,null,null,null,null,{"$f":"IF(E409=0,\"\",VLOOKUP(E409,Sheet3!$A$3:$A$10000,1,0))","v":""},{"$f":"IFERROR(VLOOKUP(F409,Sheet3!$A$3:$C$10000,3,0),0)","v":0}]
[null,null,null,null,null,{"$f":"IF(E410=0,\"\",VLOOKUP(E410,Sheet3!$A$3:$A$10000,1,0))","v":""},{"$f":"IFERROR(VLOOKUP(F410,Sheet3!$A$3:$C$10000,3,0),0)","v":0}]
[null,null,null,null,null,{"$f":"IF(E411=0,\"\",VLOOKUP(E411,Sheet3!$A$3:$A$10000,1,0))","v":""},{"$f":"IFERROR(VLOOKUP(F411,Sheet3!$A$3:$C$10000,3,0),0)","v":0}]
[null,null,null,null,null,{"$f":"IF(E412=0,\"\",VLOOKUP(E412,Sheet3!$A$3:$A$10000,1,0))","v":""},{"$f":"IFERROR(VLOOKUP(F412,Sheet3!$A$3:$C$10000,3,0),0)","v":0}]
[null,null,null,null,null,{"$f":"IF(E413=0,\"\",VLOOKUP(E413,Sheet3!$A$3:$A$10000,1,0))","v":""},{"$f":"IFERROR(VLOOKUP(F413,Sheet3!$A$3:$C$10000,3,0),0)","v":0}]
[null,null,null,null,null,{"$f":"IF(E414=0,\"\",VLOOKUP(E414,Sheet3!$A$3:$A$10000,1,0))","v":""},{"$f":"IFERROR(VLOOKUP(F414,Sheet3!$A$3:$C$10000,3,0),0)","v":0}]
[null,null,null,null,null,{"$f":"IF(E415=0,\"\",VLOOKUP(E415,Sheet3!$A$3:$A$10000,1,0))","v":""},{"$f":"IFERROR(VLOOKUP(F415,Sheet3!$A$3:$C$10000,3,0),0)","v":0}]
[null,null,null,null,null,{"$f":"IF(E416=0,\"\",VLOOKUP(E416,Sheet3!$A$3:$A$10000,1,0))","v":""},{"$f":"IFERROR(VLOOKUP(F416,Sheet3!$A$3:$C$10000,3,0),0)","v":0}]
[null,null,null,null,null,{"$f":"IF(E417=0,\"\",VLOOKUP(E417,Sheet3!$A$3:$A$10000,1,0))","v":""},{"$f":"IFERROR(VLOOKUP(F417,Sheet3!$A$3:$C$10000,3,0),0)","v":0}]
[null,null,null,null,null,{"$f":"IF(E418=0,\"\",VLOOKUP(E418,Sheet3!$A$3:$A$10000,1,0))","v":""},{"$f":"IFERROR(VLOOKUP(F418,Sheet3!$A$3:$C$10000,3,0),0)","v":0}]
[null,null,null,null,null,{"$f":"IF(E419=0,\"\",VLOOKUP(E419,Sheet3!$A$3:$A$10000,1,0))","v":""},{"$f":"IFERROR(VLOOKUP(F419,Sheet3!$A$3:$C$10000,3,0),0)","v":0}]
[null,null,null,null,null,{"$f":"IF(E420=0,\"\",VLOOKUP(E420,Sheet3!$A$3:$A$10000,1,0))","v":""},{"$f":"IFERROR(VLOOKUP(F420,Sheet3!$A$3:$C$10000,3,0),0)","v":0}]
[null,null,null,null,null,{"$f":"IF(E421=0,\"\",VLOOKUP(E421,Sheet3!$A$3:$A$10000,1,0))","v":""},{"$f":"IFERROR(VLOOKUP(F421,Sheet3!$A$3:$C$10000,3,0),0)","v":0}]
[null,null,null,null,null,{"$f":"IF(E422=0,\"\",VLOOKUP(E422,Sheet3!$A$3:$A$10000,1,0))","v":""},{"$f":"IFERROR(VLOOKUP(F422,Sheet3!$A$3:$C$10000,3,0),0)","v":0}]
[null,null,null,null,null,{"$f":"IF(E423=0,\"\",VLOOKUP(E423,Sheet3!$A$3:$A$10000,1,0))","v":""},{"$f":"IFERROR(VLOOKUP(F423,Sheet3!$A$3:$C$10000,3,0),0)","v":0}]
[null,null,null,null,null,{"$f":"IF(E424=0,\"\",VLOOKUP(E424,Sheet3!$A$3:$A$10000,1,0))","v":""},{"$f":"IFERROR(VLOOKUP(F424,Sheet3!$A$3:$C$10000,3,0),0)","v":0}]
[null,null,null,null,null,{"$f":"IF(E425=0,\"\",VLOOKUP(E425,Sheet3!$A$3:$A$10000,1,0))","v":""},{"$f":"IFERROR(VLOOKUP(F425,Sheet3!$A$3:$C$10000,3,0),0)","v":0}]
[null,null,null,null,null,{"$f":"IF(E426=0,\"\",VLOOKUP(E426,Sheet3!$A$3:$A$10000,1,0))","v":""},{"$f":"IFERROR(VLOOKUP(F426,Sheet3!$A$3:$C$10000,3,0),0)","v":0}]
[null,null,null,null,null,{"$f":"IF(E427=0,\"\",VLOOKUP(E427,Sheet3!$A$3:$A$10000,1,0))","v":""},{"$f":"IFERROR(VLOOKUP(F427,Sheet3!$A$3:$C$10000,3,0),0)","v":0}]
[null,null,null,null,null,{"$f":"IF(E428=0,\"\",VLOOKUP(E428,Sheet3!$A$3:$A$10000,1,0))","v":""},{"$f":"IFERROR(VLOOKUP(F428,Sheet3!$A$3:$C$10000,3,0),0)","v":0}]
[null,null,null,null,null,{"$f":"IF(E429=0,\"\",VLOOKUP(E429,Sheet3!$A$3:$A$10000,1,0))","v":""},{"$f":"IFERROR(VLOOKUP(F429,Sheet3!$A$3:$C$10000,3,0),0)","v":0}]
[null,null,null,null,null,{"$f":"IF(E430=0,\"\",VLOOKUP(E430,Sheet3!$A$3:$A$10000,1,0))","v":""},{"$f":"IFERROR(VLOOKUP(F430,Sheet3!$A$3:$C$10000,3,0),0)","v":0}]
[null,null,null,null,null,{"$f":"IF(E431=0,\"\",VLOOKUP(E431,Sheet3!$A$3:$A$10000,1,0))","v":""},{"$f":"IFERROR(VLOOKUP(F431,Sheet3!$A$3:$C$10000,3,0),0)","v":0}]
[null,null,null,null,null,{"$f":"IF(E432=0,\"\",VLOOKUP(E432,Sheet3!$A$3:$A$10000,1,0))","v":""},{"$f":"IFERROR(VLOOKUP(F432,Sheet3!$A$3:$C$10000,3,0),0)","v":0}]
[null,null,null,null,null,{"$f":"IF(E433=0,\"\",VLOOKUP(E433,Sheet3!$A$3:$A$10000,1,0))","v":""},{"$f":"IFERROR(VLOOKUP(F433,Sheet3!$A$3:$C$10000,3,0),0)","v":0}]
[null,null,null,null,null,{"$f":"IF(E434=0,\"\",VLOOKUP(E434,Sheet3!$A$3:$A$10000,1,0))","v":""},{"$f":"IFERROR(VLOOKUP(F434,Sheet3!$A$3:$C$10000,3,0),0)","v":0}]
[null,null,null,null,null,{"$f":"IF(E435=0,\"\",VLOOKUP(E435,Sheet3!$A$3:$A$10000,1,0))","v":""},{"$f":"IFERROR(VLOOKUP(F435,Sheet3!$A$3:$C$10000,3,0),0)","v":0}]
[null,null,null,null,null,{"$f":"IF(E436=0,\"\",VLOOKUP(E436,Sheet3!$A$3:$A$10000,1,0))","v":""},{"$f":"IFERROR(VLOOKUP(F436,Sheet3!$A$3:$C$10000,3,0),0)","v":0}]
[null,null,null,null,null,{"$f":"IF(E437=0,\"\",VLOOKUP(E437,Sheet3!$A$3:$A$10000,1,0))","v":""},{"$f":"IFERROR(VLOOKUP(F437,Sheet3!$A$3:$C$10000,3,0),0)","v":0}]
[null,null,null,null,null,{"$f":"IF(E438=0,\"\",VLOOKUP(E438,Sheet3!$A$3:$A$10000,1,0))","v":""},{"$f":"IFERROR(VLOOKUP(F438,Sheet3!$A$3:$C$10000,3,0),0)","v":0}]
[null,null,null,null,null,{"$f":"IF(E439=0,\"\",VLOOKUP(E439,Sheet3!$A$3:$A$10000,1,0))","v":""},{"$f":"IFERROR(VLOOKUP(F439,Sheet3!$A$3:$C$10000,3,0),0)","v":0}]
[null,null,null,null,null,{"$f":"IF(E440=0,\"\",VLOOKUP(E440,Sheet3!$A$3:$A$10000,1,0))","v":""},{"$f":"IFERROR(VLOOKUP(F440,Sheet3!$A$3:$C$10000,3,0),0)","v":0}]
[null,null,null,null,null,{"$f":"IF(E441=0,\"\",VLOOKUP(E441,Sheet3!$A$3:$A$10000,1,0))","v":""},{"$f":"IFERROR(VLOOKUP(F441,Sheet3!$A$3:$C$10000,3,0),0)","v":0}]
[null,null,null,null,null,{"$f":"IF(E442=0,\"\",VLOOKUP(E442,Sheet3!$A$3:$A$10000,1,0))","v":""},{"$f":"IFERROR(VLOOKUP(F442,Sheet3!$A$3:$C$10000,3,0),0)","v":0}]
[null,null,null,null,null,{"$f":"IF(E443=0,\"\",VLOOKUP(E443,Sheet3!$A$3:$A$10000,1,0))","v":""},{"$f":"IFERROR(VLOOKUP(F443,Sheet3!$A$3:$C$10000,3,0),0)","v":0}]
[null,null,null,null,null,{"$f":"IF(E444=0,\"\",VLOOKUP(E444,Sheet3!$A$3:$A$10000,1,0))","v":""},{"$f":"IFERROR(VLOOKUP(F444,Sheet3!$A$3:$C$10000,3,0),0)","v":0}]
[null,null,null,null,null,{"$f":"IF(E445=0,\"\",VLOOKUP(E445,Sheet3!$A$3:$A$10000,1,0))","v":""},{"$f":"IFERROR(VLOOKUP(F445,Sheet3!$A$3:$C$10000,3,0),0)","v":0}]
[null,null,null,null,null,{"$f":"IF(E446=0,\"\",VLOOKUP(E446,Sheet3!$A$3:$A$10000,1,0))","v":""},{"$f":"IFERROR(VLOOKUP(F446,Sheet3!$A$3:$C$10000,3,0),0)","v":0}]
[null,null,null,null,null,{"$f":"IF(E447=0,\"\",VLOOKUP(E447,Sheet3!$A$3:$A$10000,1,0))","v":""},{"$f":"IFERROR(VLOOKUP(F447,Sheet3!$A$3:$C$10000,3,0),0)","v":0}]
[null,null,null,null,null,{"$f":"IF(E448=0,\"\",VLOOKUP(E448,Sheet3!$A$3:$A$10000,1,0))","v":""},{"$f":"IFERROR(VLOOKUP(F448,Sheet3!$A$3:$C$10000,3,0),0)","v":0}]
[null,null,null,null,null,{"$f":"IF(E449=0,\"\",VLOOKUP(E449,Sheet3!$A$3:$A$10000,1,0))","v":""},{"$f":"IFERROR(VLOOKUP(F449,Sheet3!$A$3:$C$10000,3,0),0)","v":0}]
[null,null,null,null,null,{"$f":"IF(E450=0,\"\",VLOOKUP(E450,Sheet3!$A$3:$A$10000,1,0))","v":""},{"$f":"IFERROR(VLOOKUP(F450,Sheet3!$A$3:$C$10000,3,0),0)","v":0}]
[null,null,null,null,null,{"$f":"IF(E451=0,\"\",VLOOKUP(E451,Sheet3!$A$3:$A$10000,1,0))","v":""},{"$f":"IFERROR(VLOOKUP(F451,Sheet3!$A$3:$C$10000,3,0),0)","v":0}]
[null,null,null,null,null,{"$f":"IF(E452=0,\"\",VLOOKUP(E452,Sheet3!$A$3:$A$10000,1,0))","v":""},{"$f":"IFERROR(VLOOKUP(F452,Sheet3!$A$3:$C$10000,3,0),0)","v":0}]
[null,null,null,null,null,{"$f":"IF(E453=0,\"\",VLOOKUP(E453,Sheet3!$A$3:$A$10000,1,0))","v":""},{"$f":"IFERROR(VLOOKUP(F453,Sheet3!$A$3:$C$10000,3,0),0)","v":0}]
[null,null,null,null,null,{"$f":"IF(E454=0,\"\",VLOOKUP(E454,Sheet3!$A$3:$A$10000,1,0))","v":""},{"$f":"IFERROR(VLOOKUP(F454,Sheet3!$A$3:$C$10000,3,0),0)","v":0}]
[null,null,null,null,null,{"$f":"IF(E455=0,\"\",VLOOKUP(E455,Sheet3!$A$3:$A$10000,1,0))","v":""},{"$f":"IFERROR(VLOOKUP(F455,Sheet3!$A$3:$C$10000,3,0),0)","v":0}]
[null,null,null,null,null,{"$f":"IF(E456=0,\"\",VLOOKUP(E456,Sheet3!$A$3:$A$10000,1,0))","v":""},{"$f":"IFERROR(VLOOKUP(F456,Sheet3!$A$3:$C$10000,3,0),0)","v":0}]
[null,null,null,null,null,{"$f":"IF(E457=0,\"\",VLOOKUP(E457,Sheet3!$A$3:$A$10000,1,0))","v":""},{"$f":"IFERROR(VLOOKUP(F457,Sheet3!$A$3:$C$10000,3,0),0)","v":0}]
[null,null,null,null,null,{"$f":"IF(E458=0,\"\",VLOOKUP(E458,Sheet3!$A$3:$A$10000,1,0))","v":""},{"$f":"IFERROR(VLOOKUP(F458,Sheet3!$A$3:$C$10000,3,0),0)","v":0}]
[null,null,null,null,null,{"$f":"IF(E459=0,\"\",VLOOKUP(E459,Sheet3!$A$3:$A$10000,1,0))","v":""},{"$f":"IFERROR(VLOOKUP(F459,Sheet3!$A$3:$C$10000,3,0),0)","v":0}]
[null,null,null,null,null,{"$f":"IF(E460=0,\"\",VLOOKUP(E460,Sheet3!$A$3:$A$10000,1,0))","v":""},{"$f":"IFERROR(VLOOKUP(F460,Sheet3!$A$3:$C$10000,3,0),0)","v":0}]
[null,null,null,null,null,{"$f":"IF(E461=0,\"\",VLOOKUP(E461,Sheet3!$A$3:$A$10000,1,0))","v":""},{"$f":"IFERROR(VLOOKUP(F461,Sheet3!$A$3:$C$10000,3,0),0)","v":0}]
[null,null,null,null,null,{"$f":"IF(E462=0,\"\",VLOOKUP(E462,Sheet3!$A$3:$A$10000,1,0))","v":""},{"$f":"IFERROR(VLOOKUP(F462,Sheet3!$A$3:$C$10000,3,0),0)","v":0}]
[null,null,null,null,null,{"$f":"IF(E463=0,\"\",VLOOKUP(E463,Sheet3!$A$3:$A$10000,1,0))","v":""},{"$f":"IFERROR(VLOOKUP(F463,Sheet3!$A$3:$C$10000,3,0),0)","v":0}]
[null,null,null,null,null,{"$f":"IF(E464=0,\"\",VLOOKUP(E464,Sheet3!$A$3:$A$10000,1,0))","v":""},{"$f":"IFERROR(VLOOKUP(F464,Sheet3!$A$3:$C$10000,3,0),0)","v":0}]
[null,null,null,null,null,{"$f":"IF(E465=0,\"\",VLOOKUP(E465,Sheet3!$A$3:$A$10000,1,0))","v":""},{"$f":"IFERROR(VLOOKUP(F465,Sheet3!$A$3:$C$10000,3,0),0)","v":0}]
[null,null,null,null,null,{"$f":"IF(E466=0,\"\",VLOOKUP(E466,Sheet3!$A$3:$A$10000,1,0))","v":""},{"$f":"IFERROR(VLOOKUP(F466,Sheet3!$A$3:$C$10000,3,0),0)","v":0}]
[null,null,null,null,null,{"$f":"IF(E467=0,\"\",VLOOKUP(E467,Sheet3!$A$3:$A$10000,1,0))","v":""},{"$f":"IFERROR(VLOOKUP(F467,Sheet3!$A$3:$C$10000,3,0),0)","v":0}]
[null,null,null,null,null,{"$f":"IF(E468=0,\"\",VLOOKUP(E468,Sheet3!$A$3:$A$10000,1,0))","v":""},{"$f":"IFERROR(VLOOKUP(F468,Sheet3!$A$3:$C$10000,3,0),0)","v":0}]
[null,null,null,null,null,{"$f":"IF(E469=0,\"\",VLOOKUP(E469,Sheet3!$A$3:$A$10000,1,0))","v":""},{"$f":"IFERROR(VLOOKUP(F469,Sheet3!$A$3:$C$10000,3,0),0)","v":0}]
[null,null,null,null,null,{"$f":"IF(E470=0,\"\",VLOOKUP(E470,Sheet3!$A$3:$A$10000,1,0))","v":""},{"$f":"IFERROR(VLOOKUP(F470,Sheet3!$A$3:$C$10000,3,0),0)","v":0}]
[null,null,null,null,null,{"$f":"IF(E471=0,\"\",VLOOKUP(E471,Sheet3!$A$3:$A$10000,1,0))","v":""},{"$f":"IFERROR(VLOOKUP(F471,Sheet3!$A$3:$C$10000,3,0),0)","v":0}]
[null,null,null,null,null,{"$f":"IF(E472=0,\"\",VLOOKUP(E472,Sheet3!$A$3:$A$10000,1,0))","v":""},{"$f":"IFERROR(VLOOKUP(F472,Sheet3!$A$3:$C$10000,3,0),0)","v":0}]
[null,null,null,null,null,{"$f":"IF(E473=0,\"\",VLOOKUP(E473,Sheet3!$A$3:$A$10000,1,0))","v":""},{"$f":"IFERROR(VLOOKUP(F473,Sheet3!$A$3:$C$10000,3,0),0)","v":0}]
[null,null,null,null,null,{"$f":"IF(E474=0,\"\",VLOOKUP(E474,Sheet3!$A$3:$A$10000,1,0))","v":""},{"$f":"IFERROR(VLOOKUP(F474,Sheet3!$A$3:$C$10000,3,0),0)","v":0}]
[null,null,null,null,null,{"$f":"IF(E475=0,\"\",VLOOKUP(E475,Sheet3!$A$3:$A$10000,1,0))","v":""},{"$f":"IFERROR(VLOOKUP(F475,Sheet3!$A$3:$C$10000,3,0),0)","v":0}]
[null,null,null,null,null,{"$f":"IF(E476=0,\"\",VLOOKUP(E476,Sheet3!$A$3:$A$10000,1,0))","v":""},{"$f":"IFERROR(VLOOKUP(F476,Sheet3!$A$3:$C$10000,3,0),0)","v":0}]
[null,null,null,null,null,{"$f":"IF(E477=0,\"\",VLOOKUP(E477,Sheet3!$A$3:$A$10000,1,0))","v":""},{"$f":"IFERROR(VLOOKUP(F477,Sheet3!$A$3:$C$10000,3,0),0)","v":0}]
[null,null,null,null,null,{"$f":"IF(E478=0,\"\",VLOOKUP(E478,Sheet3!$A$3:$A$10000,1,0))","v":""},{"$f":"IFERROR(VLOOKUP(F478,Sheet3!$A$3:$C$10000,3,0),0)","v":0}]
[null,null,null,null,null,{"$f":"IF(E479=0,\"\",VLOOKUP(E479,Sheet3!$A$3:$A$10000,1,0))","v":""},{"$f":"IFERROR(VLOOKUP(F479,Sheet3!$A$3:$C$10000,3,0),0)","v":0}]
[null,null,null,null,null,{"$f":"IF(E480=0,\"\",VLOOKUP(E480,Sheet3!$A$3:$A$10000,1,0))","v":""},{"$f":"IFERROR(VLOOKUP(F480,Sheet3!$A$3:$C$10000,3,0),0)","v":0}]
[null,null,null,null,null,{"$f":"IF(E481=0,\"\",VLOOKUP(E481,Sheet3!$A$3:$A$10000,1,0))","v":""},{"$f":"IFERROR(VLOOKUP(F481,Sheet3!$A$3:$C$10000,3,0),0)","v":0}]
[null,null,null,null,null,{"$f":"IF(E482=0,\"\",VLOOKUP(E482,Sheet3!$A$3:$A$10000,1,0))","v":""},{"$f":"IFERROR(VLOOKUP(F482,Sheet3!$A$3:$C$10000,3,0),0)","v":0}]
[null,null,null,null,null,{"$f":"IF(E483=0,\"\",VLOOKUP(E483,Sheet3!$A$3:$A$10000,1,0))","v":""},{"$f":"IFERROR(VLOOKUP(F483,Sheet3!$A$3:$C$10000,3,0),0)","v":0}]
[null,null,null,null,null,{"$f":"IF(E484=0,\"\",VLOOKUP(E484,Sheet3!$A$3:$A$10000,1,0))","v":""},{"$f":"IFERROR(VLOOKUP(F484,Sheet3!$A$3:$C$10000,3,0),0)","v":0}]
[null,null,null,null,null,{"$f":"IF(E485=0,\"\",VLOOKUP(E485,Sheet3!$A$3:$A$10000,1,0))","v":""},{"$f":"IFERROR(VLOOKUP(F485,Sheet3!$A$3:$C$10000,3,0),0)","v":0}]
[null,null,null,null,null,{"$f":"IF(E486=0,\"\",VLOOKUP(E486,Sheet3!$A$3:$A$10000,1,0))","v":""},{"$f":"IFERROR(VLOOKUP(F486,Sheet3!$A$3:$C$10000,3,0),0)","v":0}]
[null,null,null,null,null,{"$f":"IF(E487=0,\"\",VLOOKUP(E487,Sheet3!$A$3:$A$10000,1,0))","v":""},{"$f":"IFERROR(VLOOKUP(F487,Sheet3!$A$3:$C$10000,3,0),0)","v":0}]
[null,null,null,null,null,{"$f":"IF(E488=0,\"\",VLOOKUP(E488,Sheet3!$A$3:$A$10000,1,0))","v":""},{"$f":"IFERROR(VLOOKUP(F488,Sheet3!$A$3:$C$10000,3,0),0)","v":0}]
[null,null,null,null,null,{"$f":"IF(E489=0,\"\",VLOOKUP(E489,Sheet3!$A$3:$A$10000,1,0))","v":""},{"$f":"IFERROR(VLOOKUP(F489,Sheet3!$A$3:$C$10000,3,0),0)","v":0}]
[null,null,null,null,null,{"$f":"IF(E490=0,\"\",VLOOKUP(E490,Sheet3!$A$3:$A$10000,1,0))","v":""},{"$f":"IFERROR(VLOOKUP(F490,Sheet3!$A$3:$C$10000,3,0),0)","v":0}]
[null,null,null,null,null,{"$f":"IF(E491=0,\"\",VLOOKUP(E491,Sheet3!$A$3:$A$10000,1,0))","v":""},{"$f":"IFERROR(VLOOKUP(F491,Sheet3!$A$3:$C$10000,3,0),0)","v":0}]
[null,null,null,null,null,{"$f":"IF(E492=0,\"\",VLOOKUP(E492,Sheet3!$A$3:$A$10000,1,0))","v":""},{"$f":"IFERROR(VLOOKUP(F492,Sheet3!$A$3:$C$10000,3,0),0)","v":0}]
[null,null,null,null,null,{"$f":"IF(E493=0,\"\",VLOOKUP(E493,Sheet3!$A$3:$A$10000,1,0))","v":""}]
[null,null,null,null,null,{"$f":"IF(E494=0,\"\",VLOOKUP(E494,Sheet3!$A$3:$A$10000,1,0))","v":""}]
[null,null,null,null,null,{"$f":"IF(E495=0,\"\",VLOOKUP(E495,Sheet3!$A$3:$A$10000,1,0))","v":""}]
[null,null,null,null,null,{"$f":"IF(E496=0,\"\",VLOOKUP(E496,Sheet3!$A$3:$A$10000,1,0))","v":""}]
[null,null,null,null,null,{"$f":"IF(E497=0,\"\",VLOOKUP(E497,Sheet3!$A$3:$A$10000,1,0))","v":""}]
[null,null,null,null,null,{"$f":"IF(E498=0,\"\",VLOOKUP(E498,Sheet3!$A$3:$A$10000,1,0))","v":""}]
[null,null,null,null,null,{"$f":"IF(E499=0,\"\",VLOOKUP(E499,Sheet3!$A$3:$A$10000,1,0))","v":""}]
[null,null,null,null,null,{"$f":"IF(E500=0,\"\",VLOOKUP(E500,Sheet3!$A$3:$A$10000,1,0))","v":""}]
[null,null,null,null,null,{"$f":"IF(E501=0,\"\",VLOOKUP(E501,Sheet3!$A$3:$A$10000,1,0))","v":""}]
[null,null,null,null,null,{"$f":"IF(E502=0,\"\",VLOOKUP(E502,Sheet3!$A$3:$A$10000,1,0))","v":""}]

{"sheet":"Sheet3","index":2,"n_rows":1250,"n_cols":3,"rows_kept":1250,"cut":false,"hidden":false,"merged":[]}
["هذ العمود يرحل البيانات الى شيت 2","معادلة 5"]
["Column 1","Column 2","Column 3"]
[2,{"$f":"IFERROR(VLOOKUP(A3,Sheet2!$E$7:$E$264,1,0),\"Wrong\")","v":2},1]
[3,{"$f":"IFERROR(VLOOKUP(A4,Sheet2!$E$7:$E$264,1,0),\"Wrong\")","v":3},1]
[4,{"$f":"IFERROR(VLOOKUP(A5,Sheet2!$E$7:$E$264,1,0),\"Wrong\")","v":4},1]
[5,{"$f":"IFERROR(VLOOKUP(A6,Sheet2!$E$7:$E$264,1,0),\"Wrong\")","v":5},1]
[6,6,1]
[7,7,1]
[8,8,1]
[9,{"$f":"IFERROR(VLOOKUP(A10,Sheet2!$E$7:$E$264,1,0),\"Wrong\")","v":9},1]
[4,4,1]
[5,5,1]
[6,{"$f":"IFERROR(VLOOKUP(A13,Sheet2!$E$7:$E$264,1,0),\"Wrong\")","v":6},1]
[7,{"$f":"IFERROR(VLOOKUP(A14,Sheet2!$E$7:$E$264,1,0),\"Wrong\")","v":7},1]
[8,{"$f":"IFERROR(VLOOKUP(A15,Sheet2!$E$7:$E$264,1,0),\"Wrong\")","v":8},1]
[9,{"$f":"IFERROR(VLOOKUP(A16,Sheet2!$E$7:$E$264,1,0),\"Wrong\")","v":9},1]
[10,{"$f":"IFERROR(VLOOKUP(A17,Sheet2!$E$7:$E$264,1,0),\"Wrong\")","v":10},1]
[11,{"$f":"IFERROR(VLOOKUP(A18,Sheet2!$E$7:$E$264,1,0),\"Wrong\")","v":11},1]
[12,{"$f":"IFERROR(VLOOKUP(A19,Sheet2!$E$7:$E$264,1,0),\"Wrong\")","v":12},1]
[13,{"$f":"IFERROR(VLOOKUP(A20,Sheet2!$E$7:$E$264,1,0),\"Wrong\")","v":13},1]
[14,{"$f":"IFERROR(VLOOKUP(A21,Sheet2!$E$7:$E$264,1,0),\"Wrong\")","v":14},1]
[15,{"$f":"IFERROR(VLOOKUP(A22,Sheet2!$E$7:$E$264,1,0),\"Wrong\")","v":15},1]
[16,{"$f":"IFERROR(VLOOKUP(A23,Sheet2!$E$7:$E$264,1,0),\"Wrong\")","v":16},1]
[17,{"$f":"IFERROR(VLOOKUP(A24,Sheet2!$E$7:$E$264,1,0),\"Wrong\")","v":17},1]
[18,{"$f":"IFERROR(VLOOKUP(A25,Sheet2!$E$7:$E$264,1,0),\"Wrong\")","v":18},1]
[19,{"$f":"IFERROR(VLOOKUP(A26,Sheet2!$E$7:$E$264,1,0),\"Wrong\")","v":19},1]
[20,{"$f":"IFERROR(VLOOKUP(A27,Sheet2!$E$7:$E$264,1,0),\"Wrong\")","v":20},1]
[21,{"$f":"IFERROR(VLOOKUP(A28,Sheet2!$E$7:$E$264,1,0),\"Wrong\")","v":21},1]
[22,{"$f":"IFERROR(VLOOKUP(A29,Sheet2!$E$7:$E$264,1,0),\"Wrong\")","v":22},1]
[23,{"$f":"IFERROR(VLOOKUP(A30,Sheet2!$E$7:$E$264,1,0),\"Wrong\")","v":23},1]
[24,{"$f":"IFERROR(VLOOKUP(A31,Sheet2!$E$7:$E$264,1,0),\"Wrong\")","v":24},1]
[25,{"$f":"IFERROR(VLOOKUP(A32,Sheet2!$E$7:$E$264,1,0),\"Wrong\")","v":25},1]
[26,{"$f":"IFERROR(VLOOKUP(A33,Sheet2!$E$7:$E$264,1,0),\"Wrong\")","v":26},1]
[27,{"$f":"IFERROR(VLOOKUP(A34,Sheet2!$E$7:$E$264,1,0),\"Wrong\")","v":27},1]
[null,{"$f":"IFERROR(VLOOKUP(A35,Sheet2!$E$7:$E$264,1,0),\"Wrong\")","v":"Wrong"},1]
[null,{"$f":"IFERROR(VLOOKUP(A36,Sheet2!$E$7:$E$264,1,0),\"Wrong\")","v":"Wrong"},1]
[null,{"$f":"IFERROR(VLOOKUP(A37,Sheet2!$E$7:$E$264,1,0),\"Wrong\")","v":"Wrong"},1]
[null,{"$f":"IFERROR(VLOOKUP(A38,Sheet2!$E$7:$E$264,1,0),\"Wrong\")","v":"Wrong"},1]
[null,{"$f":"IFERROR(VLOOKUP(A39,Sheet2!$E$7:$E$264,1,0),\"Wrong\")","v":"Wrong"},1]
[null,null,1]
[null,null,1]
[null,null,1]
[null,null,1]
[null,null,1]
[null,null,1]
[null,null,1]
[null,null,1]
[null,null,1]
[null,null,1]
[null,null,1]
[null,null,1]
[null,null,1]
[null,null,1]
[null,null,1]
[null,null,1]
[null,null,1]
[null,null,1]
[null,null,1]
[null,null,1]
[null,null,1]
[null,null,1]
[null,null,1]
[null,null,1]
[null,null,1]
[null,null,1]
[null,null,1]
[null,null,1]
[null,null,1]
[null,null,1]
[null,null,1]
[null,null,1]
[null,null,1]
[null,null,1]
[null,null,1]
[null,null,1]
[null,null,1]
[null,null,1]
[null,null,1]
[null,null,1]
[null,null,1]
[null,null,1]
[null,null,1]
[null,null,1]
[null,null,1]
[null,null,1]
[null,null,1]
[null,null,1]
[null,null,1]
[null,null,1]
[null,null,1]
[null,null,1]
[null,null,1]
[null,null,1]
[null,null,1]
[null,null,1]
[null,null,1]
[null,null,1]
[null,null,1]
[null,null,1]
[null,null,1]
[null,null,1]
[null,null,1]
[null,null,1]
[null,null,1]
[null,null,1]
[null,null,1]
[null,null,1]
[null,null,1]
[null,null,1]
[null,null,1]
[null,null,1]
[null,null,1]
[null,null,1]
[null,null,1]
[null,null,1]
[null,null,1]
[null,null,1]
[null,null,1]
[null,null,1]
[null,null,1]
[null,null,1]
[null,null,1]
[null,null,1]
[null,null,1]
[null,null,1]
[null,null,1]
[null,null,1]
[null,null,1]
[null,null,1]
[null,null,1]
[null,null,1]
[null,null,1]
[null,null,1]
[null,null,1]
[null,null,1]
[null,null,1]
[null,null,1]
[null,null,1]
[null,null,1]
[null,null,1]
[null,null,1]
[null,null,1]
[null,null,1]
[null,null,1]
[null,null,1]
[null,null,1]
[null,null,1]
[null,null,1]
[null,null,1]
[null,null,1]
[null,null,1]
[null,null,1]
[null,null,1]
[null,null,1]
[null,null,1]
[null,null,1]
[null,null,1]
[null,null,1]
[null,null,1]
[null,null,1]
[null,null,1]
[null,null,1]
[null,null,1]
[null,null,1]
[null,null,1]
[null,null,1]
[null,null,1]
[null,null,1]
[null,null,1]
[null,null,1]
[null,null,1]
[null,null,1]
[null,null,1]
[null,null,1]
[null,null,1]
[null,null,1]
[null,null,1]
[null,null,1]
[null,null,1]
[null,null,1]
[null,null,1]
[null,null,1]
[null,null,1]
[null,null,1]
[null,null,1]
[null,null,1]
[null,null,1]
[null,null,1]
[null,null,1]
[null,null,1]
[null,null,1]
[null,null,1]
[null,null,1]
[null,null,1]
[null,null,1]
[null,null,1]
[null,null,1]
[null,null,1]
[null,null,1]
[null,null,1]
[null,null,1]
[null,null,1]
[null,null,1]
[null,null,1]
[null,null,1]
[null,null,1]
[null,null,1]
[null,null,1]
[null,null,1]
[null,null,1]
[null,null,1]
[null,null,1]
[null,null,1]
[null,null,1]
[null,null,1]
[null,null,1]
[null,null,1]
[null,null,1]
[null,null,1]
[null,null,1]
[null,null,1]
[null,null,1]
[null,null,1]
[null,null,1]
[null,null,1]
[null,null,1]
[null,null,1]
[null,null,1]
[null,null,1]
[null,null,1]
[null,null,1]
[null,null,1]
[null,null,1]
[null,null,1]
[null,null,1]
[null,null,1]
[null,null,1]
[null,null,1]
[null,null,1]
[null,null,1]
[null,null,1]
[null,null,1]
[null,null,1]
[null,null,1]
[null,null,1]
[null,null,1]
[null,null,1]
[null,null,1]
[null,null,1]
[null,null,1]
[null,null,1]
[null,null,1]
[null,null,1]
[null,null,1]
[null,null,1]
[null,null,1]
[null,null,1]
[null,null,1]
[null,null,1]
[null,null,1]
[null,null,1]
[null,null,1]
[null,null,1]
[null,null,1]
[null,null,1]
[null,null,1]
[null,null,1]
[null,null,1]
[null,null,1]
[null,null,1]
[null,null,1]
[null,null,1]
[null,null,1]
[null,null,1]
[null,null,1]
[null,null,1]
[null,null,1]
[null,null,1]
[null,null,1]
[null,null,1]
[null,null,1]
[null,null,1]
[null,null,1]
[null,null,1]
[null,null,1]
[null,null,1]
[null,null,1]
[null,null,1]
[null,null,1]
[null,null,1]
[null,null,1]
[null,null,1]
[null,null,1]
[null,null,1]
[null,null,1]
[null,null,1]
[null,null,1]
[null,null,1]
[null,null,1]
[null,null,1]
[null,null,1]
[null,null,1]
[null,null,1]
[null,null,1]
[null,null,1]
[null,null,1]
[null,null,1]
[null,null,1]
[null,null,1]
[null,null,1]
[null,null,1]
[null,null,1]
[null,null,1]
[null,null,1]
[null,null,1]
[null,null,1]
[null,null,1]
[null,null,1]
[null,null,1]
[null,null,1]
[null,null,1]
[null,null,1]
[null,null,1]
[null,null,1]
[null,null,1]
[null,null,1]
[null,null,1]
[null,null,1]
[null,null,1]
[null,null,1]
[null,null,1]
[null,null,1]
[null,null,1]
[null,null,1]
[null,null,1]
[null,null,1]
[null,null,1]
[null,null,1]
[null,null,1]
[null,null,1]
[null,null,1]
[null,null,1]
[null,null,1]
[null,null,1]
[null,null,1]
[null,null,1]
[null,null,1]
[null,null,1]
[null,null,1]
[null,null,1]
[null,null,1]
[null,null,1]
[null,null,1]
[null,null,1]
[null,null,1]
[null,null,1]
[null,null,1]
[null,null,1]
[null,null,1]
[null,null,1]
[null,null,1]
[null,null,1]
[null,null,1]
[null,null,1]
[null,null,1]
[null,null,1]
[null,null,1]
[null,null,1]
[null,null,1]
[null,null,1]
[null,null,1]
[null,null,1]
[null,null,1]
[null,null,1]
[null,null,1]
[null,null,1]
[null,null,1]
[null,null,1]
[null,null,1]
[null,null,1]
[null,null,1]
[null,null,1]
[null,null,1]
[null,null,1]
[null,null,1]
[null,null,1]
[null,null,1]
[null,null,1]
[null,null,1]
[null,null,1]
[null,null,1]
[null,null,1]
[null,null,1]
[null,null,1]
[null,null,1]
[null,null,1]
[null,null,1]
[null,null,1]
[null,null,1]
[null,null,1]
[null,null,1]
[null,null,1]
[null,null,1]
[null,null,1]
[null,null,1]
[null,null,1]
[null,null,1]
[null,null,1]
[null,null,1]
[null,null,1]
[null,null,1]
[null,null,1]
[null,null,1]
[null,null,1]
[null,null,1]
[null,null,1]
[null,null,1]
[null,null,1]
[null,null,1]
[null,null,1]
[null,null,1]
[null,null,1]
[null,null,1]
[null,null,1]
[null,null,1]
[null,null,1]
[null,null,1]
[null,null,1]
[null,null,1]
[null,null,1]
[null,null,1]
[null,null,1]
[null,null,1]
[null,null,1]
[null,null,1]
[null,null,1]
[null,null,1]
[null,null,1]
[null,null,1]
[null,null,1]
[null,null,1]
[null,null,1]
[null,null,1]
[null,null,1]
[null,null,1]
[null,null,1]
[null,null,1]
[null,null,1]
[null,null,1]
[null,null,1]
[null,null,1]
[null,null,1]
[null,null,1]
[null,null,1]
[null,null,1]
[null,null,1]
[null,null,1]
[null,null,1]
[null,null,1]
[null,null,1]
[null,null,1]
[null,null,1]
[null,null,1]
[null,null,1]
[null,null,1]
[null,null,1]
[null,null,1]
[null,null,1]
[null,null,1]
[null,null,1]
[null,null,1]
[null,null,1]
[null,null,1]
[null,null,1]
[null,null,1]
[null,null,1]
[null,null,1]
[null,null,1]
[null,null,1]
[null,null,1]
[null,null,1]
[null,null,1]
[null,null,1]
[null,null,1]
[null,null,1]
[null,null,1]
[null,null,1]
[null,null,1]
[null,null,1]
[null,null,1]
[null,null,1]
[null,null,1]
[null,null,1]
[null,null,1]
[null,null,1]
[null,null,1]
[null,null,1]
[null,null,1]
[null,null,1]
[null,null,1]
[null,null,1]
[null,null,1]
[null,null,1]
[null,null,1]
[null,null,1]
[null,null,1]
[null,null,1]
[null,null,1]
[null,null,1]
[null,null,1]
[null,null,1]
[null,null,1]
[null,null,1]
[null,null,1]
[null,null,1]
[null,null,1]
[null,null,1]
[null,null,1]
[null,null,1]
[null,null,1]
[null,null,1]
[null,null,1]
[null,null,1]
[null,null,1]
[null,null,1]
[null,null,1]
[null,null,1]
[null,null,1]
[null,null,1]
[null,null,1]
[null,null,1]
[null,null,1]
[null,null,1]
[null,null,1]
[null,null,1]
[null,null,1]
[null,null,1]
[null,null,1]
[null,null,1]
[null,null,1]
[null,null,1]
[null,null,1]
[null,null,1]
[null,null,1]
[null,null,1]
[null,null,1]
[null,null,1]
[null,null,1]
[null,null,1]
[null,null,1]
[null,null,1]
[null,null,1]
[null,null,1]
[null,null,1]
[null,null,1]
[null,null,1]
[null,null,1]
[null,null,1]
[null,null,1]
[null,null,1]
[null,null,1]
[null,null,1]
[null,null,1]
[null,null,1]
[null,null,1]
[null,null,1]
[null,null,1]
[null,null,1]
[null,null,1]
[null,null,1]
[null,null,1]
[null,null,1]
[null,null,1]
[null,null,1]
[null,null,1]
[null,null,1]
[null,null,1]
[null,null,1]
[null,null,1]
[null,null,1]
[null,null,1]
[null,null,1]
[null,null,1]
[null,null,1]
[null,null,1]
[null,null,1]
[null,null,1]
[null,null,1]
[null,null,1]
[null,null,1]
[null,null,1]
[null,null,1]
[null,null,1]
[null,null,1]
[null,null,1]
[null,null,1]
[null,null,1]
[null,null,1]
[null,null,1]
[null,null,1]
[null,null,1]
[null,null,1]
[null,null,1]
[null,null,1]
[null,null,1]
[null,null,1]
[null,null,1]
[null,null,1]
[null,null,1]
[null,null,1]
[null,null,1]
[null,null,1]
[null,null,1]
[null,null,1]
[null,null,1]
[null,null,1]
[null,null,1]
[null,null,1]
[null,null,1]
[null,null,1]
[null,null,1]
[null,null,1]
[null,null,1]
[null,null,1]
[null,null,1]
[null,null,1]
[null,null,1]
[null,null,1]
[null,null,1]
[null,null,1]
[null,null,1]
[null,null,1]
[null,null,1]
[null,null,1]
[null,null,1]
[null,null,1]
[null,null,1]
[null,null,1]
[null,null,1]
[null,null,1]
[null,null,1]
[null,null,1]
[null,null,1]
[null,null,1]
[null,null,1]
[null,null,1]
[null,null,1]
[null,null,1]
[null,null,1]
[null,null,1]
[null,null,1]
[null,null,1]
[null,null,1]
[null,null,1]
[null,null,1]
[null,null,1]
[null,null,1]
[null,null,1]
[null,null,1]
[null,null,1]
[null,null,1]
[null,null,1]
[null,null,1]
[null,null,1]
[null,null,1]
[null,null,1]
[null,null,1]
[null,null,1]
[null,null,1]
[null,null,1]
[null,null,1]
[null,null,1]
[null,null,1]
[null,null,1]
[null,null,1]
[null,null,1]
[null,null,1]
[null,null,1]
[null,null,1]
[null,null,1]
[null,null,1]
[null,null,1]
[null,null,1]
[null,null,1]
[null,null,1]
[null,null,1]
[null,null,1]
[null,null,1]
[null,null,1]
[null,null,1]
[null,null,1]
[null,null,1]
[null,null,1]
[null,null,1]
[null,null,1]
[null,null,1]
[null,null,1]
[null,null,1]
[null,null,1]
[null,null,1]
[null,null,1]
[null,null,1]
[null,null,1]
[null,null,1]
[null,null,1]
[null,null,1]
[null,null,1]
[null,null,1]
[null,null,1]
[null,null,1]
[null,null,1]
[null,null,1]
[null,null,1]
[null,null,1]
[null,null,1]
[null,null,1]
[null,null,1]
[null,null,1]
[null,null,1]
[null,null,1]
[null,null,1]
[null,null,1]
[null,null,1]
[null,null,1]
[null,null,1]
[null,null,1]
[null,null,1]
[null,null,1]
[null,null,1]
[null,null,1]
[null,null,1]
[null,null,1]
[null,null,1]
[null,null,1]
[null,null,1]
[null,null,1]
[null,null,1]
[null,null,1]
[null,null,1]
[null,null,1]
[null,null,1]
[null,null,1]
[null,null,1]
[null,null,1]
[null,null,1]
[null,null,1]
[null,null,1]
[null,null,1]
[null,null,1]
[null,null,1]
[null,null,1]
[null,null,1]
[null,null,1]
[null,null,1]
[null,null,1]
[null,null,1]
[null,null,1]
[null,null,1]
[null,null,1]
[null,null,1]
[null,null,1]
[null,null,1]
[null,null,1]
[null,null,1]
[null,null,1]
[null,null,1]
[null,null,1]
[null,null,1]
[null,null,1]
[null,null,1]
[null,null,1]
[null,null,1]
[null,null,1]
[null,null,1]
[null,null,1]
[null,null,1]
[null,null,1]
[null,null,1]
[null,null,1]
[null,null,1]
[null,null,1]
[null,null,1]
[null,null,1]
[null,null,1]
[null,null,1]
[null,null,1]
[null,null,1]
[null,null,1]
[null,null,1]
[null,null,1]
[null,null,1]
[null,null,1]
[null,null,1]
[null,null,1]
[null,null,1]
[null,null,1]
[null,null,1]
[null,null,1]
[null,null,1]
[null,null,1]
[null,null,1]
[null,null,1]
[null,null,1]
[null,null,1]
[null,null,1]
[null,null,1]
[null,null,1]
[null,null,1]
[null,null,1]
[null,null,1]
[null,null,1]
[null,null,1]
[null,null,1]
[null,null,1]
[null,null,1]
[null,null,1]
[null,null,1]
[null,null,1]
[null,null,1]
[null,null,1]
[null,null,1]
[null,null,1]
[null,null,1]
[null,null,1]
[null,null,1]
[null,null,1]
[null,null,1]
[null,null,1]
[null,null,1]
[null,null,1]
[null,null,1]
[null,null,1]
[null,null,1]
[null,null,1]
[null,null,1]
[null,null,1]
[null,null,1]
[null,null,1]
[null,null,1]
[null,null,1]
[null,null,1]
[null,null,1]
[null,null,1]
[null,null,1]
[null,null,1]
[null,null,1]
[null,null,1]
[null,null,1]
[null,null,1]
[null,null,1]
[null,null,1]
[null,null,1]
[null,null,1]
[null,null,1]
[null,null,1]
[null,null,1]
[null,null,1]
[null,null,1]
[null,null,1]
[null,null,1]
[null,null,1]
[null,null,1]
[null,null,1]
[null,null,1]
[null,null,1]
[null,null,1]
[null,null,1]
[null,null,1]
[null,null,1]
[null,null,1]
[null,null,1]
[null,null,1]
[null,null,1]
[null,null,1]
[null,null,1]
[null,null,1]
[null,null,1]
[null,null,1]
[null,null,1]
[null,null,1]
[null,null,1]
[null,null,1]
[null,null,1]
[null,null,1]
[null,null,1]
[null,null,1]
[null,null,1]
[null,null,1]
[null,null,1]
[null,null,1]
[null,null,1]
[null,null,1]
[null,null,1]
[null,null,1]
[null,null,1]
[null,null,1]
[null,null,1]
[null,null,1]
[null,null,1]
[null,null,1]
[null,null,1]
[null,null,1]
[null,null,1]
[null,null,1]
[null,null,1]
[null,null,1]
[null,null,1]
[null,null,1]
[null,null,1]
[null,null,1]
[null,null,1]
[null,null,1]
[null,null,1]
[null,null,1]
[null,null,1]
[null,null,1]
[null,null,1]
[null,null,1]
[null,null,1]
[null,null,1]
[null,null,1]
[null,null,1]
[null,null,1]
[null,null,1]
[null,null,1]
[null,null,1]
[null,null,1]
[null,null,1]
[null,null,1]
[null,null,1]
[null,null,1]
[null,null,1]
[null,null,1]
[null,null,1]
[null,null,1]
[null,null,1]
[null,null,1]
[null,null,1]
[null,null,1]
[null,null,1]
[null,null,1]
[null,null,1]
[null,null,1]
[null,null,1]
[null,null,1]
[null,null,1]
[null,null,1]
[null,null,1]
[null,null,1]
[null,null,1]
[null,null,1]
[null,null,1]
[null,null,1]
[null,null,1]
[null,null,1]
[null,null,1]
[null,null,1]
[null,null,1]
[null,null,1]
[null,null,1]
[null,null,1]
[null,null,1]
[null,null,1]
[null,null,1]
[null,null,1]
[null,null,1]
[null,null,1]
[null,null,1]
[null,null,1]
[null,null,1]
[null,null,1]
[null,null,1]
[null,null,1]
[null,null,1]
[null,null,1]
[null,null,1]
[null,null,1]
[null,null,1]
[null,null,1]
[null,null,1]
[null,null,1]
[null,null,1]
[null,null,1]
[null,null,1]
[null,null,1]
[null,null,1]
[null,null,1]
[null,null,1]
[null,null,1]
[null,null,1]
[null,null,1]
[null,null,1]
[null,null,1]
[null,null,1]
[null,null,1]
[null,null,1]
[null,null,1]
[null,null,1]
[null,null,1]
[null,null,1]
[null,null,1]
[null,null,1]
[null,null,1]
[null,null,1]
[null,null,1]
[null,null,1]
[null,null,1]
[null,null,1]
[null,null,1]
[null,null,1]
[null,null,1]
[null,null,1]
[null,null,1]
[null,null,1]
[null,null,1]
[null,null,1]
[null,null,1]
[null,null,1]
[null,null,1]
[null,null,1]
[null,null,1]
[null,null,1]
[null,null,1]
[null,null,1]
[null,null,1]
[null,null,1]
[null,null,1]
[null,null,1]
[null,null,1]
[null,null,1]
[null,null,1]
[null,null,1]
[null,null,1]
[null,null,1]
[null,null,1]
[null,null,1]
[null,null,1]
[null,null,1]
[null,null,1]
[null,null,1]
[null,null,1]
[null,null,1]
[null,null,1]
[null,null,1]
[null,null,1]
[null,null,1]
[null,null,1]
[null,null,1]
[null,null,1]
[null,null,1]
[null,null,1]
[null,null,1]
[null,null,1]
[null,null,1]
[null,null,1]
[null,null,1]
[null,null,1]
[null,null,1]
[null,null,1]
[null,null,1]
[null,null,1]
[null,null,1]
[null,null,1]
[null,null,1]
[null,null,1]
[null,null,1]
[null,null,1]
[null,null,1]
[null,null,1]
[null,null,1]
[null,null,1]
[null,null,1]
[null,null,1]
[null,null,1]
[null,null,1]
[null,null,1]
[null,null,1]
[null,null,1]
[null,null,1]
[null,null,1]
[null,null,1]
[null,null,1]
[null,null,1]
[null,null,1]
[null,null,1]
[null,null,1]
[null,null,1]
[null,null,1]
[null,null,1]
[null,null,1]
[null,null,1]
[null,null,1]
[null,null,1]
[null,null,1]
[null,null,1]
[null,null,1]
[null,null,1]
[null,null,1]
[null,null,1]
[null,null,1]
[null,null,1]
[null,null,1]
[null,null,1]
[null,null,1]
[null,null,1]
[null,null,1]
[null,null,1]
[null,null,1]
[null,null,1]
[null,null,1]
[null,null,1]
[null,null,1]
[null,null,1]
[null,null,1]
[null,null,1]
[null,null,1]
[null,null,1]
[null,null,1]
[null,null,1]
[null,null,1]
[null,null,1]
[null,null,1]
[null,null,1]
[null,null,1]
[null,null,1]
[null,null,1]
[null,null,1]
[null,null,1]
[null,null,1]
[null,null,1]
[null,null,1]
[null,null,1]
[null,null,1]
[null,null,1]
[null,null,1]
[null,null,1]
[null,null,1]
[null,null,1]
[null,null,1]
[null,null,1]
[null,null,1]
[null,null,1]
[null,null,1]
[null,null,1]
[null,null,1]
[null,null,1]
[null,null,1]
[null,null,1]
[null,null,1]
[null,null,1]
[null,null,1]
[null,null,1]
[null,null,1]
[null,null,1]
[null,null,1]
[null,null,1]
[null,null,1]
[null,null,1]
[null,null,1]
[null,null,1]
[null,null,1]
[null,null,1]
[null,null,1]
[null,null,1]
[null,null,1]
[null,null,1]
[null,null,1]
[null,null,1]
[null,null,1]
[null,null,1]
[null,null,1]
[null,null,1]
[null,null,1]
[null,null,1]
[null,null,1]
[null,null,1]
[null,null,1]
[null,null,1]
[null,null,1]
[null,null,1]
[null,null,1]
[null,null,1]
[null,null,1]
[null,null,1]
[null,null,1]
[null,null,1]
[null,null,1]
[null,null,1]
[null,null,1]
[null,null,1]
[null,null,1]
[null,null,1]
[null,null,1]
[null,null,1]
[null,null,1]
[null,null,1]
[null,null,1]
[null,null,1]
[null,null,1]
[null,null,1]
[null,null,1]
[null,null,1]
[null,null,1]
[null,null,1]
[null,null,1]
[null,null,1]
[null,null,1]
[null,null,1]
[null,null,1]
[null,null,1]
[null,null,1]
[null,null,1]
[null,null,1]
[null,null,1]
[null,null,1]
[null,null,1]
[null,null,1]
[null,null,1]
[null,null,1]
[null,null,1]
[null,null,1]
[null,null,1]
[null,null,1]
[null,null,1]
[null,null,1]
[null,null,1]
[null,null,1]
[null,null,1]
[null,null,1]
[null,null,1]
[null,null,1]
[null,null,1]
[null,null,1]
[null,null,1]
[null,null,1]
[null,null,1]
[null,null,1]
[null,null,1]
[null,null,1]
[null,null,1]
[null,null,1]
[null,null,1]
[null,null,1]
[null,null,1]
[null,null,1]
[null,null,1]
[null,null,1]
[null,null,1]
[null,null,1]
[null,null,1]