{"text_format":"1","workbook":"xlsx","n_sheets":3,"sheets":["1 (2)","1","all"],"not_rendered":{"charts":0,"images":0,"macros":1,"external_links":1,"defined_names":4,"comments":0,"pivot_tables":0},"unopened":[],"bounds":{"document_bytes":16777216,"sheet_cells":100000,"rows_first":2000,"rows_last":500,"rows_between":2000,"halvings":0,"cell_chars":16384,"cell_head_chars":4096},"cells_cut":0,"cells_raw":0,"read":"whole","date_system":"1900"}

{"sheet":"1 (2)","index":0,"n_rows":200,"n_cols":24,"rows_kept":200,"cut":false,"hidden":false,"merged":[[4,5,4,6],[4,12,4,13],[3,0,3,1],[3,5,3,6],[3,12,3,13],[0,0,0,1],[0,2,0,3],[0,8,0,10],[9,5,9,6],[9,12,9,13],[10,5,10,6],[10,12,10,13],[7,5,7,6],[7,12,7,13],[8,5,8,6],[8,12,8,13],[5,5,5,6],[5,12,5,13],[6,5,6,6],[6,12,6,13],[15,5,15,6],[15,12,15,13],[16,5,16,6],[16,12,16,13],[13,5,13,6],[13,12,13,13],[14,5,14,6],[14,12,14,13],[11,5,11,6],[11,12,11,13],[12,5,12,6],[12,12,12,13],[21,5,21,6],[21,12,21,13],[22,5,22,6],[22,12,22,13],[19,5,19,6],[19,12,19,13],[20,5,20,6],[20,12,20,13],[17,5,17,6],[17,12,17,13],[18,5,18,6],[18,12,18,13],[27,5,27,6],[27,12,27,13],[28,5,28,6],[28,12,28,13],[25,5,25,6],[25,12,25,13],[26,5,26,6],[26,12,26,13],[23,5,23,6],[23,12,23,13],[24,5,24,6],[24,12,24,13],[33,5,33,6],[33,12,33,13],[34,5,34,6],[34,12,34,13],[31,5,31,6],[31,12,31,13],[32,5,32,6],[32,12,32,13],[29,5,29,6],[29,12,29,13],[30,5,30,6],[30,12,30,13],[37,5,37,6],[37,12,37,13],[38,5,38,6],[38,12,38,13],[39,5,39,6],[39,12,39,13],[35,5,35,6],[35,12,35,13],[36,5,36,6],[36,12,36,13],[43,5,43,6],[43,12,43,13],[44,5,44,6],[44,12,44,13],[45,5,45,6],[45,12,45,13],[40,5,40,6],[40,12,40,13],[41,5,41,6],[41,12,41,13],[42,5,42,6],[42,12,42,13],[49,5,49,6],[49,12,49,13],[50,5,50,6],[50,12,50,13],[51,5,51,6],[51,12,51,13],[46,5,46,6],[46,12,46,13],[47,5,47,6],[47,12,47,13],[48,5,48,6],[48,12,48,13],[55,5,55,6],[55,12,55,13],[56,5,56,6],[56,12,56,13],[57,5,57,6],[57,12,57,13],[52,5,52,6],[52,12,52,13],[53,5,53,6],[53,12,53,13],[54,5,54,6],[54,12,54,13],[61,5,61,6],[61,12,61,13],[62,5,62,6],[62,12,62,13],[63,5,63,6],[63,12,63,13],[58,5,58,6],[58,12,58,13],[59,5,59,6],[59,12,59,13],[60,5,60,6],[60,12,60,13],[67,5,67,6],[67,12,67,13],[68,5,68,6],[68,12,68,13],[69,5,69,6],[69,12,69,13],[64,5,64,6],[64,12,64,13],[65,5,65,6],[65,12,65,13],[66,5,66,6],[66,12,66,13],[73,5,73,6],[73,12,73,13],[74,5,74,6],[74,12,74,13],[75,5,75,6],[75,12,75,13],[70,5,70,6],[70,12,70,13],[71,5,71,6],[71,12,71,13],[72,5,72,6],[72,12,72,13],[79,5,79,6],[79,12,79,13],[80,5,80,6],[80,12,80,13],[81,5,81,6],[81,12,81,13],[76,5,76,6],[76,12,76,13],[77,5,77,6],[77,12,77,13],[78,5,78,6],[78,12,78,13],[85,5,85,6],[85,12,85,13],[86,5,86,6],[86,12,86,13],[87,5,87,6],[87,12,87,13],[82,5,82,6],[82,12,82,13],[83,5,83,6],[83,12,83,13],[84,5,84,6],[84,12,84,13],[91,5,91,6],[91,12,91,13],[92,5,92,6],[92,12,92,13],[93,5,93,6],[93,12,93,13],[88,5,88,6],[88,12,88,13],[89,5,89,6],[89,12,89,13],[90,5,90,6],[90,12,90,13],[97,5,97,6],[97,12,97,13],[98,5,98,6],[98,12,98,13],[99,5,99,6],[99,12,99,13],[94,5,94,6],[94,12,94,13],[95,5,95,6],[95,12,95,13],[96,5,96,6],[96,12,96,13],[103,5,103,6],[103,12,103,13],[104,5,104,6],[104,12,104,13],[105,5,105,6],[105,12,105,13],[100,5,100,6],[100,12,100,13],[101,5,101,6],[101,12,101,13],[102,5,102,6],[102,12,102,13],[109,5,109,6],[109,12,109,13],[110,5,110,6],[110,12,110,13],[111,5,111,6],[111,12,111,13],[106,5,106,6],[106,12,106,13],[107,5,107,6],[107,12,107,13],[108,5,108,6],[108,12,108,13],[115,5,115,6],[115,12,115,13],[116,5,116,6],[116,12,116,13],[117,5,117,6],[117,12,117,13],[112,5,112,6],[112,12,112,13],[113,5,113,6],[113,12,113,13],[114,5,114,6],[114,12,114,13],[121,5,121,6],[121,12,121,13],[122,5,122,6],[122,12,122,13],[123,5,123,6],[123,12,123,13],[118,5,118,6],[118,12,118,13],[119,5,119,6],[119,12,119,13],[120,5,120,6],[120,12,120,13],[127,5,127,6],[127,12,127,13],[128,5,128,6],[128,12,128,13],[129,5,129,6],[129,12,129,13],[124,5,124,6],[124,12,124,13],[125,5,125,6],[125,12,125,13],[126,5,126,6],[126,12,126,13],[133,5,133,6],[133,12,133,13],[134,5,134,6],[134,12,134,13],[135,5,135,6],[135,12,135,13],[130,5,130,6],[130,12,130,13],[131,5,131,6],[131,12,131,13],[132,5,132,6],[132,12,132,13],[139,5,139,6],[139,12,139,13],[140,5,140,6],[140,12,140,13],[141,5,141,6],[141,12,141,13],[136,5,136,6],[136,12,136,13],[137,5,137,6],[137,12,137,13],[138,5,138,6],[138,12,138,13],[145,5,145,6],[145,12,145,13],[146,5,146,6],[146,12,146,13],[147,5,147,6],[147,12,147,13],[142,5,142,6],[142,12,142,13],[143,5,143,6],[143,12,143,13],[144,5,144,6],[144,12,144,13],[151,5,151,6],[151,12,151,13],[152,5,152,6],[152,12,152,13],[153,5,153,6],[153,12,153,13],[148,5,148,6],[148,12,148,13],[149,5,149,6],[149,12,149,13],[150,5,150,6],[150,12,150,13],[157,5,157,6],[157,12,157,13],[158,5,158,6],[158,12,158,13],[159,5,159,6],[159,12,159,13],[154,5,154,6],[154,12,154,13],[155,5,155,6],[155,12,155,13],[156,5,156,6],[156,12,156,13],[163,5,163,6],[163,12,163,13],[164,5,164,6],[164,12,164,13],[165,5,165,6],[165,12,165,13],[160,5,160,6],[160,12,160,13],[161,5,161,6],[161,12,161,13],[162,5,162,6],[162,12,162,13],[169,5,169,6],[169,12,169,13],[170,5,170,6],[170,12,170,13],[171,5,171,6],[171,12,171,13],[166,5,166,6],[166,12,166,13],[167,5,167,6],[167,12,167,13],[168,5,168,6],[168,12,168,13],[175,5,175,6],[175,12,175,13],[176,5,176,6],[176,12,176,13],[177,5,177,6],[177,12,177,13],[172,5,172,6],[172,12,172,13],[173,5,173,6],[173,12,173,13],[174,5,174,6],[174,12,174,13],[181,5,181,6],[181,12,181,13],[182,5,182,6],[182,12,182,13],[183,5,183,6],[183,12,183,13],[178,5,178,6],[178,12,178,13],[179,5,179,6],[179,12,179,13],[180,5,180,6],[180,12,180,13],[188,12,188,13],[189,12,189,13],[190,12,190,13],[191,12,191,13],[192,12,192,13],[193,12,193,13],[184,5,184,6],[184,12,184,13],[185,5,185,6],[185,12,185,13],[186,12,186,13],[187,12,187,13],[197,5,197,6],[197,12,197,13],[198,5,198,6],[198,12,198,13],[199,5,199,6],[199,12,199,13],[194,5,194,6],[194,12,194,13],[195,5,195,6],[195,12,195,13],[196,5,196,6],[196,12,196,13]]}
["ORDER NO.",null,{"$f":"RIGHT(CELL(\"filename\",A1),LEN(CELL(\"filename\",A1))-FIND(\"]\",CELL(\"filename\",A1)))","v":"1 (2)"},null,"CUS.NAME","حسام",{"$f":"IFERROR(VLOOKUP(F1,#REF!,2,FALSE),\"\")","v":""},"DATE","2020-03-05"]
[null,null,"اريد ان يقبل اى اسم شيت",null,null,"خطا عند الترحيل"]
[]
[null,null,"MODEL",null,null,"السريال",null,null,null,"MODEL",null,"CODE","السريال",null,"CORRECT",null,null,null,null,null,null,"التاريخ","العميل","رقم الاذن"]
[null,null,{"$f":"IF(F5<>\"\",IFERROR(VLOOKUP(RIGHT(LEFT(F5,FIND(\"/\",F5)-1),4),#REF!,2,FALSE),\"الكود غير صحيح\"),\"\")","v":"الكود غير صحيح"},null,null,1,null,null,null,{"$f":"IF(M5<>\"\",IFERROR(VLOOKUP(RIGHT(LEFT(M5,FIND(\"/\",M5)-1),4),#REF!,2,FALSE),\"الكود غير صحيح\"),\"\")","v":"الكود غير صحيح"},null,{"$f":"IFERROR(MID(M5,FIND(\"/\",M5)-4,4),\"\")","v":""},3,null,{"$f":"IF(C5<>\"\",IF(VLOOKUP(E5,#REF!,8,FALSE)=L5,\"OK\",\"CHEK\"),\"\")","v":{"$error":"#REF!"}},null,null,null,null,null,null,{"$f":"IF(F5<>\"\",$I$1,\"\")","v":"2020-03-05"},{"$f":"IF(F5<>\"\",$F$1,\"\")","v":"حسام"},{"$f":"IF(F5<>\"\",$C$1,\"\")","v":"1 (2)"}]
[null,null,{"$f":"IF(F6<>\"\",IFERROR(VLOOKUP(RIGHT(LEFT(F6,FIND(\"/\",F6)-1),4),#REF!,2,FALSE),\"الكود غير صحيح\"),\"\")","v":"الكود غير صحيح"},null,null,2,null,null,null,{"$f":"IF(M6<>\"\",IFERROR(VLOOKUP(RIGHT(LEFT(M6,FIND(\"/\",M6)-1),4),#REF!,2,FALSE),\"الكود غير صحيح\"),\"\")","v":"الكود غير صحيح"},null,{"$f":"IFERROR(MID(M6,FIND(\"/\",M6)-4,4),\"\")","v":""},4,null,{"$f":"IF(C6<>\"\",IF(VLOOKUP(E6,#REF!,8,FALSE)=L6,\"OK\",\"CHEK\"),\"\")","v":{"$error":"#REF!"}},null,null,null,null,null,null,{"$f":"IF(F6<>\"\",$I$1,\"\")","v":"2020-03-05"},{"$f":"IF(F6<>\"\",$F$1,\"\")","v":"حسام"},{"$f":"IF(F6<>\"\",$C$1,\"\")","v":"1 (2)"}]
[null,null,{"$f":"IF(F7<>\"\",IFERROR(VLOOKUP(RIGHT(LEFT(F7,FIND(\"/\",F7)-1),4),#REF!,2,FALSE),\"الكود غير صحيح\"),\"\")","v":"الكود غير صحيح"},null,null,3,null,null,null,{"$f":"IF(M7<>\"\",IFERROR(VLOOKUP(RIGHT(LEFT(M7,FIND(\"/\",M7)-1),4),#REF!,2,FALSE),\"الكود غير صحيح\"),\"\")","v":"الكود غير صحيح"},null,"",5,null,{"$f":"IF(C7<>\"\",IF(VLOOKUP(E7,#REF!,8,FALSE)=L7,\"OK\",\"CHEK\"),\"\")","v":{"$error":"#REF!"}},null,null,null,null,null,null,"2020-03-05","حسام","1 (2)"]
[null,null,{"$f":"IF(F8<>\"\",IFERROR(VLOOKUP(RIGHT(LEFT(F8,FIND(\"/\",F8)-1),4),#REF!,2,FALSE),\"الكود غير صحيح\"),\"\")","v":"الكود غير صحيح"},null,null,4,null,null,null,{"$f":"IF(M8<>\"\",IFERROR(VLOOKUP(RIGHT(LEFT(M8,FIND(\"/\",M8)-1),4),#REF!,2,FALSE),\"الكود غير صحيح\"),\"\")","v":"الكود غير صحيح"},null,"",6,null,{"$f":"IF(C8<>\"\",IF(VLOOKUP(E8,#REF!,8,FALSE)=L8,\"OK\",\"CHEK\"),\"\")","v":{"$error":"#REF!"}},null,null,null,null,null,null,"2020-03-05","حسام","1 (2)"]
[null,null,{"$f":"IF(F9<>\"\",IFERROR(VLOOKUP(RIGHT(LEFT(F9,FIND(\"/\",F9)-1),4),#REF!,2,FALSE),\"الكود غير صحيح\"),\"\")","v":"الكود غير صحيح"},null,null,5,null,null,null,{"$f":"IF(M9<>\"\",IFERROR(VLOOKUP(RIGHT(LEFT(M9,FIND(\"/\",M9)-1),4),#REF!,2,FALSE),\"الكود غير صحيح\"),\"\")","v":"الكود غير صحيح"},null,"",7,null,{"$f":"IF(C9<>\"\",IF(VLOOKUP(E9,#REF!,8,FALSE)=L9,\"OK\",\"CHEK\"),\"\")","v":{"$error":"#REF!"}},null,null,null,null,null,null,"2020-03-05","حسام","1 (2)"]
[null,null,{"$f":"IF(F10<>\"\",IFERROR(VLOOKUP(RIGHT(LEFT(F10,FIND(\"/\",F10)-1),4),#REF!,2,FALSE),\"الكود غير صحيح\"),\"\")","v":"الكود غير صحيح"},null,null,6,null,null,null,{"$f":"IF(M10<>\"\",IFERROR(VLOOKUP(RIGHT(LEFT(M10,FIND(\"/\",M10)-1),4),#REF!,2,FALSE),\"الكود غير صحيح\"),\"\")","v":"الكود غير صحيح"},null,"",8,null,{"$f":"IF(C10<>\"\",IF(VLOOKUP(E10,#REF!,8,FALSE)=L10,\"OK\",\"CHEK\"),\"\")","v":{"$error":"#REF!"}},null,null,null,null,null,null,"2020-03-05","حسام","1 (2)"]
[null,null,{"$f":"IF(F11<>\"\",IFERROR(VLOOKUP(RIGHT(LEFT(F11,FIND(\"/\",F11)-1),4),#REF!,2,FALSE),\"الكود غير صحيح\"),\"\")","v":"الكود غير صحيح"},null,null,7,null,null,null,{"$f":"IF(M11<>\"\",IFERROR(VLOOKUP(RIGHT(LEFT(M11,FIND(\"/\",M11)-1),4),#REF!,2,FALSE),\"الكود غير صحيح\"),\"\")","v":"الكود غير صحيح"},null,"",9,null,{"$f":"IF(C11<>\"\",IF(VLOOKUP(E11,#REF!,8,FALSE)=L11,\"OK\",\"CHEK\"),\"\")","v":{"$error":"#REF!"}},null,null,null,null,null,null,"2020-03-05","حسام","1 (2)"]
[null,null,{"$f":"IF(F12<>\"\",IFERROR(VLOOKUP(RIGHT(LEFT(F12,FIND(\"/\",F12)-1),4),#REF!,2,FALSE),\"الكود غير صحيح\"),\"\")","v":"الكود غير صحيح"},null,null,8,null,null,null,{"$f":"IF(M12<>\"\",IFERROR(VLOOKUP(RIGHT(LEFT(M12,FIND(\"/\",M12)-1),4),#REF!,2,FALSE),\"الكود غير صحيح\"),\"\")","v":"الكود غير صحيح"},null,"",10,null,{"$f":"IF(C12<>\"\",IF(VLOOKUP(E12,#REF!,8,FALSE)=L12,\"OK\",\"CHEK\"),\"\")","v":{"$error":"#REF!"}},null,null,null,null,null,null,"2020-03-05","حسام","1 (2)"]
[null,null,{"$f":"IF(F13<>\"\",IFERROR(VLOOKUP(RIGHT(LEFT(F13,FIND(\"/\",F13)-1),4),#REF!,2,FALSE),\"الكود غير صحيح\"),\"\")","v":"الكود غير صحيح"},null,null,9,null,null,null,{"$f":"IF(M13<>\"\",IFERROR(VLOOKUP(RIGHT(LEFT(M13,FIND(\"/\",M13)-1),4),#REF!,2,FALSE),\"الكود غير صحيح\"),\"\")","v":"الكود غير صحيح"},null,"",11,null,{"$f":"IF(C13<>\"\",IF(VLOOKUP(E13,#REF!,8,FALSE)=L13,\"OK\",\"CHEK\"),\"\")","v":{"$error":"#REF!"}},null,null,null,null,null,null,"2020-03-05","حسام","1 (2)"]
[null,null,{"$f":"IF(F14<>\"\",IFERROR(VLOOKUP(RIGHT(LEFT(F14,FIND(\"/\",F14)-1),4),#REF!,2,FALSE),\"الكود غير صحيح\"),\"\")","v":""},null,null,null,null,null,null,{"$f":"IF(M14<>\"\",IFERROR(VLOOKUP(RIGHT(LEFT(M14,FIND(\"/\",M14)-1),4),#REF!,2,FALSE),\"الكود غير صحيح\"),\"\")","v":""},null,"",null,null,{"$f":"IF(C14<>\"\",IF(VLOOKUP(E14,#REF!,8,FALSE)=L14,\"OK\",\"CHEK\"),\"\")","v":""},null,null,null,null,null,null,"","",""]
[null,null,{"$f":"IF(F15<>\"\",IFERROR(VLOOKUP(RIGHT(LEFT(F15,FIND(\"/\",F15)-1),4),#REF!,2,FALSE),\"الكود غير صحيح\"),\"\")","v":""},null,null,null,null,null,null,{"$f":"IF(M15<>\"\",IFERROR(VLOOKUP(RIGHT(LEFT(M15,FIND(\"/\",M15)-1),4),#REF!,2,FALSE),\"الكود غير صحيح\"),\"\")","v":""},null,"",null,null,{"$f":"IF(C15<>\"\",IF(VLOOKUP(E15,#REF!,8,FALSE)=L15,\"OK\",\"CHEK\"),\"\")","v":""},null,null,null,null,null,null,"","",""]
{"$rows_left_out":186}
{"sheet":"1","index":1,"n_rows":200,"n_cols":24,"rows_kept":200,"cut":false,"hidden":false,"merged":[[197,5,197,6],[197,12,197,13],[198,5,198,6],[198,12,198,13],[199,5,199,6],[199,12,199,13],[194,5,194,6],[194,12,194,13],[195,5,195,6],[195,12,195,13],[196,5,196,6],[196,12,196,13],[188,12,188,13],[189,12,189,13],[190,12,190,13],[191,12,191,13],[192,12,192,13],[193,12,193,13],[184,5,184,6],[184,12,184,13],[185,5,185,6],[185,12,185,13],[186,12,186,13],[187,12,187,13],[181,5,181,6],[181,12,181,13],[182,5,182,6],[182,12,182,13],[183,5,183,6],[183,12,183,13],[178,5,178,6],[178,12,178,13],[179,5,179,6],[179,12,179,13],[180,5,180,6],[180,12,180,13],[175,5,175,6],[175,12,175,13],[176,5,176,6],[176,12,176,13],[177,5,177,6],[177,12,177,13],[172,5,172,6],[172,12,172,13],[173,5,173,6],[173,12,173,13],[174,5,174,6],[174,12,174,13],[169,5,169,6],[169,12,169,13],[170,5,170,6],[170,12,170,13],[171,5,171,6],[171,12,171,13],[166,5,166,6],[166,12,166,13],[167,5,167,6],[167,12,167,13],[168,5,168,6],[168,12,168,13],[163,5,163,6],[163,12,163,13],[164,5,164,6],[164,12,164,13],[165,5,165,6],[165,12,165,13],[160,5,160,6],[160,12,160,13],[161,5,161,6],[161,12,161,13],[162,5,162,6],[162,12,162,13],[157,5,157,6],[157,12,157,13],[158,5,158,6],[158,12,158,13],[159,5,159,6],[159,12,159,13],[154,5,154,6],[154,12,154,13],[155,5,155,6],[155,12,155,13],[156,5,156,6],[156,12,156,13],[151,5,151,6],[151,12,151,13],[152,5,152,6],[152,12,152,13],[153,5,153,6],[153,12,153,13],[148,5,148,6],[148,12,148,13],[149,5,149,6],[149,12,149,13],[150,5,150,6],[150,12,150,13],[145,5,145,6],[145,12,145,13],[146,5,146,6],[146,12,146,13],[147,5,147,6],[147,12,147,13],[142,5,142,6],[142,12,142,13],[143,5,143,6],[143,12,143,13],[144,5,144,6],[144,12,144,13],[139,5,139,6],[139,12,139,13],[140,5,140,6],[140,12,140,13],[141,5,141,6],[141,12,141,13],[136,5,136,6],[136,12,136,13],[137,5,137,6],[137,12,137,13],[138,5,138,6],[138,12,138,13],[133,5,133,6],[133,12,133,13],[134,5,134,6],[134,12,134,13],[135,5,135,6],[135,12,135,13],[130,5,130,6],[130,12,130,13],[131,5,131,6],[131,12,131,13],[132,5,132,6],[132,12,132,13],[127,5,127,6],[127,12,127,13],[128,5,128,6],[128,12,128,13],[129,5,129,6],[129,12,129,13],[124,5,124,6],[124,12,124,13],[125,5,125,6],[125,12,125,13],[126,5,126,6],[126,12,126,13],[121,5,121,6],[121,12,121,13],[122,5,122,6],[122,12,122,13],[123,5,123,6],[123,12,123,13],[118,5,118,6],[118,12,118,13],[119,5,119,6],[119,12,119,13],[120,5,120,6],[120,12,120,13],[115,5,115,6],[115,12,115,13],[116,5,116,6],[116,12,116,13],[117,5,117,6],[117,12,117,13],[112,5,112,6],[112,12,112,13],[113,5,113,6],[113,12,113,13],[114,5,114,6],[114,12,114,13],[109,5,109,6],[109,12,109,13],[110,5,110,6],[110,12,110,13],[111,5,111,6],[111,12,111,13],[106,5,106,6],[106,12,106,13],[107,5,107,6],[107,12,107,13],[108,5,108,6],[108,12,108,13],[103,5,103,6],[103,12,103,13],[104,5,104,6],[104,12,104,13],[105,5,105,6],[105,12,105,13],[100,5,100,6],[100,12,100,13],[101,5,101,6],[101,12,101,13],[102,5,102,6],[102,12,102,13],[97,5,97,6],[97,12,97,13],[98,5,98,6],[98,12,98,13],[99,5,99,6],[99,12,99,13],[94,5,94,6],[94,12,94,13],[95,5,95,6],[95,12,95,13],[96,5,96,6],[96,12,96,13],[91,5,91,6],[91,12,91,13],[92,5,92,6],[92,12,92,13],[93,5,93,6],[93,12,93,13],[88,5,88,6],[88,12,88,13],[89,5,89,6],[89,12,89,13],[90,5,90,6],[90,12,90,13],[85,5,85,6],[85,12,85,13],[86,5,86,6],[86,12,86,13],[87,5,87,6],[87,12,87,13],[82,5,82,6],[82,12,82,13],[83,5,83,6],[83,12,83,13],[84,5,84,6],[84,12,84,13],[79,5,79,6],[79,12,79,13],[80,5,80,6],[80,12,80,13],[81,5,81,6],[81,12,81,13],[76,5,76,6],[76,12,76,13],[77,5,77,6],[77,12,77,13],[78,5,78,6],[78,12,78,13],[73,5,73,6],[73,12,73,13],[74,5,74,6],[74,12,74,13],[75,5,75,6],[75,12,75,13],[70,5,70,6],[70,12,70,13],[71,5,71,6],[71,12,71,13],[72,5,72,6],[72,12,72,13],[67,5,67,6],[67,12,67,13],[68,5,68,6],[68,12,68,13],[69,5,69,6],[69,12,69,13],[64,5,64,6],[64,12,64,13],[65,5,65,6],[65,12,65,13],[66,5,66,6],[66,12,66,13],[61,5,61,6],[61,12,61,13],[62,5,62,6],[62,12,62,13],[63,5,63,6],[63,12,63,13],[58,5,58,6],[58,12,58,13],[59,5,59,6],[59,12,59,13],[60,5,60,6],[60,12,60,13],[55,5,55,6],[55,12,55,13],[56,5,56,6],[56,12,56,13],[57,5,57,6],[57,12,57,13],[52,5,52,6],[52,12,52,13],[53,5,53,6],[53,12,53,13],[54,5,54,6],[54,12,54,13],[49,5,49,6],[49,12,49,13],[50,5,50,6],[50,12,50,13],[51,5,51,6],[51,12,51,13],[46,5,46,6],[46,12,46,13],[47,5,47,6],[47,12,47,13],[48,5,48,6],[48,12,48,13],[43,5,43,6],[43,12,43,13],[44,5,44,6],[44,12,44,13],[45,5,45,6],[45,12,45,13],[40,5,40,6],[40,12,40,13],[41,5,41,6],[41,12,41,13],[42,5,42,6],[42,12,42,13],[33,5,33,6],[33,12,33,13],[34,5,34,6],[34,12,34,13],[37,5,37,6],[37,12,37,13],[38,5,38,6],[38,12,38,13],[39,5,39,6],[39,12,39,13],[35,5,35,6],[35,12,35,13],[36,5,36,6],[36,12,36,13],[26,5,26,6],[26,12,26,13],[27,5,27,6],[27,12,27,13],[28,5,28,6],[28,12,28,13],[31,5,31,6],[31,12,31,13],[32,5,32,6],[32,12,32,13],[29,5,29,6],[29,12,29,13],[30,5,30,6],[30,12,30,13],[21,5,21,6],[21,12,21,13],[22,5,22,6],[22,12,22,13],[23,5,23,6],[23,12,23,13],[24,5,24,6],[24,12,24,13],[25,5,25,6],[25,12,25,13],[16,5,16,6],[16,12,16,13],[17,5,17,6],[17,12,17,13],[18,5,18,6],[18,12,18,13],[19,5,19,6],[19,12,19,13],[20,5,20,6],[20,12,20,13],[11,5,11,6],[11,12,11,13],[12,5,12,6],[12,12,12,13],[13,5,13,6],[13,12,13,13],[14,5,14,6],[14,12,14,13],[15,5,15,6],[15,12,15,13],[6,5,6,6],[6,12,6,13],[7,5,7,6],[7,12,7,13],[8,5,8,6],[8,12,8,13],[9,5,9,6],[9,12,9,13],[10,5,10,6],[10,12,10,13],[3,5,3,6],[3,12,3,13],[0,0,0,1],[0,2,0,3],[0,8,0,10],[3,0,3,1],[4,5,4,6],[4,12,4,13],[5,5,5,6],[5,12,5,13]]}
["ORDER NO.",null,{"$f":"RIGHT(CELL(\"filename\",A1),LEN(CELL(\"filename\",A1))-FIND(\"]\",CELL(\"filename\",A1)))","v":"1"},null,"CUS.NAME","حسام",{"$f":"IFERROR(VLOOKUP(F1,#REF!,2,FALSE),\"\")","v":""},"DATE","2020-03-05"]
[null,null,null,null,null,"تم الترحيل لان الاسم هو المدرج فى الماكرو"]
[]
[null,null,"MODEL",null,null,"السريال",null,null,null,"MODEL",null,"CODE","السريال",null,"CORRECT",null,null,null,null,null,null,"التاريخ","العميل","رقم الاذن"]
[null,null,{"$f":"IF(F5<>\"\",IFERROR(VLOOKUP(RIGHT(LEFT(F5,FIND(\"/\",F5)-1),4),#REF!,2,FALSE),\"الكود غير صحيح\"),\"\")","v":""},null,null,null,null,null,null,{"$f":"IF(M5<>\"\",IFERROR(VLOOKUP(RIGHT(LEFT(M5,FIND(\"/\",M5)-1),4),#REF!,2,FALSE),\"الكود غير صحيح\"),\"\")","v":""},null,{"$f":"IFERROR(MID(M5,FIND(\"/\",M5)-4,4),\"\")","v":""},null,null,{"$f":"IF(C5<>\"\",IF(VLOOKUP(E5,#REF!,8,FALSE)=L5,\"OK\",\"CHEK\"),\"\")","v":""},null,null,null,null,null,null,{"$f":"IF(F5<>\"\",$I$1,\"\")","v":""},{"$f":"IF(F5<>\"\",$F$1,\"\")","v":""},{"$f":"IF(F5<>\"\",$C$1,\"\")","v":""}]
[null,null,{"$f":"IF(F6<>\"\",IFERROR(VLOOKUP(RIGHT(LEFT(F6,FIND(\"/\",F6)-1),4),#REF!,2,FALSE),\"الكود غير صحيح\"),\"\")","v":""},null,null,null,null,null,null,{"$f":"IF(M6<>\"\",IFERROR(VLOOKUP(RIGHT(LEFT(M6,FIND(\"/\",M6)-1),4),#REF!,2,FALSE),\"الكود غير صحيح\"),\"\")","v":""},null,{"$f":"IFERROR(MID(M6,FIND(\"/\",M6)-4,4),\"\")","v":""},null,null,{"$f":"IF(C6<>\"\",IF(VLOOKUP(E6,#REF!,8,FALSE)=L6,\"OK\",\"CHEK\"),\"\")","v":""},null,null,null,null,null,null,{"$f":"IF(F6<>\"\",$I$1,\"\")","v":""},{"$f":"IF(F6<>\"\",$F$1,\"\")","v":""},{"$f":"IF(F6<>\"\",$C$1,\"\")","v":""}]
[null,null,{"$f":"IF(F7<>\"\",IFERROR(VLOOKUP(RIGHT(LEFT(F7,FIND(\"/\",F7)-1),4),#REF!,2,FALSE),\"الكود غير صحيح\"),\"\")","v":""},null,null,null,null,null,null,{"$f":"IF(M7<>\"\",IFERROR(VLOOKUP(RIGHT(LEFT(M7,FIND(\"/\",M7)-1),4),#REF!,2,FALSE),\"الكود غير صحيح\"),\"\")","v":""},null,"",null,null,{"$f":"IF(C7<>\"\",IF(VLOOKUP(E7,#REF!,8,FALSE)=L7,\"OK\",\"CHEK\"),\"\")","v":""},null,null,null,null,null,null,"","",""]
[null,null,{"$f":"IF(F8<>\"\",IFERROR(VLOOKUP(RIGHT(LEFT(F8,FIND(\"/\",F8)-1),4),#REF!,2,FALSE),\"الكود غير صحيح\"),\"\")","v":""},null,null,null,null,null,null,{"$f":"IF(M8<>\"\",IFERROR(VLOOKUP(RIGHT(LEFT(M8,FIND(\"/\",M8)-1),4),#REF!,2,FALSE),\"الكود غير صحيح\"),\"\")","v":""},null,"",null,null,{"$f":"IF(C8<>\"\",IF(VLOOKUP(E8,#REF!,8,FALSE)=L8,\"OK\",\"CHEK\"),\"\")","v":""},null,null,null,null,null,null,"","",""]
[null,null,{"$f":"IF(F9<>\"\",IFERROR(VLOOKUP(RIGHT(LEFT(F9,FIND(\"/\",F9)-1),4),#REF!,2,FALSE),\"الكود غير صحيح\"),\"\")","v":""},null,null,null,null,null,null,{"$f":"IF(M9<>\"\",IFERROR(VLOOKUP(RIGHT(LEFT(M9,FIND(\"/\",M9)-1),4),#REF!,2,FALSE),\"الكود غير صحيح\"),\"\")","v":""},null,"",null,null,{"$f":"IF(C9<>\"\",IF(VLOOKUP(E9,#REF!,8,FALSE)=L9,\"OK\",\"CHEK\"),\"\")","v":""},null,null,null,null,null,null,"","",""]
[null,null,{"$f":"IF(F10<>\"\",IFERROR(VLOOKUP(RIGHT(LEFT(F10,FIND(\"/\",F10)-1),4),#REF!,2,FALSE),\"الكود غير صحيح\"),\"\")","v":""},null,null,null,null,null,null,{"$f":"IF(M10<>\"\",IFERROR(VLOOKUP(RIGHT(LEFT(M10,FIND(\"/\",M10)-1),4),#REF!,2,FALSE),\"الكود غير صحيح\"),\"\")","v":""},null,"",null,null,{"$f":"IF(C10<>\"\",IF(VLOOKUP(E10,#REF!,8,FALSE)=L10,\"OK\",\"CHEK\"),\"\")","v":""},null,null,null,null,null,null,"","",""]
[null,null,{"$f":"IF(F11<>\"\",IFERROR(VLOOKUP(RIGHT(LEFT(F11,FIND(\"/\",F11)-1),4),#REF!,2,FALSE),\"الكود غير صحيح\"),\"\")","v":""},null,null,null,null,null,null,{"$f":"IF(M11<>\"\",IFERROR(VLOOKUP(RIGHT(LEFT(M11,FIND(\"/\",M11)-1),4),#REF!,2,FALSE),\"الكود غير صحيح\"),\"\")","v":""},null,"",null,null,{"$f":"IF(C11<>\"\",IF(VLOOKUP(E11,#REF!,8,FALSE)=L11,\"OK\",\"CHEK\"),\"\")","v":""},null,null,null,null,null,null,"","",""]
[null,null,{"$f":"IF(F12<>\"\",IFERROR(VLOOKUP(RIGHT(LEFT(F12,FIND(\"/\",F12)-1),4),#REF!,2,FALSE),\"الكود غير صحيح\"),\"\")","v":""},null,null,null,null,null,null,{"$f":"IF(M12<>\"\",IFERROR(VLOOKUP(RIGHT(LEFT(M12,FIND(\"/\",M12)-1),4),#REF!,2,FALSE),\"الكود غير صحيح\"),\"\")","v":""},null,"",null,null,{"$f":"IF(C12<>\"\",IF(VLOOKUP(E12,#REF!,8,FALSE)=L12,\"OK\",\"CHEK\"),\"\")","v":""},null,null,null,null,null,null,"","",""]
[null,null,{"$f":"IF(F13<>\"\",IFERROR(VLOOKUP(RIGHT(LEFT(F13,FIND(\"/\",F13)-1),4),#REF!,2,FALSE),\"الكود غير صحيح\"),\"\")","v":""},null,null,null,null,null,null,{"$f":"IF(M13<>\"\",IFERROR(VLOOKUP(RIGHT(LEFT(M13,FIND(\"/\",M13)-1),4),#REF!,2,FALSE),\"الكود غير صحيح\"),\"\")","v":""},null,"",null,null,{"$f":"IF(C13<>\"\",IF(VLOOKUP(E13,#REF!,8,FALSE)=L13,\"OK\",\"CHEK\"),\"\")","v":""},null,null,null,null,null,null,"","",""]
[null,null,{"$f":"IF(F14<>\"\",IFERROR(VLOOKUP(RIGHT(LEFT(F14,FIND(\"/\",F14)-1),4),#REF!,2,FALSE),\"الكود غير صحيح\"),\"\")","v":""},null,null,null,null,null,null,{"$f":"IF(M14<>\"\",IFERROR(VLOOKUP(RIGHT(LEFT(M14,FIND(\"/\",M14)-1),4),#REF!,2,FALSE),\"الكود غير صحيح\"),\"\")","v":""},null,"",null,null,{"$f":"IF(C14<>\"\",IF(VLOOKUP(E14,#REF!,8,FALSE)=L14,\"OK\",\"CHEK\"),\"\")","v":""},null,null,null,null,null,null,"","",""]
[null,null,{"$f":"IF(F15<>\"\",IFERROR(VLOOKUP(RIGHT(LEFT(F15,FIND(\"/\",F15)-1),4),#REF!,2,FALSE),\"الكود غير صحيح\"),\"\")","v":""},null,null,null,null,null,null,{"$f":"IF(M15<>\"\",IFERROR(VLOOKUP(RIGHT(LEFT(M15,FIND(\"/\",M15)-1),4),#REF!,2,FALSE),\"الكود غير صحيح\"),\"\")","v":""},null,"",null,null,{"$f":"IF(C15<>\"\",IF(VLOOKUP(E15,#REF!,8,FALSE)=L15,\"OK\",\"CHEK\"),\"\")","v":""},null,null,null,null,null,null,"","",""]
{"$rows_left_out":186}
{"sheet":"all","index":2,"n_rows":279,"n_cols":15,"rows_kept":279,"cut":false,"hidden":false,"merged":[]}
["الشيت المرحل له",1,1,1,1,1,1,1,1,1,1,1,1,1,1]
[1,1,1,1,1,1,1,1,1,1,1,1,1,1,1]
[1,"الكود غير صحيح",3,"الكود غير صحيح",43895,"حسام","1"]
[2,"الكود غير صحيح",4,"الكود غير صحيح",43895,"حسام","1"]
[3,"الكود غير صحيح",5,"الكود غير صحيح",43895,"حسام","1"]
[4,"الكود غير صحيح",6,"الكود غير صحيح",43895,"حسام","1"]
[5,"الكود غير صحيح",7,"الكود غير صحيح",43895,"حسام","1"]
[6,"الكود غير صحيح",8,"الكود غير صحيح",43895,"حسام","1"]
[7,"الكود غير صحيح",9,"الكود غير صحيح",43895,"حسام","1"]
[8,"الكود غير صحيح",10,"الكود غير صحيح",43895,"حسام","1"]
[9,"الكود غير صحيح",11,"الكود غير صحيح",43895,"حسام","1"]
[null,"",null,"","","",""]
[null,"",null,"","","",""]
[null,"",null,"","","",""]
[null,"",null,"","","",""]
{"$rows_left_out":264}