{"text_format":"1","workbook":"xlsx","n_sheets":3,"sheets":["ورقة1","ورقة2","ورقة3"],"not_rendered":{"charts":0,"images":4,"macros":1,"external_links":0,"defined_names":2,"comments":0,"pivot_tables":0},"unopened":[],"bounds":{"document_bytes":16777216,"sheet_cells":100000,"rows_first":2000,"rows_last":500,"rows_between":2000,"halvings":0,"cell_chars":16384,"cell_head_chars":4096},"cells_cut":0,"cells_raw":0,"read":"whole","date_system":"1900"}

{"sheet":"ورقة1","index":0,"n_rows":589,"n_cols":2,"rows_kept":589,"cut":false,"hidden":false,"merged":[]}
["احمد ",{"$f":"INDEX($A:$A,ROW(A1)*5-5+COLUMN(A1))","v":"احمد "}]
["سعيد"]
["نادر"]
["حسان"]
["همام"]
["محمد"]
["احمد "]
["احمد "]
["سعيد"]
["نادر"]
["حسان"]
["همام"]
["محمد"]
["احمد "]
["احمد "]
["سعيد"]
["نادر"]
["حسان"]
["همام"]
["محمد"]
["احمد "]
["احمد "]
["سعيد"]
["نادر"]
["حسان"]
["همام"]
["محمد"]
["احمد "]
["احمد "]
["سعيد"]
{"$rows_left_out":560}
{"sheet":"ورقة2","index":1,"n_rows":118,"n_cols":9,"rows_kept":118,"cut":false,"hidden":false,"merged":[]}
[{"$f":"INDEX(ورقة1!$A:$A,ROW(ورقة1!A1)*5-5+COLUMN(ورقة1!A1))","v":"احمد "},{"$f":"INDEX(ورقة1!$A:$A,ROW(ورقة1!B1)*5-5+COLUMN(ورقة1!B1))","v":"سعيد"},{"$f":"INDEX(ورقة1!$A:$A,ROW(ورقة1!C1)*5-5+COLUMN(ورقة1!C1))","v":"نادر"},{"$f":"INDEX(ورقة1!$A:$A,ROW(ورقة1!D1)*5-5+COLUMN(ورقة1!D1))","v":"حسان"},{"$f":"INDEX(ورقة1!$A:$A,ROW(ورقة1!E1)*5-5+COLUMN(ورقة1!E1))","v":"همام"},{"$f":"INDEX(ورقة1!$A:$A,ROW(ورقة1!F1)*5-5+COLUMN(ورقة1!F1))","v":"محمد"},{"$f":"INDEX(ورقة1!$A:$A,ROW(ورقة1!G1)*5-5+COLUMN(ورقة1!G1))","v":"احمد "},{"$f":"INDEX(ورقة1!$A:$A,ROW(ورقة1!H1)*5-5+COLUMN(ورقة1!H1))","v":"احمد "},{"$f":"INDEX(ورقة1!$A:$A,ROW(ورقة1!I1)*5-5+COLUMN(ورقة1!I1))","v":"سعيد"}]
[{"$f":"INDEX(ورقة1!$A:$A,ROW(ورقة1!A2)*5-5+COLUMN(ورقة1!A2))","v":"محمد"},{"$f":"INDEX(ورقة1!$A:$A,ROW(ورقة1!B2)*5-5+COLUMN(ورقة1!B2))","v":"احمد "},{"$f":"INDEX(ورقة1!$A:$A,ROW(ورقة1!C2)*5-5+COLUMN(ورقة1!C2))","v":"احمد "},{"$f":"INDEX(ورقة1!$A:$A,ROW(ورقة1!D2)*5-5+COLUMN(ورقة1!D2))","v":"سعيد"},{"$f":"INDEX(ورقة1!$A:$A,ROW(ورقة1!E2)*5-5+COLUMN(ورقة1!E2))","v":"نادر"},{"$f":"INDEX(ورقة1!$A:$A,ROW(ورقة1!F2)*5-5+COLUMN(ورقة1!F2))","v":"حسان"},{"$f":"INDEX(ورقة1!$A:$A,ROW(ورقة1!G2)*5-5+COLUMN(ورقة1!G2))","v":"همام"},{"$f":"INDEX(ورقة1!$A:$A,ROW(ورقة1!H2)*5-5+COLUMN(ورقة1!H2))","v":"محمد"},{"$f":"INDEX(ورقة1!$A:$A,ROW(ورقة1!I2)*5-5+COLUMN(ورقة1!I2))","v":"احمد "}]
[{"$f":"INDEX(ورقة1!$A:$A,ROW(ورقة1!A3)*5-5+COLUMN(ورقة1!A3))","v":"حسان"},{"$f":"INDEX(ورقة1!$A:$A,ROW(ورقة1!B3)*5-5+COLUMN(ورقة1!B3))","v":"همام"},{"$f":"INDEX(ورقة1!$A:$A,ROW(ورقة1!C3)*5-5+COLUMN(ورقة1!C3))","v":"محمد"},{"$f":"INDEX(ورقة1!$A:$A,ROW(ورقة1!D3)*5-5+COLUMN(ورقة1!D3))","v":"احمد "},{"$f":"INDEX(ورقة1!$A:$A,ROW(ورقة1!E3)*5-5+COLUMN(ورقة1!E3))","v":"احمد "},{"$f":"INDEX(ورقة1!$A:$A,ROW(ورقة1!F3)*5-5+COLUMN(ورقة1!F3))","v":"سعيد"},{"$f":"INDEX(ورقة1!$A:$A,ROW(ورقة1!G3)*5-5+COLUMN(ورقة1!G3))","v":"نادر"},{"$f":"INDEX(ورقة1!$A:$A,ROW(ورقة1!H3)*5-5+COLUMN(ورقة1!H3))","v":"حسان"},{"$f":"INDEX(ورقة1!$A:$A,ROW(ورقة1!I3)*5-5+COLUMN(ورقة1!I3))","v":"همام"}]
[{"$f":"INDEX(ورقة1!$A:$A,ROW(ورقة1!A4)*5-5+COLUMN(ورقة1!A4))","v":"سعيد"},{"$f":"INDEX(ورقة1!$A:$A,ROW(ورقة1!B4)*5-5+COLUMN(ورقة1!B4))","v":"نادر"},{"$f":"INDEX(ورقة1!$A:$A,ROW(ورقة1!C4)*5-5+COLUMN(ورقة1!C4))","v":"حسان"},{"$f":"INDEX(ورقة1!$A:$A,ROW(ورقة1!D4)*5-5+COLUMN(ورقة1!D4))","v":"همام"},{"$f":"INDEX(ورقة1!$A:$A,ROW(ورقة1!E4)*5-5+COLUMN(ورقة1!E4))","v":"محمد"},{"$f":"INDEX(ورقة1!$A:$A,ROW(ورقة1!F4)*5-5+COLUMN(ورقة1!F4))","v":"احمد "},{"$f":"INDEX(ورقة1!$A:$A,ROW(ورقة1!G4)*5-5+COLUMN(ورقة1!G4))","v":"احمد "},{"$f":"INDEX(ورقة1!$A:$A,ROW(ورقة1!H4)*5-5+COLUMN(ورقة1!H4))","v":"سعيد"},{"$f":"INDEX(ورقة1!$A:$A,ROW(ورقة1!I4)*5-5+COLUMN(ورقة1!I4))","v":"نادر"}]
[{"$f":"INDEX(ورقة1!$A:$A,ROW(ورقة1!A5)*5-5+COLUMN(ورقة1!A5))","v":"احمد "},{"$f":"INDEX(ورقة1!$A:$A,ROW(ورقة1!B5)*5-5+COLUMN(ورقة1!B5))","v":"احمد "},{"$f":"INDEX(ورقة1!$A:$A,ROW(ورقة1!C5)*5-5+COLUMN(ورقة1!C5))","v":"سعيد"},{"$f":"INDEX(ورقة1!$A:$A,ROW(ورقة1!D5)*5-5+COLUMN(ورقة1!D5))","v":"نادر"},{"$f":"INDEX(ورقة1!$A:$A,ROW(ورقة1!E5)*5-5+COLUMN(ورقة1!E5))","v":"حسان"},{"$f":"INDEX(ورقة1!$A:$A,ROW(ورقة1!F5)*5-5+COLUMN(ورقة1!F5))","v":"همام"},{"$f":"INDEX(ورقة1!$A:$A,ROW(ورقة1!G5)*5-5+COLUMN(ورقة1!G5))","v":"محمد"},{"$f":"INDEX(ورقة1!$A:$A,ROW(ورقة1!H5)*5-5+COLUMN(ورقة1!H5))","v":"احمد "},{"$f":"INDEX(ورقة1!$A:$A,ROW(ورقة1!I5)*5-5+COLUMN(ورقة1!I5))","v":"احمد "}]
[{"$f":"INDEX(ورقة1!$A:$A,ROW(ورقة1!A6)*5-5+COLUMN(ورقة1!A6))","v":"همام"},{"$f":"INDEX(ورقة1!$A:$A,ROW(ورقة1!B6)*5-5+COLUMN(ورقة1!B6))","v":"محمد"},{"$f":"INDEX(ورقة1!$A:$A,ROW(ورقة1!C6)*5-5+COLUMN(ورقة1!C6))","v":"احمد "},{"$f":"INDEX(ورقة1!$A:$A,ROW(ورقة1!D6)*5-5+COLUMN(ورقة1!D6))","v":"احمد "},{"$f":"INDEX(ورقة1!$A:$A,ROW(ورقة1!E6)*5-5+COLUMN(ورقة1!E6))","v":"سعيد"},{"$f":"INDEX(ورقة1!$A:$A,ROW(ورقة1!F6)*5-5+COLUMN(ورقة1!F6))","v":"نادر"},{"$f":"INDEX(ورقة1!$A:$A,ROW(ورقة1!G6)*5-5+COLUMN(ورقة1!G6))","v":"حسان"},{"$f":"INDEX(ورقة1!$A:$A,ROW(ورقة1!H6)*5-5+COLUMN(ورقة1!H6))","v":"همام"},{"$f":"INDEX(ورقة1!$A:$A,ROW(ورقة1!I6)*5-5+COLUMN(ورقة1!I6))","v":"محمد"}]
[{"$f":"INDEX(ورقة1!$A:$A,ROW(ورقة1!A7)*5-5+COLUMN(ورقة1!A7))","v":"نادر"},{"$f":"INDEX(ورقة1!$A:$A,ROW(ورقة1!B7)*5-5+COLUMN(ورقة1!B7))","v":"حسان"},{"$f":"INDEX(ورقة1!$A:$A,ROW(ورقة1!C7)*5-5+COLUMN(ورقة1!C7))","v":"همام"},{"$f":"INDEX(ورقة1!$A:$A,ROW(ورقة1!D7)*5-5+COLUMN(ورقة1!D7))","v":"محمد"},{"$f":"INDEX(ورقة1!$A:$A,ROW(ورقة1!E7)*5-5+COLUMN(ورقة1!E7))","v":"احمد "},{"$f":"INDEX(ورقة1!$A:$A,ROW(ورقة1!F7)*5-5+COLUMN(ورقة1!F7))","v":"احمد "},{"$f":"INDEX(ورقة1!$A:$A,ROW(ورقة1!G7)*5-5+COLUMN(ورقة1!G7))","v":"سعيد"},{"$f":"INDEX(ورقة1!$A:$A,ROW(ورقة1!H7)*5-5+COLUMN(ورقة1!H7))","v":"نادر"},{"$f":"INDEX(ورقة1!$A:$A,ROW(ورقة1!I7)*5-5+COLUMN(ورقة1!I7))","v":"حسان"}]
[{"$f":"INDEX(ورقة1!$A:$A,ROW(ورقة1!A8)*5-5+COLUMN(ورقة1!A8))","v":"احمد "},{"$f":"INDEX(ورقة1!$A:$A,ROW(ورقة1!B8)*5-5+COLUMN(ورقة1!B8))","v":"سعيد"},{"$f":"INDEX(ورقة1!$A:$A,ROW(ورقة1!C8)*5-5+COLUMN(ورقة1!C8))","v":"نادر"},{"$f":"INDEX(ورقة1!$A:$A,ROW(ورقة1!D8)*5-5+COLUMN(ورقة1!D8))","v":"حسان"},{"$f":"INDEX(ورقة1!$A:$A,ROW(ورقة1!E8)*5-5+COLUMN(ورقة1!E8))","v":"همام"},{"$f":"INDEX(ورقة1!$A:$A,ROW(ورقة1!F8)*5-5+COLUMN(ورقة1!F8))","v":"محمد"},{"$f":"INDEX(ورقة1!$A:$A,ROW(ورقة1!G8)*5-5+COLUMN(ورقة1!G8))","v":"احمد "},{"$f":"INDEX(ورقة1!$A:$A,ROW(ورقة1!H8)*5-5+COLUMN(ورقة1!H8))","v":"احمد "},{"$f":"INDEX(ورقة1!$A:$A,ROW(ورقة1!I8)*5-5+COLUMN(ورقة1!I8))","v":"سعيد"}]
[{"$f":"INDEX(ورقة1!$A:$A,ROW(ورقة1!A9)*5-5+COLUMN(ورقة1!A9))","v":"محمد"},{"$f":"INDEX(ورقة1!$A:$A,ROW(ورقة1!B9)*5-5+COLUMN(ورقة1!B9))","v":"احمد "},{"$f":"INDEX(ورقة1!$A:$A,ROW(ورقة1!C9)*5-5+COLUMN(ورقة1!C9))","v":"احمد "},{"$f":"INDEX(ورقة1!$A:$A,ROW(ورقة1!D9)*5-5+COLUMN(ورقة1!D9))","v":"سعيد"},{"$f":"INDEX(ورقة1!$A:$A,ROW(ورقة1!E9)*5-5+COLUMN(ورقة1!E9))","v":"نادر"},{"$f":"INDEX(ورقة1!$A:$A,ROW(ورقة1!F9)*5-5+COLUMN(ورقة1!F9))","v":"حسان"},{"$f":"INDEX(ورقة1!$A:$A,ROW(ورقة1!G9)*5-5+COLUMN(ورقة1!G9))","v":"همام"},{"$f":"INDEX(ورقة1!$A:$A,ROW(ورقة1!H9)*5-5+COLUMN(ورقة1!H9))","v":"محمد"},{"$f":"INDEX(ورقة1!$A:$A,ROW(ورقة1!I9)*5-5+COLUMN(ورقة1!I9))","v":"احمد "}]
[{"$f":"INDEX(ورقة1!$A:$A,ROW(ورقة1!A10)*5-5+COLUMN(ورقة1!A10))","v":"حسان"},{"$f":"INDEX(ورقة1!$A:$A,ROW(ورقة1!B10)*5-5+COLUMN(ورقة1!B10))","v":"همام"},{"$f":"INDEX(ورقة1!$A:$A,ROW(ورقة1!C10)*5-5+COLUMN(ورقة1!C10))","v":"محمد"},{"$f":"INDEX(ورقة1!$A:$A,ROW(ورقة1!D10)*5-5+COLUMN(ورقة1!D10))","v":"احمد "},{"$f":"INDEX(ورقة1!$A:$A,ROW(ورقة1!E10)*5-5+COLUMN(ورقة1!E10))","v":"احمد "},{"$f":"INDEX(ورقة1!$A:$A,ROW(ورقة1!F10)*5-5+COLUMN(ورقة1!F10))","v":"سعيد"},{"$f":"INDEX(ورقة1!$A:$A,ROW(ورقة1!G10)*5-5+COLUMN(ورقة1!G10))","v":"نادر"},{"$f":"INDEX(ورقة1!$A:$A,ROW(ورقة1!H10)*5-5+COLUMN(ورقة1!H10))","v":"حسان"},{"$f":"INDEX(ورقة1!$A:$A,ROW(ورقة1!I10)*5-5+COLUMN(ورقة1!I10))","v":"همام"}]
[{"$f":"INDEX(ورقة1!$A:$A,ROW(ورقة1!A11)*5-5+COLUMN(ورقة1!A11))","v":"سعيد"},{"$f":"INDEX(ورقة1!$A:$A,ROW(ورقة1!B11)*5-5+COLUMN(ورقة1!B11))","v":"نادر"},{"$f":"INDEX(ورقة1!$A:$A,ROW(ورقة1!C11)*5-5+COLUMN(ورقة1!C11))","v":"حسان"},{"$f":"INDEX(ورقة1!$A:$A,ROW(ورقة1!D11)*5-5+COLUMN(ورقة1!D11))","v":"همام"},{"$f":"INDEX(ورقة1!$A:$A,ROW(ورقة1!E11)*5-5+COLUMN(ورقة1!E11))","v":"محمد"},{"$f":"INDEX(ورقة1!$A:$A,ROW(ورقة1!F11)*5-5+COLUMN(ورقة1!F11))","v":"احمد "},{"$f":"INDEX(ورقة1!$A:$A,ROW(ورقة1!G11)*5-5+COLUMN(ورقة1!G11))","v":"احمد "},{"$f":"INDEX(ورقة1!$A:$A,ROW(ورقة1!H11)*5-5+COLUMN(ورقة1!H11))","v":"سعيد"},{"$f":"INDEX(ورقة1!$A:$A,ROW(ورقة1!I11)*5-5+COLUMN(ورقة1!I11))","v":"نادر"}]
[{"$f":"INDEX(ورقة1!$A:$A,ROW(ورقة1!A12)*5-5+COLUMN(ورقة1!A12))","v":"احمد "},{"$f":"INDEX(ورقة1!$A:$A,ROW(ورقة1!B12)*5-5+COLUMN(ورقة1!B12))","v":"احمد "},{"$f":"INDEX(ورقة1!$A:$A,ROW(ورقة1!C12)*5-5+COLUMN(ورقة1!C12))","v":"سعيد"},{"$f":"INDEX(ورقة1!$A:$A,ROW(ورقة1!D12)*5-5+COLUMN(ورقة1!D12))","v":"نادر"},{"$f":"INDEX(ورقة1!$A:$A,ROW(ورقة1!E12)*5-5+COLUMN(ورقة1!E12))","v":"حسان"},{"$f":"INDEX(ورقة1!$A:$A,ROW(ورقة1!F12)*5-5+COLUMN(ورقة1!F12))","v":"همام"},{"$f":"INDEX(ورقة1!$A:$A,ROW(ورقة1!G12)*5-5+COLUMN(ورقة1!G12))","v":"محمد"},{"$f":"INDEX(ورقة1!$A:$A,ROW(ورقة1!H12)*5-5+COLUMN(ورقة1!H12))","v":"احمد "},{"$f":"INDEX(ورقة1!$A:$A,ROW(ورقة1!I12)*5-5+COLUMN(ورقة1!I12))","v":"احمد "}]
[{"$f":"INDEX(ورقة1!$A:$A,ROW(ورقة1!A13)*5-5+COLUMN(ورقة1!A13))","v":"همام"},{"$f":"INDEX(ورقة1!$A:$A,ROW(ورقة1!B13)*5-5+COLUMN(ورقة1!B13))","v":"محمد"},{"$f":"INDEX(ورقة1!$A:$A,ROW(ورقة1!C13)*5-5+COLUMN(ورقة1!C13))","v":"احمد "},{"$f":"INDEX(ورقة1!$A:$A,ROW(ورقة1!D13)*5-5+COLUMN(ورقة1!D13))","v":"احمد "},{"$f":"INDEX(ورقة1!$A:$A,ROW(ورقة1!E13)*5-5+COLUMN(ورقة1!E13))","v":"سعيد"},{"$f":"INDEX(ورقة1!$A:$A,ROW(ورقة1!F13)*5-5+COLUMN(ورقة1!F13))","v":"نادر"},{"$f":"INDEX(ورقة1!$A:$A,ROW(ورقة1!G13)*5-5+COLUMN(ورقة1!G13))","v":"حسان"},{"$f":"INDEX(ورقة1!$A:$A,ROW(ورقة1!H13)*5-5+COLUMN(ورقة1!H13))","v":"همام"},{"$f":"INDEX(ورقة1!$A:$A,ROW(ورقة1!I13)*5-5+COLUMN(ورقة1!I13))","v":"محمد"}]
[{"$f":"INDEX(ورقة1!$A:$A,ROW(ورقة1!A14)*5-5+COLUMN(ورقة1!A14))","v":"نادر"},{"$f":"INDEX(ورقة1!$A:$A,ROW(ورقة1!B14)*5-5+COLUMN(ورقة1!B14))","v":"حسان"},{"$f":"INDEX(ورقة1!$A:$A,ROW(ورقة1!C14)*5-5+COLUMN(ورقة1!C14))","v":"همام"},{"$f":"INDEX(ورقة1!$A:$A,ROW(ورقة1!D14)*5-5+COLUMN(ورقة1!D14))","v":"محمد"},{"$f":"INDEX(ورقة1!$A:$A,ROW(ورقة1!E14)*5-5+COLUMN(ورقة1!E14))","v":"احمد "},{"$f":"INDEX(ورقة1!$A:$A,ROW(ورقة1!F14)*5-5+COLUMN(ورقة1!F14))","v":"احمد "},{"$f":"INDEX(ورقة1!$A:$A,ROW(ورقة1!G14)*5-5+COLUMN(ورقة1!G14))","v":"سعيد"},{"$f":"INDEX(ورقة1!$A:$A,ROW(ورقة1!H14)*5-5+COLUMN(ورقة1!H14))","v":"نادر"},{"$f":"INDEX(ورقة1!$A:$A,ROW(ورقة1!I14)*5-5+COLUMN(ورقة1!I14))","v":"حسان"}]
[{"$f":"INDEX(ورقة1!$A:$A,ROW(ورقة1!A15)*5-5+COLUMN(ورقة1!A15))","v":"احمد "},{"$f":"INDEX(ورقة1!$A:$A,ROW(ورقة1!B15)*5-5+COLUMN(ورقة1!B15))","v":"سعيد"},{"$f":"INDEX(ورقة1!$A:$A,ROW(ورقة1!C15)*5-5+COLUMN(ورقة1!C15))","v":"نادر"},{"$f":"INDEX(ورقة1!$A:$A,ROW(ورقة1!D15)*5-5+COLUMN(ورقة1!D15))","v":"حسان"},{"$f":"INDEX(ورقة1!$A:$A,ROW(ورقة1!E15)*5-5+COLUMN(ورقة1!E15))","v":"همام"},{"$f":"INDEX(ورقة1!$A:$A,ROW(ورقة1!F15)*5-5+COLUMN(ورقة1!F15))","v":"محمد"},{"$f":"INDEX(ورقة1!$A:$A,ROW(ورقة1!G15)*5-5+COLUMN(ورقة1!G15))","v":"احمد "},{"$f":"INDEX(ورقة1!$A:$A,ROW(ورقة1!H15)*5-5+COLUMN(ورقة1!H15))","v":"احمد "},{"$f":"INDEX(ورقة1!$A:$A,ROW(ورقة1!I15)*5-5+COLUMN(ورقة1!I15))","v":"سعيد"}]
[{"$f":"INDEX(ورقة1!$A:$A,ROW(ورقة1!A16)*5-5+COLUMN(ورقة1!A16))","v":"محمد"},{"$f":"INDEX(ورقة1!$A:$A,ROW(ورقة1!B16)*5-5+COLUMN(ورقة1!B16))","v":"احمد "},{"$f":"INDEX(ورقة1!$A:$A,ROW(ورقة1!C16)*5-5+COLUMN(ورقة1!C16))","v":"احمد "},{"$f":"INDEX(ورقة1!$A:$A,ROW(ورقة1!D16)*5-5+COLUMN(ورقة1!D16))","v":"سعيد"},{"$f":"INDEX(ورقة1!$A:$A,ROW(ورقة1!E16)*5-5+COLUMN(ورقة1!E16))","v":"نادر"},{"$f":"INDEX(ورقة1!$A:$A,ROW(ورقة1!F16)*5-5+COLUMN(ورقة1!F16))","v":"حسان"},{"$f":"INDEX(ورقة1!$A:$A,ROW(ورقة1!G16)*5-5+COLUMN(ورقة1!G16))","v":"همام"},{"$f":"INDEX(ورقة1!$A:$A,ROW(ورقة1!H16)*5-5+COLUMN(ورقة1!H16))","v":"محمد"},{"$f":"INDEX(ورقة1!$A:$A,ROW(ورقة1!I16)*5-5+COLUMN(ورقة1!I16))","v":"احمد "}]
[{"$f":"INDEX(ورقة1!$A:$A,ROW(ورقة1!A17)*5-5+COLUMN(ورقة1!A17))","v":"حسان"},{"$f":"INDEX(ورقة1!$A:$A,ROW(ورقة1!B17)*5-5+COLUMN(ورقة1!B17))","v":"همام"},{"$f":"INDEX(ورقة1!$A:$A,ROW(ورقة1!C17)*5-5+COLUMN(ورقة1!C17))","v":"محمد"},{"$f":"INDEX(ورقة1!$A:$A,ROW(ورقة1!D17)*5-5+COLUMN(ورقة1!D17))","v":"احمد "},{"$f":"INDEX(ورقة1!$A:$A,ROW(ورقة1!E17)*5-5+COLUMN(ورقة1!E17))","v":"احمد "},{"$f":"INDEX(ورقة1!$A:$A,ROW(ورقة1!F17)*5-5+COLUMN(ورقة1!F17))","v":"سعيد"},{"$f":"INDEX(ورقة1!$A:$A,ROW(ورقة1!G17)*5-5+COLUMN(ورقة1!G17))","v":"نادر"},{"$f":"INDEX(ورقة1!$A:$A,ROW(ورقة1!H17)*5-5+COLUMN(ورقة1!H17))","v":"حسان"},{"$f":"INDEX(ورقة1!$A:$A,ROW(ورقة1!I17)*5-5+COLUMN(ورقة1!I17))","v":"همام"}]
[{"$f":"INDEX(ورقة1!$A:$A,ROW(ورقة1!A18)*5-5+COLUMN(ورقة1!A18))","v":"سعيد"},{"$f":"INDEX(ورقة1!$A:$A,ROW(ورقة1!B18)*5-5+COLUMN(ورقة1!B18))","v":"نادر"},{"$f":"INDEX(ورقة1!$A:$A,ROW(ورقة1!C18)*5-5+COLUMN(ورقة1!C18))","v":"حسان"},{"$f":"INDEX(ورقة1!$A:$A,ROW(ورقة1!D18)*5-5+COLUMN(ورقة1!D18))","v":"همام"},{"$f":"INDEX(ورقة1!$A:$A,ROW(ورقة1!E18)*5-5+COLUMN(ورقة1!E18))","v":"محمد"},{"$f":"INDEX(ورقة1!$A:$A,ROW(ورقة1!F18)*5-5+COLUMN(ورقة1!F18))","v":"احمد "},{"$f":"INDEX(ورقة1!$A:$A,ROW(ورقة1!G18)*5-5+COLUMN(ورقة1!G18))","v":"احمد "},{"$f":"INDEX(ورقة1!$A:$A,ROW(ورقة1!H18)*5-5+COLUMN(ورقة1!H18))","v":"سعيد"},{"$f":"INDEX(ورقة1!$A:$A,ROW(ورقة1!I18)*5-5+COLUMN(ورقة1!I18))","v":"نادر"}]
[{"$f":"INDEX(ورقة1!$A:$A,ROW(ورقة1!A19)*5-5+COLUMN(ورقة1!A19))","v":"احمد "},{"$f":"INDEX(ورقة1!$A:$A,ROW(ورقة1!B19)*5-5+COLUMN(ورقة1!B19))","v":"احمد "},{"$f":"INDEX(ورقة1!$A:$A,ROW(ورقة1!C19)*5-5+COLUMN(ورقة1!C19))","v":"سعيد"},{"$f":"INDEX(ورقة1!$A:$A,ROW(ورقة1!D19)*5-5+COLUMN(ورقة1!D19))","v":"نادر"},{"$f":"INDEX(ورقة1!$A:$A,ROW(ورقة1!E19)*5-5+COLUMN(ورقة1!E19))","v":"حسان"},{"$f":"INDEX(ورقة1!$A:$A,ROW(ورقة1!F19)*5-5+COLUMN(ورقة1!F19))","v":"همام"},{"$f":"INDEX(ورقة1!$A:$A,ROW(ورقة1!G19)*5-5+COLUMN(ورقة1!G19))","v":"محمد"},{"$f":"INDEX(ورقة1!$A:$A,ROW(ورقة1!H19)*5-5+COLUMN(ورقة1!H19))","v":"احمد "},{"$f":"INDEX(ورقة1!$A:$A,ROW(ورقة1!I19)*5-5+COLUMN(ورقة1!I19))","v":"احمد "}]
[{"$f":"INDEX(ورقة1!$A:$A,ROW(ورقة1!A20)*5-5+COLUMN(ورقة1!A20))","v":"همام"},{"$f":"INDEX(ورقة1!$A:$A,ROW(ورقة1!B20)*5-5+COLUMN(ورقة1!B20))","v":"محمد"},{"$f":"INDEX(ورقة1!$A:$A,ROW(ورقة1!C20)*5-5+COLUMN(ورقة1!C20))","v":"احمد "},{"$f":"INDEX(ورقة1!$A:$A,ROW(ورقة1!D20)*5-5+COLUMN(ورقة1!D20))","v":"احمد "},{"$f":"INDEX(ورقة1!$A:$A,ROW(ورقة1!E20)*5-5+COLUMN(ورقة1!E20))","v":"سعيد"},{"$f":"INDEX(ورقة1!$A:$A,ROW(ورقة1!F20)*5-5+COLUMN(ورقة1!F20))","v":"نادر"},{"$f":"INDEX(ورقة1!$A:$A,ROW(ورقة1!G20)*5-5+COLUMN(ورقة1!G20))","v":"حسان"},{"$f":"INDEX(ورقة1!$A:$A,ROW(ورقة1!H20)*5-5+COLUMN(ورقة1!H20))","v":"همام"},{"$f":"INDEX(ورقة1!$A:$A,ROW(ورقة1!I20)*5-5+COLUMN(ورقة1!I20))","v":"محمد"}]
[{"$f":"INDEX(ورقة1!$A:$A,ROW(ورقة1!A21)*5-5+COLUMN(ورقة1!A21))","v":"نادر"},{"$f":"INDEX(ورقة1!$A:$A,ROW(ورقة1!B21)*5-5+COLUMN(ورقة1!B21))","v":"حسان"},{"$f":"INDEX(ورقة1!$A:$A,ROW(ورقة1!C21)*5-5+COLUMN(ورقة1!C21))","v":"همام"},{"$f":"INDEX(ورقة1!$A:$A,ROW(ورقة1!D21)*5-5+COLUMN(ورقة1!D21))","v":"محمد"},{"$f":"INDEX(ورقة1!$A:$A,ROW(ورقة1!E21)*5-5+COLUMN(ورقة1!E21))","v":"احمد "},{"$f":"INDEX(ورقة1!$A:$A,ROW(ورقة1!F21)*5-5+COLUMN(ورقة1!F21))","v":"احمد "},{"$f":"INDEX(ورقة1!$A:$A,ROW(ورقة1!G21)*5-5+COLUMN(ورقة1!G21))","v":"سعيد"},{"$f":"INDEX(ورقة1!$A:$A,ROW(ورقة1!H21)*5-5+COLUMN(ورقة1!H21))","v":"نادر"},{"$f":"INDEX(ورقة1!$A:$A,ROW(ورقة1!I21)*5-5+COLUMN(ورقة1!I21))","v":"حسان"}]
[{"$f":"INDEX(ورقة1!$A:$A,ROW(ورقة1!A22)*5-5+COLUMN(ورقة1!A22))","v":"احمد "},{"$f":"INDEX(ورقة1!$A:$A,ROW(ورقة1!B22)*5-5+COLUMN(ورقة1!B22))","v":"سعيد"},{"$f":"INDEX(ورقة1!$A:$A,ROW(ورقة1!C22)*5-5+COLUMN(ورقة1!C22))","v":"نادر"},{"$f":"INDEX(ورقة1!$A:$A,ROW(ورقة1!D22)*5-5+COLUMN(ورقة1!D22))","v":"حسان"},{"$f":"INDEX(ورقة1!$A:$A,ROW(ورقة1!E22)*5-5+COLUMN(ورقة1!E22))","v":"همام"},{"$f":"INDEX(ورقة1!$A:$A,ROW(ورقة1!F22)*5-5+COLUMN(ورقة1!F22))","v":"محمد"},{"$f":"INDEX(ورقة1!$A:$A,ROW(ورقة1!G22)*5-5+COLUMN(ورقة1!G22))","v":"احمد "},{"$f":"INDEX(ورقة1!$A:$A,ROW(ورقة1!H22)*5-5+COLUMN(ورقة1!H22))","v":"احمد "},{"$f":"INDEX(ورقة1!$A:$A,ROW(ورقة1!I22)*5-5+COLUMN(ورقة1!I22))","v":"سعيد"}]
[{"$f":"INDEX(ورقة1!$A:$A,ROW(ورقة1!A23)*5-5+COLUMN(ورقة1!A23))","v":"محمد"},{"$f":"INDEX(ورقة1!$A:$A,ROW(ورقة1!B23)*5-5+COLUMN(ورقة1!B23))","v":"احمد "},{"$f":"INDEX(ورقة1!$A:$A,ROW(ورقة1!C23)*5-5+COLUMN(ورقة1!C23))","v":"احمد "},{"$f":"INDEX(ورقة1!$A:$A,ROW(ورقة1!D23)*5-5+COLUMN(ورقة1!D23))","v":"سعيد"},{"$f":"INDEX(ورقة1!$A:$A,ROW(ورقة1!E23)*5-5+COLUMN(ورقة1!E23))","v":"نادر"},{"$f":"INDEX(ورقة1!$A:$A,ROW(ورقة1!F23)*5-5+COLUMN(ورقة1!F23))","v":"حسان"},{"$f":"INDEX(ورقة1!$A:$A,ROW(ورقة1!G23)*5-5+COLUMN(ورقة1!G23))","v":"همام"},{"$f":"INDEX(ورقة1!$A:$A,ROW(ورقة1!H23)*5-5+COLUMN(ورقة1!H23))","v":"محمد"},{"$f":"INDEX(ورقة1!$A:$A,ROW(ورقة1!I23)*5-5+COLUMN(ورقة1!I23))","v":"احمد "}]
[{"$f":"INDEX(ورقة1!$A:$A,ROW(ورقة1!A24)*5-5+COLUMN(ورقة1!A24))","v":"حسان"},{"$f":"INDEX(ورقة1!$A:$A,ROW(ورقة1!B24)*5-5+COLUMN(ورقة1!B24))","v":"همام"},{"$f":"INDEX(ورقة1!$A:$A,ROW(ورقة1!C24)*5-5+COLUMN(ورقة1!C24))","v":"محمد"},{"$f":"INDEX(ورقة1!$A:$A,ROW(ورقة1!D24)*5-5+COLUMN(ورقة1!D24))","v":"احمد "},{"$f":"INDEX(ورقة1!$A:$A,ROW(ورقة1!E24)*5-5+COLUMN(ورقة1!E24))","v":"احمد "},{"$f":"INDEX(ورقة1!$A:$A,ROW(ورقة1!F24)*5-5+COLUMN(ورقة1!F24))","v":"سعيد"},{"$f":"INDEX(ورقة1!$A:$A,ROW(ورقة1!G24)*5-5+COLUMN(ورقة1!G24))","v":"نادر"},{"$f":"INDEX(ورقة1!$A:$A,ROW(ورقة1!H24)*5-5+COLUMN(ورقة1!H24))","v":"حسان"},{"$f":"INDEX(ورقة1!$A:$A,ROW(ورقة1!I24)*5-5+COLUMN(ورقة1!I24))","v":"همام"}]
[{"$f":"INDEX(ورقة1!$A:$A,ROW(ورقة1!A25)*5-5+COLUMN(ورقة1!A25))","v":"سعيد"},{"$f":"INDEX(ورقة1!$A:$A,ROW(ورقة1!B25)*5-5+COLUMN(ورقة1!B25))","v":"نادر"},{"$f":"INDEX(ورقة1!$A:$A,ROW(ورقة1!C25)*5-5+COLUMN(ورقة1!C25))","v":"حسان"},{"$f":"INDEX(ورقة1!$A:$A,ROW(ورقة1!D25)*5-5+COLUMN(ورقة1!D25))","v":"همام"},{"$f":"INDEX(ورقة1!$A:$A,ROW(ورقة1!E25)*5-5+COLUMN(ورقة1!E25))","v":"محمد"},{"$f":"INDEX(ورقة1!$A:$A,ROW(ورقة1!F25)*5-5+COLUMN(ورقة1!F25))","v":"احمد "},{"$f":"INDEX(ورقة1!$A:$A,ROW(ورقة1!G25)*5-5+COLUMN(ورقة1!G25))","v":"احمد "},{"$f":"INDEX(ورقة1!$A:$A,ROW(ورقة1!H25)*5-5+COLUMN(ورقة1!H25))","v":"سعيد"},{"$f":"INDEX(ورقة1!$A:$A,ROW(ورقة1!I25)*5-5+COLUMN(ورقة1!I25))","v":"نادر"}]
[{"$f":"INDEX(ورقة1!$A:$A,ROW(ورقة1!A26)*5-5+COLUMN(ورقة1!A26))","v":"احمد "},{"$f":"INDEX(ورقة1!$A:$A,ROW(ورقة1!B26)*5-5+COLUMN(ورقة1!B26))","v":"احمد "},{"$f":"INDEX(ورقة1!$A:$A,ROW(ورقة1!C26)*5-5+COLUMN(ورقة1!C26))","v":"سعيد"},{"$f":"INDEX(ورقة1!$A:$A,ROW(ورقة1!D26)*5-5+COLUMN(ورقة1!D26))","v":"نادر"},{"$f":"INDEX(ورقة1!$A:$A,ROW(ورقة1!E26)*5-5+COLUMN(ورقة1!E26))","v":"حسان"},{"$f":"INDEX(ورقة1!$A:$A,ROW(ورقة1!F26)*5-5+COLUMN(ورقة1!F26))","v":"همام"},{"$f":"INDEX(ورقة1!$A:$A,ROW(ورقة1!G26)*5-5+COLUMN(ورقة1!G26))","v":"محمد"},{"$f":"INDEX(ورقة1!$A:$A,ROW(ورقة1!H26)*5-5+COLUMN(ورقة1!H26))","v":"احمد "},{"$f":"INDEX(ورقة1!$A:$A,ROW(ورقة1!I26)*5-5+COLUMN(ورقة1!I26))","v":"احمد "}]
[{"$f":"INDEX(ورقة1!$A:$A,ROW(ورقة1!A27)*5-5+COLUMN(ورقة1!A27))","v":"همام"},{"$f":"INDEX(ورقة1!$A:$A,ROW(ورقة1!B27)*5-5+COLUMN(ورقة1!B27))","v":"محمد"},{"$f":"INDEX(ورقة1!$A:$A,ROW(ورقة1!C27)*5-5+COLUMN(ورقة1!C27))","v":"احمد "},{"$f":"INDEX(ورقة1!$A:$A,ROW(ورقة1!D27)*5-5+COLUMN(ورقة1!D27))","v":"احمد "},{"$f":"INDEX(ورقة1!$A:$A,ROW(ورقة1!E27)*5-5+COLUMN(ورقة1!E27))","v":"سعيد"},{"$f":"INDEX(ورقة1!$A:$A,ROW(ورقة1!F27)*5-5+COLUMN(ورقة1!F27))","v":"نادر"},{"$f":"INDEX(ورقة1!$A:$A,ROW(ورقة1!G27)*5-5+COLUMN(ورقة1!G27))","v":"حسان"},{"$f":"INDEX(ورقة1!$A:$A,ROW(ورقة1!H27)*5-5+COLUMN(ورقة1!H27))","v":"همام"},{"$f":"INDEX(ورقة1!$A:$A,ROW(ورقة1!I27)*5-5+COLUMN(ورقة1!I27))","v":"محمد"}]
[{"$f":"INDEX(ورقة1!$A:$A,ROW(ورقة1!A28)*5-5+COLUMN(ورقة1!A28))","v":"نادر"},{"$f":"INDEX(ورقة1!$A:$A,ROW(ورقة1!B28)*5-5+COLUMN(ورقة1!B28))","v":"حسان"},{"$f":"INDEX(ورقة1!$A:$A,ROW(ورقة1!C28)*5-5+COLUMN(ورقة1!C28))","v":"همام"},{"$f":"INDEX(ورقة1!$A:$A,ROW(ورقة1!D28)*5-5+COLUMN(ورقة1!D28))","v":"محمد"},{"$f":"INDEX(ورقة1!$A:$A,ROW(ورقة1!E28)*5-5+COLUMN(ورقة1!E28))","v":"احمد "},{"$f":"INDEX(ورقة1!$A:$A,ROW(ورقة1!F28)*5-5+COLUMN(ورقة1!F28))","v":"احمد "},{"$f":"INDEX(ورقة1!$A:$A,ROW(ورقة1!G28)*5-5+COLUMN(ورقة1!G28))","v":"سعيد"},{"$f":"INDEX(ورقة1!$A:$A,ROW(ورقة1!H28)*5-5+COLUMN(ورقة1!H28))","v":"نادر"},{"$f":"INDEX(ورقة1!$A:$A,ROW(ورقة1!I28)*5-5+COLUMN(ورقة1!I28))","v":"حسان"}]
[{"$f":"INDEX(ورقة1!$A:$A,ROW(ورقة1!A29)*5-5+COLUMN(ورقة1!A29))","v":"احمد "},{"$f":"INDEX(ورقة1!$A:$A,ROW(ورقة1!B29)*5-5+COLUMN(ورقة1!B29))","v":"سعيد"},{"$f":"INDEX(ورقة1!$A:$A,ROW(ورقة1!C29)*5-5+COLUMN(ورقة1!C29))","v":"نادر"},{"$f":"INDEX(ورقة1!$A:$A,ROW(ورقة1!D29)*5-5+COLUMN(ورقة1!D29))","v":"حسان"},{"$f":"INDEX(ورقة1!$A:$A,ROW(ورقة1!E29)*5-5+COLUMN(ورقة1!E29))","v":"همام"},{"$f":"INDEX(ورقة1!$A:$A,ROW(ورقة1!F29)*5-5+COLUMN(ورقة1!F29))","v":"محمد"},{"$f":"INDEX(ورقة1!$A:$A,ROW(ورقة1!G29)*5-5+COLUMN(ورقة1!G29))","v":"احمد "},{"$f":"INDEX(ورقة1!$A:$A,ROW(ورقة1!H29)*5-5+COLUMN(ورقة1!H29))","v":"احمد "},{"$f":"INDEX(ورقة1!$A:$A,ROW(ورقة1!I29)*5-5+COLUMN(ورقة1!I29))","v":"سعيد"}]
[{"$f":"INDEX(ورقة1!$A:$A,ROW(ورقة1!A30)*5-5+COLUMN(ورقة1!A30))","v":"محمد"},{"$f":"INDEX(ورقة1!$A:$A,ROW(ورقة1!B30)*5-5+COLUMN(ورقة1!B30))","v":"احمد "},{"$f":"INDEX(ورقة1!$A:$A,ROW(ورقة1!C30)*5-5+COLUMN(ورقة1!C30))","v":"احمد "},{"$f":"INDEX(ورقة1!$A:$A,ROW(ورقة1!D30)*5-5+COLUMN(ورقة1!D30))","v":"سعيد"},{"$f":"INDEX(ورقة1!$A:$A,ROW(ورقة1!E30)*5-5+COLUMN(ورقة1!E30))","v":"نادر"},{"$f":"INDEX(ورقة1!$A:$A,ROW(ورقة1!F30)*5-5+COLUMN(ورقة1!F30))","v":"حسان"},{"$f":"INDEX(ورقة1!$A:$A,ROW(ورقة1!G30)*5-5+COLUMN(ورقة1!G30))","v":"همام"},{"$f":"INDEX(ورقة1!$A:$A,ROW(ورقة1!H30)*5-5+COLUMN(ورقة1!H30))","v":"محمد"},{"$f":"INDEX(ورقة1!$A:$A,ROW(ورقة1!I30)*5-5+COLUMN(ورقة1!I30))","v":"احمد "}]
{"$rows_left_out":89}
{"sheet":"ورقة3","index":2,"n_rows":99,"n_cols":5,"rows_kept":99,"cut":false,"hidden":false,"merged":[]}
["احمد ","سعيد","نادر","حسان","همام"]
["احمد ","احمد ","سعيد","نادر","حسان"]
["محمد","احمد ","احمد ","سعيد","نادر"]
["همام","محمد","احمد ","احمد ","سعيد"]
["حسان","همام","محمد","احمد ","احمد "]
["نادر","حسان","همام","محمد","احمد "]
["سعيد","نادر","حسان","همام","محمد"]
["احمد ","سعيد","نادر","حسان","همام"]
["احمد ","احمد ","سعيد","نادر","حسان"]
["محمد","احمد ","احمد ","سعيد","نادر"]
["همام","محمد","احمد ","احمد ","سعيد"]
["حسان","همام","محمد","احمد ","احمد "]
["نادر","حسان","همام","محمد","احمد "]
["سعيد","نادر","حسان","همام","محمد"]
["احمد ","سعيد","نادر","حسان","همام"]
["احمد ","احمد ","سعيد","نادر","حسان"]
["محمد","احمد ","احمد ","سعيد","نادر"]
["همام","محمد","احمد ","احمد ","سعيد"]
["حسان","همام","محمد","احمد ","احمد "]
["نادر","حسان","همام","محمد","احمد "]
["سعيد","نادر","حسان","همام","محمد"]
["احمد ","سعيد","نادر","حسان","همام"]
["احمد ","احمد ","سعيد","نادر","حسان"]
["محمد","احمد ","احمد ","سعيد","نادر"]
["همام","محمد","احمد ","احمد ","سعيد"]
["حسان","همام","محمد","احمد ","احمد "]
["نادر","حسان","همام","محمد","احمد "]
["سعيد","نادر","حسان","همام","محمد"]
["احمد ","سعيد","نادر","حسان","همام"]
["احمد ","احمد ","سعيد","نادر","حسان"]
{"$rows_left_out":69}