{"text_format":"1","workbook":"xlsx","n_sheets":5,"sheets":["كود","all","122","121","120"],"not_rendered":{"charts":0,"images":0,"macros":1,"external_links":1,"defined_names":6,"comments":0,"pivot_tables":0},"unopened":[],"bounds":{"document_bytes":16777216,"sheet_cells":100000,"rows_first":2000,"rows_last":500,"rows_between":2000,"halvings":0,"cell_chars":16384,"cell_head_chars":4096},"cells_cut":0,"cells_raw":0,"read":"whole","date_system":"1900"}

{"sheet":"كود","index":0,"n_rows":5,"n_cols":3,"rows_kept":5,"cut":false,"hidden":false,"merged":[]}
["كود","موديل","نوع"]
["2029","لاب توب hp","Laptop"]
["2028","لاب توب dell","Laptop"]
["1110","samsung","شاشة"]
["1111","toshiba","شاشة"]

{"sheet":"all","index":1,"n_rows":603,"n_cols":19,"rows_kept":603,"cut":false,"hidden":false,"merged":[]}
["لاب توب hp","2029/1","لاب توب hp","2029/2","2020-03-07",120,"احمد"]
["لاب توب hp","2029/2","لاب توب hp","2029/3","2020-03-08",120,"احمد",null,null,null,null,null,{"$f":"IF(AND(O2<>N2,N2<>N1:N1),COUNTIF($P$5:$P$200,N2),\"\")","v":0},{"$f":"IFERROR(MID(O2,FIND(\"/\",O2)-4,4),\"\")","v":"2029"},"2029/2",null,"2020-03-07",120,"حسام"]
["لاب توب hp","2029/3","لاب توب hp","2029/4","2020-03-09",120,"احمد",null,null,null,null,null,{"$f":"IF(AND(O3<>N3,N3<>N2:N2),COUNTIF($P$5:$P$200,N3),\"\")","v":""},{"$f":"IFERROR(MID(O3,FIND(\"/\",O3)-4,4),\"\")","v":"2029"},"2029/3",null,"2020-03-07",120,"حسام"]
["لاب توب hp","2029/4","لاب توب hp","2029/5","2020-03-10",120,"احمد",null,null,null,null,null,"","2029","2029/4",null,"2020-03-07",120,"حسام"]
["لاب توب hp","2029/5","لاب توب hp","2029/6","2020-03-11",120,"احمد",null,null,null,null,null,"","2029","2029/5",null,"2020-03-07",120,"حسام"]
["لاب توب hp","2029/6","لاب توب hp","2029/7","2020-03-12",120,"احمد",null,null,null,null,null,"","2029","2029/6",null,"2020-03-07",120,"حسام"]
["لاب توب hp","2029/7","لاب توب hp","2029/8","2020-03-13",120,"احمد",null,null,null,null,null,"","2029","2029/7",null,"2020-03-07",120,"حسام"]
["لاب توب hp","2029/8","لاب توب hp","2029/9","2020-03-14",120,"احمد",null,null,null,null,null,"","2029","2029/8",null,"2020-03-07",120,"حسام"]
["لاب توب hp","2029/9","لاب توب hp","2029/10","2020-03-15",120,"احمد",null,null,null,null,null,"","",null,null,null,{"$f":"IF(T9<>\"\",COUNTIF(T$5:$V9,T9),\"\")","v":""},{"$f":"IF(AND(T9<>\"\",T9<>T$4:$V8),COUNTIF($V$5:$V$100002,T9),\"\")","v":""}]
["لاب توب hp","2029/10","لاب توب hp","2029/11","2020-03-16",120,"احمد",null,null,null,null,null,"","",null,null,null,{"$f":"IF(T10<>\"\",COUNTIF(T$5:$V10,T10),\"\")","v":""},{"$f":"IF(AND(T10<>\"\",T10<>T$4:$V9),COUNTIF($V$5:$V$100002,T10),\"\")","v":""}]
["لاب توب hp","2029/11","لاب توب hp","2029/12","2020-03-17",120,"احمد",null,null,null,null,null,"","",null,null,null,{"$f":"IF(T11<>\"\",COUNTIF(T$5:$V11,T11),\"\")","v":""},{"$f":"IF(AND(T11<>\"\",T11<>T$4:$V10),COUNTIF($V$5:$V$100002,T11),\"\")","v":""}]
["لاب توب hp","2029/12","لاب توب hp","2029/13","2020-03-18",120,"احمد",null,null,null,null,null,"","",null,null,null,{"$f":"IF(T12<>\"\",COUNTIF(T$5:$V12,T12),\"\")","v":""},{"$f":"IF(AND(T12<>\"\",T12<>T$4:$V11),COUNTIF($V$5:$V$100002,T12),\"\")","v":""}]
["لاب توب hp","2029/13","لاب توب hp","2029/14","2020-03-19",120,"احمد",null,null,null,null,null,"","",null,null,null,{"$f":"IF(T13<>\"\",COUNTIF(T$5:$V13,T13),\"\")","v":""},{"$f":"IF(AND(T13<>\"\",T13<>T$4:$V12),COUNTIF($V$5:$V$100002,T13),\"\")","v":""}]
["لاب توب hp","2029/14","لاب توب hp","2029/15","2020-03-20",120,"احمد",null,null,null,null,null,"","",null,null,null,{"$f":"IF(T14<>\"\",COUNTIF(T$5:$V14,T14),\"\")","v":""},{"$f":"IF(AND(T14<>\"\",T14<>T$4:$V13),COUNTIF($V$5:$V$100002,T14),\"\")","v":""}]
["لاب توب hp","2029/15","لاب توب hp","2029/16","2020-03-21",120,"احمد",null,null,null,null,null,"","",null,null,null,{"$f":"IF(T15<>\"\",COUNTIF(T$5:$V15,T15),\"\")","v":""},{"$f":"IF(AND(T15<>\"\",T15<>T$4:$V14),COUNTIF($V$5:$V$100002,T15),\"\")","v":""}]
["لاب توب hp","2029/16","لاب توب hp","2029/17","2020-03-22",120,"احمد",null,null,null,null,null,"","",null,null,null,{"$f":"IF(T16<>\"\",COUNTIF(T$5:$V16,T16),\"\")","v":""},{"$f":"IF(AND(T16<>\"\",T16<>T$4:$V15),COUNTIF($V$5:$V$100002,T16),\"\")","v":""}]
["لاب توب hp","2029/17","لاب توب hp","2029/18","2020-03-23",120,"احمد",null,null,null,null,null,"","",null,null,null,{"$f":"IF(T17<>\"\",COUNTIF(T$5:$V17,T17),\"\")","v":""},{"$f":"IF(AND(T17<>\"\",T17<>T$4:$V16),COUNTIF($V$5:$V$100002,T17),\"\")","v":""}]
["لاب توب hp","2029/18","لاب توب hp","2029/19","2020-03-24",120,"احمد",null,null,null,null,null,"","",null,null,null,{"$f":"IF(T18<>\"\",COUNTIF(T$5:$V18,T18),\"\")","v":""},{"$f":"IF(AND(T18<>\"\",T18<>T$4:$V17),COUNTIF($V$5:$V$100002,T18),\"\")","v":""}]
["لاب توب hp","2029/19","لاب توب hp","2029/20","2020-03-25",120,"احمد",null,null,null,null,null,"","",null,null,null,{"$f":"IF(T19<>\"\",COUNTIF(T$5:$V19,T19),\"\")","v":""},{"$f":"IF(AND(T19<>\"\",T19<>T$4:$V18),COUNTIF($V$5:$V$100002,T19),\"\")","v":""}]
["لاب توب hp","2029/20","لاب توب hp","2029/21","2020-03-26",120,"احمد",null,null,null,null,null,"","",null,null,null,{"$f":"IF(T20<>\"\",COUNTIF(T$5:$V20,T20),\"\")","v":""},{"$f":"IF(AND(T20<>\"\",T20<>T$4:$V19),COUNTIF($V$5:$V$100002,T20),\"\")","v":""}]
{"$rows_left_out":584}
{"sheet":"122","index":2,"n_rows":205,"n_cols":17,"rows_kept":205,"cut":false,"hidden":false,"merged":[]}
["ORDER NO.",null,{"$f":"RIGHT(CELL(\"filename\",A1),LEN(CELL(\"filename\",A1))-FIND(\"]\",CELL(\"filename\",A1)))","v":"122"},null,"CUS.NAME","عبده",{"$f":"IFERROR(VLOOKUP(F1,#REF!,2,FALSE),\"\")","v":""},"DATE","2020-03-07",null,null,"OFFICER","Hosam Pasha","STORE"]
[null,null,null,null,null,null,null,null,null,null,null,null,{"$f":"IFERROR(IF(O1=\"مباشـــر\",\"اذن اضافة رقم\",IF(O1=\"ماستر لينك\",\"تفويض رقم\",\"\")),\"\")","v":""}]
[]
["NO.","N.Q.","MODEL","Q","CODE","البيان",null,"NO.","N.Q.","MODEL","Q","CODE","البيان",null,"التاريخ","رقم الاذن","العميل"]
[{"$f":"IF(F5<>\"\",1,\"\")","v":1},{"$f":"IF(C5<>\"\",COUNTIF($C$5:C5,C5),\"\")","v":1},"شاشة",null,{"$f":"IFERROR(MID(F5,FIND(\"/\",F5)-4,4),\"\")","v":"1110"},"1110/1",null,{"$f":"IF(M5<>\"\",1,\"\")","v":1},{"$f":"IF(J5<>\"\",COUNTIF($J$5:J5,J5),\"\")","v":1},"شاشة",null,{"$f":"IFERROR(MID(M5,FIND(\"/\",M5)-4,4),\"\")","v":"1111"},"1111/1",null,"2020-03-07",120,"عبده"]
[null,null,"شاشة",{"$f":"IF(AND(F6<>E6,E6<>E5:E5),COUNTIF($E$5:$E$200,E6),\"\")","v":""},{"$f":"IFERROR(MID(F6,FIND(\"/\",F6)-4,4),\"\")","v":"1110"},"1110/1",null,{"$f":"IF(M6<>\"\",1,\"\")","v":1},{"$f":"IF(J6<>\"\",COUNTIF($J$5:J6,J6),\"\")","v":2},"شاشة",{"$f":"IF(AND(M6<>L6,L6<>L5:L5),COUNTIF($L$5:$L$200,L6),\"\")","v":""},{"$f":"IFERROR(MID(M6,FIND(\"/\",M6)-4,4),\"\")","v":"1111"},"1111/1",null,"2020-03-07",120,"عبده"]
[null,null,"شاشة","","1110","1110/1",null,1,{"$f":"IF(J7<>\"\",COUNTIF($J$5:J7,J7),\"\")","v":3},"شاشة","","1111","1111/1",null,"2020-03-07",120,"عبده"]
[null,null,"شاشة","","1110","1110/1",null,1,{"$f":"IF(J8<>\"\",COUNTIF($J$5:J8,J8),\"\")","v":4},"شاشة","","1111","1111/1",null,"2020-03-07",120,"عبده"]
[null,null,"شاشة","","1110","1110/1",null,1,{"$f":"IF(J9<>\"\",COUNTIF($J$5:J9,J9),\"\")","v":5},"شاشة","","1111","1111/1",null,"2020-03-07",120,"عبده"]
[null,null,"شاشة","","1110","1110/1",null,1,{"$f":"IF(J10<>\"\",COUNTIF($J$5:J10,J10),\"\")","v":6},"شاشة","","1111","1111/1",null,"2020-03-07",120,"عبده"]
[null,null,"شاشة","","1110","1110/1",null,1,{"$f":"IF(J11<>\"\",COUNTIF($J$5:J11,J11),\"\")","v":7},"شاشة","","1111","1111/1",null,"2020-03-07",120,"عبده"]
[null,null,"شاشة","","1110","1110/1",null,1,{"$f":"IF(J12<>\"\",COUNTIF($J$5:J12,J12),\"\")","v":8},"شاشة","","1111","1111/1",null,"2020-03-07",120,"عبده"]
[null,null,"شاشة","","1110","1110/1",null,1,{"$f":"IF(J13<>\"\",COUNTIF($J$5:J13,J13),\"\")","v":9},"شاشة","","1111","1111/1",null,"2020-03-07",120,"عبده"]
[null,null,"شاشة","","1110","1110/1",null,1,{"$f":"IF(J14<>\"\",COUNTIF($J$5:J14,J14),\"\")","v":10},"شاشة","","1111","1111/1",null,"2020-03-07",120,"عبده"]
[null,null,"شاشة","","1110","1110/1",null,1,{"$f":"IF(J15<>\"\",COUNTIF($J$5:J15,J15),\"\")","v":11},"شاشة","","1111","1111/1",null,"2020-03-07",120,"عبده"]
[null,null,"شاشة","","1110","1110/1",null,1,{"$f":"IF(J16<>\"\",COUNTIF($J$5:J16,J16),\"\")","v":12},"شاشة","","1111","1111/1",null,"2020-03-07",120,"عبده"]
[null,null,"شاشة","","1110","1110/1",null,1,{"$f":"IF(J17<>\"\",COUNTIF($J$5:J17,J17),\"\")","v":13},"شاشة","","1111","1111/1",null,"2020-03-07",120,"عبده"]
[null,null,"شاشة","","1110","1110/1",null,1,{"$f":"IF(J18<>\"\",COUNTIF($J$5:J18,J18),\"\")","v":14},"شاشة","","1111","1111/1",null,"2020-03-07",120,"عبده"]
[null,null,"شاشة","","1110","1110/1",null,1,{"$f":"IF(J19<>\"\",COUNTIF($J$5:J19,J19),\"\")","v":15},"شاشة","","1111","1111/1",null,"2020-03-07",120,"عبده"]
[null,null,"شاشة","","1110","1110/1",null,1,{"$f":"IF(J20<>\"\",COUNTIF($J$5:J20,J20),\"\")","v":16},"شاشة","","1111","1111/1",null,"2020-03-07",120,"عبده"]
{"$rows_left_out":186}
{"sheet":"121","index":3,"n_rows":205,"n_cols":17,"rows_kept":205,"cut":false,"hidden":false,"merged":[]}
["ORDER NO.",null,{"$f":"RIGHT(CELL(\"filename\",A1),LEN(CELL(\"filename\",A1))-FIND(\"]\",CELL(\"filename\",A1)))","v":"121"},null,"CUS.NAME","صلاح",{"$f":"IFERROR(VLOOKUP(F1,#REF!,2,FALSE),\"\")","v":""},"DATE","2020-03-07",null,null,"OFFICER","Hosam Pasha","STORE"]
[null,null,null,null,null,null,null,null,null,null,null,null,{"$f":"IFERROR(IF(O1=\"مباشـــر\",\"اذن اضافة رقم\",IF(O1=\"ماستر لينك\",\"تفويض رقم\",\"\")),\"\")","v":""}]
[]
["NO.","N.Q.","MODEL","Q","CODE","البيان",null,"NO.","N.Q.","MODEL","Q","CODE","البيان",null,"التاريخ","رقم الاذن","العميل"]
[{"$f":"IF(F5<>\"\",1,\"\")","v":1},{"$f":"IF(C5<>\"\",COUNTIF($C$5:C5,C5),\"\")","v":1},"تكييف",{"$f":"IF(AND(F5<>E5,E5<>E4:E4),COUNTIF($E$5:$E$200,E5),\"\")","v":196},{"$f":"IFERROR(MID(F5,FIND(\"/\",F5)-4,4),\"\")","v":"2029"},"2029/1",null,{"$f":"IF(M5<>\"\",1,\"\")","v":1},{"$f":"IF(J5<>\"\",COUNTIF($J$5:J5,J5),\"\")","v":1},"شباك",{"$f":"IF(AND(M5<>L5,L5<>L4:L4),COUNTIF($L$5:$L$200,L5),\"\")","v":196},{"$f":"IFERROR(MID(M5,FIND(\"/\",M5)-4,4),\"\")","v":"2029"},"2029/2",null,"2020-03-07",120,"حسام"]
[{"$f":"IF(F6<>\"\",1,\"\")","v":1},{"$f":"IF(C6<>\"\",COUNTIF($C$5:C6,C6),\"\")","v":2},"تكييف",{"$f":"IF(AND(F6<>E6,E6<>E5:E5),COUNTIF($E$5:$E$200,E6),\"\")","v":""},{"$f":"IFERROR(MID(F6,FIND(\"/\",F6)-4,4),\"\")","v":"2029"},"2029/2",null,{"$f":"IF(M6<>\"\",1,\"\")","v":1},{"$f":"IF(J6<>\"\",COUNTIF($J$5:J6,J6),\"\")","v":2},"شباك",{"$f":"IF(AND(M6<>L6,L6<>L5:L5),COUNTIF($L$5:$L$200,L6),\"\")","v":""},{"$f":"IFERROR(MID(M6,FIND(\"/\",M6)-4,4),\"\")","v":"2029"},"2029/3",null,"2020-03-08",121,"حسام"]
[1,{"$f":"IF(C7<>\"\",COUNTIF($C$5:C7,C7),\"\")","v":3},"تكييف","","2029","2029/3",null,1,{"$f":"IF(J7<>\"\",COUNTIF($J$5:J7,J7),\"\")","v":3},"شباك","","2029","2029/4",null,"2020-03-09",122,"حسام"]
[1,{"$f":"IF(C8<>\"\",COUNTIF($C$5:C8,C8),\"\")","v":4},"تكييف","","2029","2029/4",null,1,{"$f":"IF(J8<>\"\",COUNTIF($J$5:J8,J8),\"\")","v":4},"شباك","","2029","2029/5",null,"2020-03-10",123,"حسام"]
[1,{"$f":"IF(C9<>\"\",COUNTIF($C$5:C9,C9),\"\")","v":5},"تكييف","","2029","2029/5",null,1,{"$f":"IF(J9<>\"\",COUNTIF($J$5:J9,J9),\"\")","v":5},"شباك","","2029","2029/6",null,"2020-03-11",124,"حسام"]
[1,{"$f":"IF(C10<>\"\",COUNTIF($C$5:C10,C10),\"\")","v":6},"تكييف","","2029","2029/6",null,1,{"$f":"IF(J10<>\"\",COUNTIF($J$5:J10,J10),\"\")","v":6},"شباك","","2029","2029/7",null,"2020-03-12",125,"حسام"]
[1,{"$f":"IF(C11<>\"\",COUNTIF($C$5:C11,C11),\"\")","v":7},"تكييف","","2029","2029/7",null,1,{"$f":"IF(J11<>\"\",COUNTIF($J$5:J11,J11),\"\")","v":7},"شباك","","2029","2029/8",null,"2020-03-13",126,"حسام"]
[1,{"$f":"IF(C12<>\"\",COUNTIF($C$5:C12,C12),\"\")","v":8},"تكييف","","2029","2029/8",null,1,{"$f":"IF(J12<>\"\",COUNTIF($J$5:J12,J12),\"\")","v":8},"شباك","","2029","2029/9",null,"2020-03-14",127,"حسام"]
[1,{"$f":"IF(C13<>\"\",COUNTIF($C$5:C13,C13),\"\")","v":9},"تكييف","","2029","2029/9",null,1,{"$f":"IF(J13<>\"\",COUNTIF($J$5:J13,J13),\"\")","v":9},"شباك","","2029","2029/10",null,"2020-03-15",128,"حسام"]
[1,{"$f":"IF(C14<>\"\",COUNTIF($C$5:C14,C14),\"\")","v":10},"تكييف","","2029","2029/10",null,1,{"$f":"IF(J14<>\"\",COUNTIF($J$5:J14,J14),\"\")","v":10},"شباك","","2029","2029/11",null,"2020-03-16",129,"حسام"]
[1,{"$f":"IF(C15<>\"\",COUNTIF($C$5:C15,C15),\"\")","v":11},"تكييف","","2029","2029/11",null,1,{"$f":"IF(J15<>\"\",COUNTIF($J$5:J15,J15),\"\")","v":11},"شباك","","2029","2029/12",null,"2020-03-17",130,"حسام"]
[1,{"$f":"IF(C16<>\"\",COUNTIF($C$5:C16,C16),\"\")","v":12},"تكييف","","2029","2029/12",null,1,{"$f":"IF(J16<>\"\",COUNTIF($J$5:J16,J16),\"\")","v":12},"شباك","","2029","2029/13",null,"2020-03-18",131,"حسام"]
[1,{"$f":"IF(C17<>\"\",COUNTIF($C$5:C17,C17),\"\")","v":13},"تكييف","","2029","2029/13",null,1,{"$f":"IF(J17<>\"\",COUNTIF($J$5:J17,J17),\"\")","v":13},"شباك","","2029","2029/14",null,"2020-03-19",132,"حسام"]
[1,{"$f":"IF(C18<>\"\",COUNTIF($C$5:C18,C18),\"\")","v":14},"تكييف","","2029","2029/14",null,1,{"$f":"IF(J18<>\"\",COUNTIF($J$5:J18,J18),\"\")","v":14},"شباك","","2029","2029/15",null,"2020-03-20",133,"حسام"]
[1,{"$f":"IF(C19<>\"\",COUNTIF($C$5:C19,C19),\"\")","v":15},"تكييف","","2029","2029/15",null,1,{"$f":"IF(J19<>\"\",COUNTIF($J$5:J19,J19),\"\")","v":15},"شباك","","2029","2029/16",null,"2020-03-21",134,"حسام"]
[1,{"$f":"IF(C20<>\"\",COUNTIF($C$5:C20,C20),\"\")","v":16},"تكييف","","2029","2029/16",null,1,{"$f":"IF(J20<>\"\",COUNTIF($J$5:J20,J20),\"\")","v":16},"شباك","","2029","2029/17",null,"2020-03-22",135,"حسام"]
{"$rows_left_out":186}
{"sheet":"120","index":4,"n_rows":205,"n_cols":17,"rows_kept":205,"cut":false,"hidden":false,"merged":[]}
["ORDER NO.",null,{"$f":"RIGHT(CELL(\"filename\",A1),LEN(CELL(\"filename\",A1))-FIND(\"]\",CELL(\"filename\",A1)))","v":"120"},null,"CUS.NAME","حسام",{"$f":"IFERROR(VLOOKUP(F1,#REF!,2,FALSE),\"\")","v":""},"DATE","2020-03-07",null,null,"OFFICER","Hosam Pasha","STORE"]
[null,null,null,null,null,null,null,null,null,null,null,null,{"$f":"IFERROR(IF(O1=\"مباشـــر\",\"اذن اضافة رقم\",IF(O1=\"ماستر لينك\",\"تفويض رقم\",\"\")),\"\")","v":""}]
[]
["NO.","N.Q.","MODEL","Q","CODE","البيان",null,"NO.","N.Q.","MODEL","Q","CODE","البيان",null,"التاريخ","رقم الاذن","العميل"]
[{"$f":"IF(F5<>\"\",1,\"\")","v":1},{"$f":"IF(C5<>\"\",COUNTIF($C$5:C5,C5),\"\")","v":1},{"$f":"IF(F5<>\"\",IFERROR(VLOOKUP(RIGHT(LEFT(F5,FIND(\"/\",F5)-1),4),كود!$A:$C,2,FALSE),\"الكود غير صحيح\"),\"\")","v":"لاب توب hp"},{"$f":"IF(AND(F5<>E5,E5<>E4:E4),COUNTIF($E$5:$E$200,E5),\"\")","v":196},{"$f":"IFERROR(MID(F5,FIND(\"/\",F5)-4,4),\"\")","v":"2029"},"2029/1",null,{"$f":"IF(M5<>\"\",1,\"\")","v":1},{"$f":"IF(J5<>\"\",COUNTIF($J$5:J5,J5),\"\")","v":1},{"$f":"IF(M5<>\"\",IFERROR(VLOOKUP(RIGHT(LEFT(M5,FIND(\"/\",M5)-1),4),كود!$A:$C,2,FALSE),\"الكود غير صحيح\"),\"\")","v":"لاب توب hp"},{"$f":"IF(AND(M5<>L5,L5<>L4:L4),COUNTIF($L$5:$L$200,L5),\"\")","v":196},{"$f":"IFERROR(MID(M5,FIND(\"/\",M5)-4,4),\"\")","v":"2029"},"2029/2",null,"2020-03-07",120,"احمد"]
[{"$f":"IFERROR(IF(F6<>\"\",A5+1,\"\"),\"\")","v":2},{"$f":"IF(C6<>\"\",COUNTIF($C$5:C6,C6),\"\")","v":2},{"$f":"IF(F6<>\"\",IFERROR(VLOOKUP(RIGHT(LEFT(F6,FIND(\"/\",F6)-1),4),كود!$A:$C,2,FALSE),\"الكود غير صحيح\"),\"\")","v":"لاب توب hp"},{"$f":"IF(AND(F6<>E6,E6<>E5:E5),COUNTIF($E$5:$E$200,E6),\"\")","v":""},{"$f":"IFERROR(MID(F6,FIND(\"/\",F6)-4,4),\"\")","v":"2029"},"2029/2",null,{"$f":"IF(M6<>\"\",1,\"\")","v":1},{"$f":"IF(J6<>\"\",COUNTIF($J$5:J6,J6),\"\")","v":2},{"$f":"IF(M6<>\"\",IFERROR(VLOOKUP(RIGHT(LEFT(M6,FIND(\"/\",M6)-1),4),كود!$A:$C,2,FALSE),\"الكود غير صحيح\"),\"\")","v":"لاب توب hp"},{"$f":"IF(AND(M6<>L6,L6<>L5:L5),COUNTIF($L$5:$L$200,L6),\"\")","v":""},{"$f":"IFERROR(MID(M6,FIND(\"/\",M6)-4,4),\"\")","v":"2029"},"2029/3",null,"2020-03-08",120,"احمد"]
[3,{"$f":"IF(C7<>\"\",COUNTIF($C$5:C7,C7),\"\")","v":3},{"$f":"IF(F7<>\"\",IFERROR(VLOOKUP(RIGHT(LEFT(F7,FIND(\"/\",F7)-1),4),كود!$A:$C,2,FALSE),\"الكود غير صحيح\"),\"\")","v":"لاب توب hp"},"","2029","2029/3",null,1,{"$f":"IF(J7<>\"\",COUNTIF($J$5:J7,J7),\"\")","v":3},{"$f":"IF(M7<>\"\",IFERROR(VLOOKUP(RIGHT(LEFT(M7,FIND(\"/\",M7)-1),4),كود!$A:$C,2,FALSE),\"الكود غير صحيح\"),\"\")","v":"لاب توب hp"},"","2029","2029/4",null,"2020-03-09",120,"احمد"]
[4,{"$f":"IF(C8<>\"\",COUNTIF($C$5:C8,C8),\"\")","v":4},{"$f":"IF(F8<>\"\",IFERROR(VLOOKUP(RIGHT(LEFT(F8,FIND(\"/\",F8)-1),4),كود!$A:$C,2,FALSE),\"الكود غير صحيح\"),\"\")","v":"لاب توب hp"},"","2029","2029/4",null,1,{"$f":"IF(J8<>\"\",COUNTIF($J$5:J8,J8),\"\")","v":4},{"$f":"IF(M8<>\"\",IFERROR(VLOOKUP(RIGHT(LEFT(M8,FIND(\"/\",M8)-1),4),كود!$A:$C,2,FALSE),\"الكود غير صحيح\"),\"\")","v":"لاب توب hp"},"","2029","2029/5",null,"2020-03-10",120,"احمد"]
[5,{"$f":"IF(C9<>\"\",COUNTIF($C$5:C9,C9),\"\")","v":5},{"$f":"IF(F9<>\"\",IFERROR(VLOOKUP(RIGHT(LEFT(F9,FIND(\"/\",F9)-1),4),كود!$A:$C,2,FALSE),\"الكود غير صحيح\"),\"\")","v":"لاب توب hp"},"","2029","2029/5",null,1,{"$f":"IF(J9<>\"\",COUNTIF($J$5:J9,J9),\"\")","v":5},{"$f":"IF(M9<>\"\",IFERROR(VLOOKUP(RIGHT(LEFT(M9,FIND(\"/\",M9)-1),4),كود!$A:$C,2,FALSE),\"الكود غير صحيح\"),\"\")","v":"لاب توب hp"},"","2029","2029/6",null,"2020-03-11",120,"احمد"]
[6,{"$f":"IF(C10<>\"\",COUNTIF($C$5:C10,C10),\"\")","v":6},{"$f":"IF(F10<>\"\",IFERROR(VLOOKUP(RIGHT(LEFT(F10,FIND(\"/\",F10)-1),4),كود!$A:$C,2,FALSE),\"الكود غير صحيح\"),\"\")","v":"لاب توب hp"},"","2029","2029/6",null,1,{"$f":"IF(J10<>\"\",COUNTIF($J$5:J10,J10),\"\")","v":6},{"$f":"IF(M10<>\"\",IFERROR(VLOOKUP(RIGHT(LEFT(M10,FIND(\"/\",M10)-1),4),كود!$A:$C,2,FALSE),\"الكود غير صحيح\"),\"\")","v":"لاب توب hp"},"","2029","2029/7",null,"2020-03-12",120,"احمد"]
[7,{"$f":"IF(C11<>\"\",COUNTIF($C$5:C11,C11),\"\")","v":7},{"$f":"IF(F11<>\"\",IFERROR(VLOOKUP(RIGHT(LEFT(F11,FIND(\"/\",F11)-1),4),كود!$A:$C,2,FALSE),\"الكود غير صحيح\"),\"\")","v":"لاب توب hp"},"","2029","2029/7",null,1,{"$f":"IF(J11<>\"\",COUNTIF($J$5:J11,J11),\"\")","v":7},{"$f":"IF(M11<>\"\",IFERROR(VLOOKUP(RIGHT(LEFT(M11,FIND(\"/\",M11)-1),4),كود!$A:$C,2,FALSE),\"الكود غير صحيح\"),\"\")","v":"لاب توب hp"},"","2029","2029/8",null,"2020-03-13",120,"احمد"]
[8,{"$f":"IF(C12<>\"\",COUNTIF($C$5:C12,C12),\"\")","v":8},{"$f":"IF(F12<>\"\",IFERROR(VLOOKUP(RIGHT(LEFT(F12,FIND(\"/\",F12)-1),4),كود!$A:$C,2,FALSE),\"الكود غير صحيح\"),\"\")","v":"لاب توب hp"},"","2029","2029/8",null,1,{"$f":"IF(J12<>\"\",COUNTIF($J$5:J12,J12),\"\")","v":8},{"$f":"IF(M12<>\"\",IFERROR(VLOOKUP(RIGHT(LEFT(M12,FIND(\"/\",M12)-1),4),كود!$A:$C,2,FALSE),\"الكود غير صحيح\"),\"\")","v":"لاب توب hp"},"","2029","2029/9",null,"2020-03-14",120,"احمد"]
[9,{"$f":"IF(C13<>\"\",COUNTIF($C$5:C13,C13),\"\")","v":9},{"$f":"IF(F13<>\"\",IFERROR(VLOOKUP(RIGHT(LEFT(F13,FIND(\"/\",F13)-1),4),كود!$A:$C,2,FALSE),\"الكود غير صحيح\"),\"\")","v":"لاب توب hp"},"","2029","2029/9",null,1,{"$f":"IF(J13<>\"\",COUNTIF($J$5:J13,J13),\"\")","v":9},{"$f":"IF(M13<>\"\",IFERROR(VLOOKUP(RIGHT(LEFT(M13,FIND(\"/\",M13)-1),4),كود!$A:$C,2,FALSE),\"الكود غير صحيح\"),\"\")","v":"لاب توب hp"},"","2029","2029/10",null,"2020-03-15",120,"احمد"]
[10,{"$f":"IF(C14<>\"\",COUNTIF($C$5:C14,C14),\"\")","v":10},{"$f":"IF(F14<>\"\",IFERROR(VLOOKUP(RIGHT(LEFT(F14,FIND(\"/\",F14)-1),4),كود!$A:$C,2,FALSE),\"الكود غير صحيح\"),\"\")","v":"لاب توب hp"},"","2029","2029/10",null,1,{"$f":"IF(J14<>\"\",COUNTIF($J$5:J14,J14),\"\")","v":10},{"$f":"IF(M14<>\"\",IFERROR(VLOOKUP(RIGHT(LEFT(M14,FIND(\"/\",M14)-1),4),كود!$A:$C,2,FALSE),\"الكود غير صحيح\"),\"\")","v":"لاب توب hp"},"","2029","2029/11",null,"2020-03-16",120,"احمد"]
[11,{"$f":"IF(C15<>\"\",COUNTIF($C$5:C15,C15),\"\")","v":11},{"$f":"IF(F15<>\"\",IFERROR(VLOOKUP(RIGHT(LEFT(F15,FIND(\"/\",F15)-1),4),كود!$A:$C,2,FALSE),\"الكود غير صحيح\"),\"\")","v":"لاب توب hp"},"","2029","2029/11",null,1,{"$f":"IF(J15<>\"\",COUNTIF($J$5:J15,J15),\"\")","v":11},{"$f":"IF(M15<>\"\",IFERROR(VLOOKUP(RIGHT(LEFT(M15,FIND(\"/\",M15)-1),4),كود!$A:$C,2,FALSE),\"الكود غير صحيح\"),\"\")","v":"لاب توب hp"},"","2029","2029/12",null,"2020-03-17",120,"احمد"]
[12,{"$f":"IF(C16<>\"\",COUNTIF($C$5:C16,C16),\"\")","v":12},{"$f":"IF(F16<>\"\",IFERROR(VLOOKUP(RIGHT(LEFT(F16,FIND(\"/\",F16)-1),4),كود!$A:$C,2,FALSE),\"الكود غير صحيح\"),\"\")","v":"لاب توب hp"},"","2029","2029/12",null,1,{"$f":"IF(J16<>\"\",COUNTIF($J$5:J16,J16),\"\")","v":12},{"$f":"IF(M16<>\"\",IFERROR(VLOOKUP(RIGHT(LEFT(M16,FIND(\"/\",M16)-1),4),كود!$A:$C,2,FALSE),\"الكود غير صحيح\"),\"\")","v":"لاب توب hp"},"","2029","2029/13",null,"2020-03-18",120,"احمد"]
[13,{"$f":"IF(C17<>\"\",COUNTIF($C$5:C17,C17),\"\")","v":13},{"$f":"IF(F17<>\"\",IFERROR(VLOOKUP(RIGHT(LEFT(F17,FIND(\"/\",F17)-1),4),كود!$A:$C,2,FALSE),\"الكود غير صحيح\"),\"\")","v":"لاب توب hp"},"","2029","2029/13",null,1,{"$f":"IF(J17<>\"\",COUNTIF($J$5:J17,J17),\"\")","v":13},{"$f":"IF(M17<>\"\",IFERROR(VLOOKUP(RIGHT(LEFT(M17,FIND(\"/\",M17)-1),4),كود!$A:$C,2,FALSE),\"الكود غير صحيح\"),\"\")","v":"لاب توب hp"},"","2029","2029/14",null,"2020-03-19",120,"احمد"]
[14,{"$f":"IF(C18<>\"\",COUNTIF($C$5:C18,C18),\"\")","v":14},{"$f":"IF(F18<>\"\",IFERROR(VLOOKUP(RIGHT(LEFT(F18,FIND(\"/\",F18)-1),4),كود!$A:$C,2,FALSE),\"الكود غير صحيح\"),\"\")","v":"لاب توب hp"},"","2029","2029/14",null,1,{"$f":"IF(J18<>\"\",COUNTIF($J$5:J18,J18),\"\")","v":14},{"$f":"IF(M18<>\"\",IFERROR(VLOOKUP(RIGHT(LEFT(M18,FIND(\"/\",M18)-1),4),كود!$A:$C,2,FALSE),\"الكود غير صحيح\"),\"\")","v":"لاب توب hp"},"","2029","2029/15",null,"2020-03-20",120,"احمد"]
[15,{"$f":"IF(C19<>\"\",COUNTIF($C$5:C19,C19),\"\")","v":15},{"$f":"IF(F19<>\"\",IFERROR(VLOOKUP(RIGHT(LEFT(F19,FIND(\"/\",F19)-1),4),كود!$A:$C,2,FALSE),\"الكود غير صحيح\"),\"\")","v":"لاب توب hp"},"","2029","2029/15",null,1,{"$f":"IF(J19<>\"\",COUNTIF($J$5:J19,J19),\"\")","v":15},{"$f":"IF(M19<>\"\",IFERROR(VLOOKUP(RIGHT(LEFT(M19,FIND(\"/\",M19)-1),4),كود!$A:$C,2,FALSE),\"الكود غير صحيح\"),\"\")","v":"لاب توب hp"},"","2029","2029/16",null,"2020-03-21",120,"احمد"]
[16,{"$f":"IF(C20<>\"\",COUNTIF($C$5:C20,C20),\"\")","v":16},{"$f":"IF(F20<>\"\",IFERROR(VLOOKUP(RIGHT(LEFT(F20,FIND(\"/\",F20)-1),4),كود!$A:$C,2,FALSE),\"الكود غير صحيح\"),\"\")","v":"لاب توب hp"},"","2029","2029/16",null,1,{"$f":"IF(J20<>\"\",COUNTIF($J$5:J20,J20),\"\")","v":16},{"$f":"IF(M20<>\"\",IFERROR(VLOOKUP(RIGHT(LEFT(M20,FIND(\"/\",M20)-1),4),كود!$A:$C,2,FALSE),\"الكود غير صحيح\"),\"\")","v":"لاب توب hp"},"","2029","2029/17",null,"2020-03-22",120,"احمد"]
{"$rows_left_out":185}