{"text_format":"1","workbook":"xlsx","n_sheets":6,"sheets":["إهداء","TS","T1","B1","T2","B2"],"not_rendered":{"charts":0,"images":5,"macros":1,"external_links":0,"defined_names":7,"comments":0,"pivot_tables":0},"unopened":[],"bounds":{"document_bytes":16777216,"sheet_cells":100000,"rows_first":2000,"rows_last":500,"rows_between":2000,"halvings":0,"cell_chars":16384,"cell_head_chars":4096},"cells_cut":0,"cells_raw":0,"read":"whole","date_system":"1900"}

{"sheet":"إهداء","index":0,"n_rows":12,"n_cols":1,"rows_kept":12,"cut":false,"hidden":false,"merged":[[0,0,10,6],[11,0,11,6]]}
[]
[]
[]
[]
[]
[]
[]
[]
[]
[]
[]
["هشام      أستاذ التعليم الابتدائي  مديرية :الجديدة"]

{"sheet":"TS","index":1,"n_rows":65,"n_cols":16,"rows_kept":65,"cut":false,"hidden":false,"merged":[[0,9,0,11],[0,12,0,14],[1,9,1,11],[1,12,1,14],[2,9,2,11],[2,12,2,14],[9,0,9,2],[3,9,3,11],[3,12,3,14],[4,0,4,5],[4,9,4,11],[4,12,4,14],[5,0,5,5],[5,9,5,11],[5,12,5,14],[5,15,5,18],[6,0,6,5],[7,0,7,5],[7,11,7,14],[8,0,8,2],[13,4,14,4],[13,8,13,13],[13,14,14,14],[10,0,10,2],[11,0,11,2],[13,0,14,0],[13,1,14,1],[13,2,14,2],[13,3,14,3]]}
[null,null,null,null,null,null,null,null,null,"السنة الدراسية",null,null,"2020-2019",null,null,"المواد غير المعممة"]
[null,null,null,null,null,null,null,null,null,"الأستاذ(ة)",null,null,"هشام",null,null,"الامازيغية"]
[null,null,null,null,null,null,null,null,null,"المستوى",null,null,"الأول",null,null,0]
[null,null,null,null,null,null,null,null,null,"الوحدة الدراسية",null,null,"المركزية"]
["الأكاديمية الجهوية للتربية والتكوين",null,null,null,null,null,null,null,null,"الفوج",null,null,1,null,null,"وضع 0 إن كانت غير معممة وترك خانات نقطها فارغة"]
["جهة: الدارالبيضاء-سطات",null,null,null,null,null,null,null,null,"عدد التلاميذ",null,null,{"$f":"MAX(A16:A65)","v":29},null,null,"ووضع 1 إن كانت معممة وتعبئة خانات نقطها"]
["مديرية :المحمدية"]
["مؤسسة :النجاح",null,null,null,null,null,null,null,null,null,null,"احصائيات المتعلمين"]
[null,null,null,null,null,null,null,null,null,null,null,null,"جدد","مكرر","مجموع"]
[null,null,null,null,null,null,null,null,null,null,null,"ذكور",{"$f":"COUNTIFS(D16:D65,\"ذ\",E16:E65,\"\")","v":14},{"$f":"COUNTIFS(D16:D65,\"ذ\",E16:E65,\"مك\")","v":2},{"$f":"SUM(M10:N10)","v":16}]
[null,null,null,null,null,null,null,null,null,null,null,"انات",{"$f":"COUNTIFS(D16:D65,\"أ\",E16:E65,\"\")","v":12},{"$f":"COUNTIFS(D16:D39,\"أ\",E16:E39,\"مك\")","v":1},{"$f":"SUM(M11:N11)","v":13}]
[null,null,null,null,null,null,null,null,null,null,null,"مجموع",{"$f":"SUM(M10:M11)","v":26},{"$f":"SUM(N10:N11)","v":3},{"$f":"SUM(O10:O11)","v":29}]
[]
["ر ت","رقم التلميذ","الاسم و النسب","الجنس","التكرار","رقم ","تاريخ","تاريخ ","مدة الدراسة",null,null,null,null,null,"ملاحظات"]
[null,null,null,null,null,"التسجيل","الازدياد","التسجيل ",1,2,3,4,5,6]
[{"$f":"IF($C16=\"\",\"\", MAX($A$15:$A15)+1 )","v":1},"AZ22334455","ياسين النسب1","ذ","مك",1400,"2010-07-20"]
[{"$f":"IF($C17=\"\",\"\", MAX($A$15:$A16)+1 )","v":2},"AZ22334456","ريان النسب2","ذ",null,1401,"2012-07-04"]
[{"$f":"IF($C18=\"\",\"\", MAX($A$15:$A17)+1 )","v":3},"AZ22334457","يوسف النسب3","ذ",null,1402,"2010-08-01"]
[{"$f":"IF($C19=\"\",\"\", MAX($A$15:$A18)+1 )","v":4},"AZ22334458","ايناس النسب4","أ","مك",1403,"2012-12-02"]
[{"$f":"IF($C20=\"\",\"\", MAX($A$15:$A19)+1 )","v":5},"AZ22334459","طه النسب5","ذ","مك",1404,"2012-09-25"]
[{"$f":"IF($C21=\"\",\"\", MAX($A$15:$A20)+1 )","v":6},"AZ22334460","أمين النسب6","ذ",null,1405,"2012-03-12"]
[{"$f":"IF($C22=\"\",\"\", MAX($A$15:$A21)+1 )","v":7},"AZ22334461","ريان النسب7","ذ",null,1406,"2012-10-01"]
[{"$f":"IF($C23=\"\",\"\", MAX($A$15:$A22)+1 )","v":8},"AZ22334462","نبيل النسب8","ذ",null,1407,"2012-10-05"]
[{"$f":"IF($C24=\"\",\"\", MAX($A$15:$A23)+1 )","v":9},"AZ22334463","يحيى النسب9","ذ",null,1408,"2012-07-06"]
[{"$f":"IF($C25=\"\",\"\", MAX($A$15:$A24)+1 )","v":10},"AZ22334464","كريم النسب10","أ",null,1409,"2012-10-30"]
[{"$f":"IF($C26=\"\",\"\", MAX($A$15:$A25)+1 )","v":11},"AZ22334465","محمد ياسين النسب11","ذ",null,1410,"2013-03-23"]
[{"$f":"IF($C27=\"\",\"\", MAX($A$15:$A26)+1 )","v":12},"AZ22334466","دعاء النسب12","أ",null,1411,"2013-03-16"]
[{"$f":"IF($C28=\"\",\"\", MAX($A$15:$A27)+1 )","v":13},"AZ22334467","مريم النسب13","أ",null,1412,"2012-09-29"]
[{"$f":"IF($C29=\"\",\"\", MAX($A$15:$A28)+1 )","v":14},"AZ22334468","زكريا النسب14","ذ",null,1413,"2013-02-01"]
[{"$f":"IF($C30=\"\",\"\", MAX($A$15:$A29)+1 )","v":15},"AZ22334469","عبد المطلب النسب15","ذ",null,1414,"2012-05-23"]
[{"$f":"IF($C31=\"\",\"\", MAX($A$15:$A30)+1 )","v":16},"AZ22334470","حمدي النسب16","ذ",null,1415,"2012-10-15"]
[{"$f":"IF($C32=\"\",\"\", MAX($A$15:$A31)+1 )","v":17},"AZ22334471","اسماعيل النسب17","ذ",null,1416,"2012-11-25"]
[{"$f":"IF($C33=\"\",\"\", MAX($A$15:$A32)+1 )","v":18},"AZ22334472","آدم النسب18","ذ",null,1417,"2012-05-25"]
[{"$f":"IF($C34=\"\",\"\", MAX($A$15:$A33)+1 )","v":19},"AZ22334473","مريم النسب19","أ",null,1418,"2012-11-10"]
[{"$f":"IF($C35=\"\",\"\", MAX($A$15:$A34)+1 )","v":20},"AZ22334474","راضية النسب20","أ",null,1419,"2012-05-06"]
[{"$f":"IF($C36=\"\",\"\", MAX($A$15:$A35)+1 )","v":21},"AZ22334475","ريان النسب21","ذ",null,1420,"2012-09-07"]
[{"$f":"IF($C37=\"\",\"\", MAX($A$15:$A36)+1 )","v":22},"AZ22334476","أيمن النسب22","ذ",null,1421,"2013-02-26"]
[{"$f":"IF($C38=\"\",\"\", MAX($A$15:$A37)+1 )","v":23},"AZ22334477","ملاك النسب23","أ",null,1422,"2013-03-21"]
[{"$f":"IF($C39=\"\",\"\", MAX($A$15:$A38)+1 )","v":24},"AZ22334478","مريم النسب24","أ",null,1423,"2013-02-25"]
[{"$f":"IF($C40=\"\",\"\", MAX($A$15:$A39)+1 )","v":25},"AZ22334479","أمينة النسب25","أ",null,1424,"2013-03-27"]
[{"$f":"IF($C41=\"\",\"\", MAX($A$15:$A40)+1 )","v":26},"AZ22334480","اكرام النسب26","أ",null,1425,"2012-07-04"]
[{"$f":"IF($C42=\"\",\"\", MAX($A$15:$A41)+1 )","v":27},"AZ22334481","آية النسب27","أ",null,1426,"2012-05-15"]
[{"$f":"IF($C43=\"\",\"\", MAX($A$15:$A42)+1 )","v":28},"AZ22334482","غفران النسب28","أ",null,1427,"2012-10-16"]
[{"$f":"IF($C44=\"\",\"\", MAX($A$15:$A43)+1 )","v":29},"AZ22334483","أميرة  النسب29","أ",null,1428,"2012-08-11"]
[{"$f":"IF($C45=\"\",\"\", MAX($A$15:$A44)+1 )","v":""}]
[{"$f":"IF($C46=\"\",\"\", MAX($A$15:$A45)+1 )","v":""}]
[{"$f":"IF($C47=\"\",\"\", MAX($A$15:$A46)+1 )","v":""}]
[{"$f":"IF($C48=\"\",\"\", MAX($A$15:$A47)+1 )","v":""}]
[{"$f":"IF($C49=\"\",\"\", MAX($A$15:$A48)+1 )","v":""}]
[{"$f":"IF($C50=\"\",\"\", MAX($A$15:$A49)+1 )","v":""}]
[{"$f":"IF($C51=\"\",\"\", MAX($A$15:$A50)+1 )","v":""}]
[{"$f":"IF($C52=\"\",\"\", MAX($A$15:$A51)+1 )","v":""}]
[{"$f":"IF($C53=\"\",\"\", MAX($A$15:$A52)+1 )","v":""}]
[{"$f":"IF($C54=\"\",\"\", MAX($A$15:$A53)+1 )","v":""}]
[{"$f":"IF($C55=\"\",\"\", MAX($A$15:$A54)+1 )","v":""}]
[{"$f":"IF($C56=\"\",\"\", MAX($A$15:$A55)+1 )","v":""}]
[{"$f":"IF($C57=\"\",\"\", MAX($A$15:$A56)+1 )","v":""}]
[{"$f":"IF($C58=\"\",\"\", MAX($A$15:$A57)+1 )","v":""}]
[{"$f":"IF($C59=\"\",\"\", MAX($A$15:$A58)+1 )","v":""}]
[{"$f":"IF($C60=\"\",\"\", MAX($A$15:$A59)+1 )","v":""}]
[{"$f":"IF($C61=\"\",\"\", MAX($A$15:$A60)+1 )","v":""}]
[{"$f":"IF($C62=\"\",\"\", MAX($A$15:$A61)+1 )","v":""}]
[{"$f":"IF($C63=\"\",\"\", MAX($A$15:$A62)+1 )","v":""}]
[{"$f":"IF($C64=\"\",\"\", MAX($A$15:$A63)+1 )","v":""}]
[{"$f":"IF($C65=\"\",\"\", MAX($A$15:$A64)+1 )","v":""}]

{"sheet":"T1","index":2,"n_rows":101,"n_cols":64,"rows_kept":101,"cut":false,"hidden":false,"merged":[[7,42,7,43],[6,41,7,41],[6,42,6,53],[6,28,6,31],[6,32,7,32],[6,35,7,35],[6,38,7,38],[6,39,7,40],[6,33,7,34],[6,59,8,59],[6,60,8,60],[6,61,8,61],[6,62,8,62],[6,63,8,63],[7,0,8,0],[7,1,8,1],[7,2,8,2],[7,3,8,3],[7,4,8,4],[6,57,7,57],[6,58,8,58],[7,44,8,44],[7,45,7,46],[7,48,7,49],[7,50,8,50],[7,51,7,52],[6,54,7,54],[6,55,7,56],[7,47,8,47],[6,25,7,26],[6,36,7,37],[5,2,5,5],[6,6,6,23],[6,24,7,24],[6,27,7,27],[7,5,8,5],[7,6,7,8],[7,9,7,11],[7,18,7,20],[7,12,7,14],[7,15,7,17],[7,21,7,23],[4,2,4,5],[4,37,4,39],[4,40,4,42],[0,37,0,39],[0,40,0,42],[1,37,1,39],[1,40,1,42],[2,2,2,5],[2,37,2,39],[2,40,2,42],[0,2,1,5],[3,2,3,5],[3,8,4,34],[3,37,3,39],[3,40,3,42]]}
[null,null,null,null,null,null,null,null,null,null,null,null,null,null,null,null,null,null,null,null,null,null,null,null,null,null,null,null,null,null,null,null,null,null,null,null,null,"العــام الدراســي ",null,null,{"$f":"IF(TS!M1=\"\",\"\",TS!M1)","v":"2020-2019"}]
[null,null,null,null,null,null,null,null,null,null,null,null,null,null,null,null,null,null,null,null,null,null,null,null,null,null,null,null,null,null,null,null,null,null,null,null,null,"الأستاذ"]
[null,null,{"$f":"IF(TS!A5=\"\",\"\",TS!A5)","v":"الأكاديمية الجهوية للتربية والتكوين"},null,null,null,null,null,null,null,null,null,null,null,null,null,null,null,null,null,null,null,null,null,null,null,null,null,null,null,null,null,null,null,null,null,null,"المستوى "]
[null,null,{"$f":"IF(TS!A6=\"\",\"\",TS!A6)","v":"جهة: الدارالبيضاء-سطات"},null,null,null,null,null,"مجمل  نتائج الأسدوس الأول",null,null,null,null,null,null,null,null,null,null,null,null,null,null,null,null,null,null,null,null,null,null,null,null,null,null,null,null,"الوحدة المدرسية"]
[null,null,{"$f":"IF(TS!A7=\"\",\"\",TS!A7)","v":"مديرية :المحمدية"},null,null,null,null,null,null,null,null,null,null,null,null,null,null,null,null,null,null,null,null,null,null,null,null,null,null,null,null,null,null,null,null,null,null,"الفوج"]
[null,null,{"$f":"IF(TS!A8=\"\",\"\",TS!A8)","v":"مؤسسة :النجاح"}]
[null,null,null,null,null,null,"اللغة العربية",null,null,null,null,null,null,null,null,null,null,null,null,null,null,null,null,null,"معدل","الأمازيغية",null,"معدل","التربية الإسلامية",null,null,null,"معدل","النشاط العلمي",null,"معدل","التربية الفنية",null,"معدل","الرياضيات",null,"معدل","الفرنسية",null,null,null,null,null,null,null,null,null,null,null,"المعدل ","التربية البدنية",null,"معدل","معامل ت ب","مج المعاملات","مج المعدلات","معدل د1","الرتبة","الميزة"]
["ر.ت","رقم التلميذ","الاسم و النسب","تاريخ الإزدياد","الجنس","ر.التسجيل","التعبير الكتابي",null,null,"القراءة",null,null,"الإملاء",null,null,"الخط",null,null,"الاستماع والتحدث",null,null,"النقل",null,null,null,null,null,null,"فرض1","فرض2","فرض3","أنشطة",null,null,null,null,null,null,null,null,null,null,"Comptine/chant",null,"معدل","Graphisme",null,"معدل","Activités orales",null,"معدل","Projet de classe",null,"معدل"]
[null,null,null,null,null,null,"ن1","ن2","معدل","ن1","ن2","معدل","ن1","ن2","معدل","ن1","ن2","معدل","ن1","ن2","معدل","ن1","ن2","معدل","الوحدة","ن1","ن2","الوحدة","ن1","ن2","ن3","ن4","الوحدة","ن1","ن2","الوحدة","ن1","ن2","الوحدة","ن1","ن2","الوحدة","ن1","ن2",null,"ن1","ن2",null,"ن1","ن2",null,"ن1","ن2",null,"للوحدة","ن1","ن2","الوحدة"]
[{"$f":"IF(TS!A16=\"\",\"\",TS!A16)","v":1},{"$f":"IF(TS!B16=\"\",\"\",TS!B16)","v":"AZ22334455"},{"$f":"IF(TS!C16=\"\",\"\",TS!C16)","v":"ياسين النسب1"},{"$f":"IF(TS!G16=\"\",\"\",TS!G16)","v":"2010-07-20"},{"$f":"IF(TS!D16=\"\",\"\",TS!D16)","v":"ذ"},{"$f":"IF(TS!F16=\"\",\"\",TS!F16)","v":1400},6,6,{"$f":"IF(OR(G10=\"\",H10=\"\"),\"\",AVERAGE(G10:H10))","v":6},4,5,{"$f":"IF(OR(J10=\"\",K10=\"\"),\"\",AVERAGE(J10:K10))","v":4.5},3,8,{"$f":"IF(OR(M10=\"\",N10=\"\"),\"\",AVERAGE(M10:N10))","v":5.5},6,6.5,{"$f":"IF(OR(P10=\"\",Q10=\"\"),\"\",AVERAGE(P10:Q10))","v":6.25},4,5.5,{"$f":"IF(OR(S10=\"\",T10=\"\"),\"\",AVERAGE(S10:T10))","v":4.75},6.75,7,{"$f":"IF(OR(V10=\"\",W10=\"\"),\"\",AVERAGE(V10:W10))","v":6.875},{"$f":"IF(OR(I10=\"\",L10=\"\",O10=\"\",R10=\"\",U10=\"\",X10=\"\"),\"\",AVERAGE(I10,L10,O10,R10,U10,X10))","v":5.645833333333333},null,null,{"$f":"IF(OR(Z10=\"\",AA10=\"\"),\"\",AVERAGE(Z10:AA10))","v":""},5,4,5,4,{"$f":"IF(OR(AC10=\"\",AD10=\"\",AE10=\"\",AF10=\"\"),\"\",AVERAGE(AC10:AF10))","v":4.5},6.5,4,{"$f":"IF(OR(AH10=\"\",AI10=\"\"),\"\",AVERAGE(AH10:AI10))","v":5.25},5,7,{"$f":"IF(OR(AK10=\"\",AL10=\"\"),\"\",AVERAGE(AK10:AL10))","v":6},3,3,{"$f":"IF(OR(AN10=\"\",AO10=\"\"),\"\",AVERAGE(AN10:AO10))","v":3},4,3,{"$f":"IF(OR(AQ10=\"\",AR10=\"\"),\"\",AVERAGE(AQ10:AR10))","v":3.5},7.5,6,{"$f":"IF(OR(AT10=\"\",AU10=\"\"),\"\",AVERAGE(AT10:AU10))","v":6.75},3,4,{"$f":"IF(OR(AW10=\"\",AX10=\"\"),\"\",AVERAGE(AW10:AX10))","v":3.5},1,1,{"$f":"IF(OR(AZ10=\"\",BA10=\"\"),\"\",AVERAGE(AZ10:BA10))","v":1},{"$f":"IF(OR(AS10=\"\",AV10=\"\",AY10=\"\",BB10=\"\"),\"\",AVERAGE(AS10,AV10,AY10,BB10))","v":3.6875},7,8,{"$f":"IF(OR(BD10=\"\",BE10=\"\"),\"\",AVERAGE(BD10:BE10))","v":7.5},1,{"$f":"6+BG10+TS!$P$3","v":7},{"$f":"SUM(BF10,BC10,AP10,AM10,AJ10,AG10,AB10,Y10)","v":35.583333333333336},{"$f":"IF(B10=\"\",\"\",BI10/BH10)","v":5.0833333333333339},{"$f":"IF(BJ10=\"\",\"\",RANK(BJ10,$BJ$10:$BJ$69))","v":23},{"$f":"IF(BJ10=\"\",\"\",IF(BJ10>=8,\"تنويه\",IF(BJ10>=7,\"تشجيع\",IF(BJ10>=6,\"لوحة الشرف\",IF(BJ10>=5,\"متوسط\",IF(BJ10>=3,\"تنبيه\",\"توبيخ\"))))))","v":"متوسط"}]
[{"$f":"IF(TS!A17=\"\",\"\",TS!A17)","v":2},{"$f":"IF(TS!B17=\"\",\"\",TS!B17)","v":"AZ22334456"},{"$f":"IF(TS!C17=\"\",\"\",TS!C17)","v":"ريان النسب2"},{"$f":"IF(TS!G17=\"\",\"\",TS!G17)","v":"2012-07-04"},{"$f":"IF(TS!D17=\"\",\"\",TS!D17)","v":"ذ"},{"$f":"IF(TS!F17=\"\",\"\",TS!F17)","v":1401},5.5,9,{"$f":"IF(OR(G11=\"\",H11=\"\"),\"\",AVERAGE(G11:H11))","v":7.25},4.5,6.5,{"$f":"IF(OR(J11=\"\",K11=\"\"),\"\",AVERAGE(J11:K11))","v":5.5},1,2.5,{"$f":"IF(OR(M11=\"\",N11=\"\"),\"\",AVERAGE(M11:N11))","v":1.75},6,7,{"$f":"IF(OR(P11=\"\",Q11=\"\"),\"\",AVERAGE(P11:Q11))","v":6.5},5.5,6,{"$f":"IF(OR(S11=\"\",T11=\"\"),\"\",AVERAGE(S11:T11))","v":5.75},5.5,7.5,{"$f":"IF(OR(V11=\"\",W11=\"\"),\"\",AVERAGE(V11:W11))","v":6.5},{"$f":"IF(OR(I11=\"\",L11=\"\",O11=\"\",R11=\"\",U11=\"\",X11=\"\"),\"\",AVERAGE(I11,L11,O11,R11,U11,X11))","v":5.541666666666667},null,null,null,7.75,8,5,6,{"$f":"IF(OR(AC11=\"\",AD11=\"\",AE11=\"\",AF11=\"\"),\"\",AVERAGE(AC11:AF11))","v":6.6875},8,1.5,{"$f":"IF(OR(AH11=\"\",AI11=\"\"),\"\",AVERAGE(AH11:AI11))","v":4.75},6,6.75,{"$f":"IF(OR(AK11=\"\",AL11=\"\"),\"\",AVERAGE(AK11:AL11))","v":6.375},5,4.75,{"$f":"IF(OR(AN11=\"\",AO11=\"\"),\"\",AVERAGE(AN11:AO11))","v":4.875},8.5,5,{"$f":"IF(OR(AQ11=\"\",AR11=\"\"),\"\",AVERAGE(AQ11:AR11))","v":6.75},7,6,{"$f":"IF(OR(AT11=\"\",AU11=\"\"),\"\",AVERAGE(AT11:AU11))","v":6.5},4,5,{"$f":"IF(OR(AW11=\"\",AX11=\"\"),\"\",AVERAGE(AW11:AX11))","v":4.5},1,8.5,{"$f":"IF(OR(AZ11=\"\",BA11=\"\"),\"\",AVERAGE(AZ11:BA11))","v":4.75},{"$f":"IF(OR(AS11=\"\",AV11=\"\",AY11=\"\",BB11=\"\"),\"\",AVERAGE(AS11,AV11,AY11,BB11))","v":5.625},7,7.5,{"$f":"IF(OR(BD11=\"\",BE11=\"\"),\"\",AVERAGE(BD11:BE11))","v":7.25},1,{"$f":"6+BG11+TS!$P$3","v":7},{"$f":"SUM(BF11,BC11,AP11,AM11,AJ11,AG11,AB11,Y11)","v":41.104166666666664},{"$f":"IF(B11=\"\",\"\",BI11/BH11)","v":5.8720238095238093},{"$f":"IF(BJ11=\"\",\"\",RANK(BJ11,$BJ$10:$BJ$69))","v":20},{"$f":"IF(BJ11=\"\",\"\",IF(BJ11>=8,\"تنويه\",IF(BJ11>=7,\"تشجيع\",IF(BJ11>=6,\"لوحة الشرف\",IF(BJ11>=5,\"متوسط\",IF(BJ11>=3,\"تنبيه\",\"توبيخ\"))))))","v":"متوسط"}]
[{"$f":"IF(TS!A18=\"\",\"\",TS!A18)","v":3},{"$f":"IF(TS!B18=\"\",\"\",TS!B18)","v":"AZ22334457"},{"$f":"IF(TS!C18=\"\",\"\",TS!C18)","v":"يوسف النسب3"},{"$f":"IF(TS!G18=\"\",\"\",TS!G18)","v":"2010-08-01"},{"$f":"IF(TS!D18=\"\",\"\",TS!D18)","v":"ذ"},{"$f":"IF(TS!F18=\"\",\"\",TS!F18)","v":1402},8,10,9,8.5,8.5,8.5,4,9,6.5,9,9,9,7,8.5,7.75,9,9,9,8.2916666666666661,null,null,null,9,9,9,8,8.75,10,8.5,9.25,6,8.5,7.25,9.5,9,9.25,8.5,7,7.75,8.75,8.5,8.625,6.5,6,6.25,3,9,6,7.15625,8.5,7.5,8,1,{"$f":"6+BG12+TS!$P$3","v":7},57.947916666666664,8.2782738095238084,1,"تنويه"]
[{"$f":"IF(TS!A19=\"\",\"\",TS!A19)","v":4},{"$f":"IF(TS!B19=\"\",\"\",TS!B19)","v":"AZ22334458"},{"$f":"IF(TS!C19=\"\",\"\",TS!C19)","v":"ايناس النسب4"},{"$f":"IF(TS!G19=\"\",\"\",TS!G19)","v":"2012-12-02"},{"$f":"IF(TS!D19=\"\",\"\",TS!D19)","v":"أ"},{"$f":"IF(TS!F19=\"\",\"\",TS!F19)","v":1403},8,9,8.5,8.75,9,8.875,8.5,9,8.75,9,9,9,7.5,8.5,8,8.75,9,8.875,8.6666666666666661,null,null,null,8,9,7,9,8.25,7,8,7.5,5,8,6.5,7.5,7.25,7.375,8,7,7.5,8.5,8.5,8.5,6,7,6.5,7,9,8,7.625,8,8,8,1,{"$f":"6+BG13+TS!$P$3","v":7},53.916666666666664,7.7023809523809517,8,"تشجيع"]
[{"$f":"IF(TS!A20=\"\",\"\",TS!A20)","v":5},{"$f":"IF(TS!B20=\"\",\"\",TS!B20)","v":"AZ22334459"},{"$f":"IF(TS!C20=\"\",\"\",TS!C20)","v":"طه النسب5"},{"$f":"IF(TS!G20=\"\",\"\",TS!G20)","v":"2012-09-25"},{"$f":"IF(TS!D20=\"\",\"\",TS!D20)","v":"ذ"},{"$f":"IF(TS!F20=\"\",\"\",TS!F20)","v":1404},7,9,8,7.5,8.5,8,7,5,6,7.5,7.5,7.5,6,6.5,6.25,7,7.5,7.25,7.166666666666667,null,null,null,7.75,8,6.5,7,7.3125,9.75,8,8.875,7.5,7.5,7.5,7.5,6,6.75,8.5,6,7.25,8.5,6,7.25,5,5,5,8,8,8,6.875,6.75,7.5,7.125,1,{"$f":"6+BG14+TS!$P$3","v":7},51.604166666666664,7.3720238095238093,10,"تشجيع"]
[{"$f":"IF(TS!A21=\"\",\"\",TS!A21)","v":6},{"$f":"IF(TS!B21=\"\",\"\",TS!B21)","v":"AZ22334460"},{"$f":"IF(TS!C21=\"\",\"\",TS!C21)","v":"أمين النسب6"},{"$f":"IF(TS!G21=\"\",\"\",TS!G21)","v":"2012-03-12"},{"$f":"IF(TS!D21=\"\",\"\",TS!D21)","v":"ذ"},{"$f":"IF(TS!F21=\"\",\"\",TS!F21)","v":1405},5.5,7,6.25,4,6.5,5.25,1,7,4,4.5,6.5,5.5,4.5,6,5.25,6,7,6.5,5.458333333333333,null,null,null,8,9,8,8,8.25,3,7,5,4,8,6,4,5.75,4.875,8.75,5,6.875,3,8,5.5,4.5,4,4.25,6,1,3.5,5.03125,6,7,6.5,1,{"$f":"6+BG15+TS!$P$3","v":7},41.114583333333336,5.8735119047619051,19,"متوسط"]
[{"$f":"IF(TS!A22=\"\",\"\",TS!A22)","v":7},{"$f":"IF(TS!B22=\"\",\"\",TS!B22)","v":"AZ22334461"},{"$f":"IF(TS!C22=\"\",\"\",TS!C22)","v":"ريان النسب7"},{"$f":"IF(TS!G22=\"\",\"\",TS!G22)","v":"2012-10-01"},{"$f":"IF(TS!D22=\"\",\"\",TS!D22)","v":"ذ"},{"$f":"IF(TS!F22=\"\",\"\",TS!F22)","v":1406},2,3,2.5,3.5,3,3.25,1,3,2,4,4,4,3.5,3,3.25,1,3,2,2.8333333333333335,null,null,null,2.5,5,3,4,3.625,1.5,3,2.25,5,5,5,1,3,2,2,4,3,6.75,5,5.875,3,3,3,1,1,1,3.21875,6.5,7,6.75,1,{"$f":"6+BG16+TS!$P$3","v":7},25.677083333333332,3.6681547619047619,28,"تنبيه"]
[{"$f":"IF(TS!A23=\"\",\"\",TS!A23)","v":8},{"$f":"IF(TS!B23=\"\",\"\",TS!B23)","v":"AZ22334462"},{"$f":"IF(TS!C23=\"\",\"\",TS!C23)","v":"نبيل النسب8"},{"$f":"IF(TS!G23=\"\",\"\",TS!G23)","v":"2012-10-05"},{"$f":"IF(TS!D23=\"\",\"\",TS!D23)","v":"ذ"},{"$f":"IF(TS!F23=\"\",\"\",TS!F23)","v":1407},7,10,8.5,7.5,8.5,8,6.5,10,8.25,8.75,9.5,9.125,6.75,8.75,7.75,8.75,9.5,9.125,8.4583333333333339,null,null,null,9,9,7,9,8.5,5.5,9.5,7.5,6,8.75,7.375,10,6,8,8.5,7,7.75,8.75,8.5,8.625,5,6,5.5,7,9,8,7.46875,8,8,8,1,{"$f":"6+BG17+TS!$P$3","v":7},55.302083333333336,7.9002976190476195,4,"تشجيع"]
[{"$f":"IF(TS!A24=\"\",\"\",TS!A24)","v":9},{"$f":"IF(TS!B24=\"\",\"\",TS!B24)","v":"AZ22334463"},{"$f":"IF(TS!C24=\"\",\"\",TS!C24)","v":"يحيى النسب9"},{"$f":"IF(TS!G24=\"\",\"\",TS!G24)","v":"2012-07-06"},{"$f":"IF(TS!D24=\"\",\"\",TS!D24)","v":"ذ"},{"$f":"IF(TS!F24=\"\",\"\",TS!F24)","v":1408},7,8,7.5,8.5,9,8.75,4,6,5,8,8.75,8.375,6.75,7,6.875,8.5,9,8.75,7.541666666666667,null,null,null,7,7.5,6.5,7,7,7.5,3.75,5.625,5,7,6,4.5,8,6.25,8,6.5,7.25,8.5,6.5,7.5,4,6,5,1,6,3.5,5.8125,7.5,7.5,7.5,1,{"$f":"6+BG18+TS!$P$3","v":7},45.729166666666664,6.5327380952380949,12,"لوحة الشرف"]
[{"$f":"IF(TS!A25=\"\",\"\",TS!A25)","v":10},{"$f":"IF(TS!B25=\"\",\"\",TS!B25)","v":"AZ22334464"},{"$f":"IF(TS!C25=\"\",\"\",TS!C25)","v":"كريم النسب10"},{"$f":"IF(TS!G25=\"\",\"\",TS!G25)","v":"2012-10-30"},{"$f":"IF(TS!D25=\"\",\"\",TS!D25)","v":"أ"},{"$f":"IF(TS!F25=\"\",\"\",TS!F25)","v":1409},7.5,7,7.25,8.5,8.75,8.625,6.75,8.75,7.75,7,8.75,7.875,5.75,7.5,6.625,7.75,8.5,8.125,7.708333333333333,null,null,null,8,8,8,7.5,7.875,6.75,8.5,7.625,6,7,6.5,7.5,8.5,8,7.75,6,6.875,8,6.5,7.25,4,6,5,7,7,7,6.53125,8,7.5,7.75,1,{"$f":"6+BG19+TS!$P$3","v":7},51.989583333333336,7.4270833333333339,9,"تشجيع"]
[{"$f":"IF(TS!A26=\"\",\"\",TS!A26)","v":11},{"$f":"IF(TS!B26=\"\",\"\",TS!B26)","v":"AZ22334465"},{"$f":"IF(TS!C26=\"\",\"\",TS!C26)","v":"محمد ياسين النسب11"},{"$f":"IF(TS!G26=\"\",\"\",TS!G26)","v":"2013-03-23"},{"$f":"IF(TS!D26=\"\",\"\",TS!D26)","v":"ذ"},{"$f":"IF(TS!F26=\"\",\"\",TS!F26)","v":1410},8,10,9,8.75,9,8.875,9,9,9,9,9,9,7.5,9,8.25,9,9,9,8.8541666666666661,null,null,null,8,9,7,8.5,8.125,8,9,8.5,7,8,7.5,7.5,8.25,7.875,8.5,7,7.75,8.75,8.5,8.625,5,6,5.5,6,7,6.5,7.09375,8.5,8,8.25,1,{"$f":"6+BG20+TS!$P$3","v":7},56.197916666666664,8.0282738095238084,3,"تنويه"]
[{"$f":"IF(TS!A27=\"\",\"\",TS!A27)","v":12},{"$f":"IF(TS!B27=\"\",\"\",TS!B27)","v":"AZ22334466"},{"$f":"IF(TS!C27=\"\",\"\",TS!C27)","v":"دعاء النسب12"},{"$f":"IF(TS!G27=\"\",\"\",TS!G27)","v":"2013-03-16"},{"$f":"IF(TS!D27=\"\",\"\",TS!D27)","v":"أ"},{"$f":"IF(TS!F27=\"\",\"\",TS!F27)","v":1411},4,2,3,3,4,3.5,1,1,1,5,6,5.5,4,5.75,4.875,4,6,5,3.8125,null,null,null,7.5,7,5.5,6,6.5,4,2.75,3.375,5,6.75,5.875,1.5,1.25,1.375,7,5.5,6.25,6.5,6,6.25,3,4,3.5,1,8,4.5,5.125,7,7,7,1,{"$f":"6+BG21+TS!$P$3","v":7},33.0625,4.7232142857142856,25,"تنبيه"]
[{"$f":"IF(TS!A28=\"\",\"\",TS!A28)","v":13},{"$f":"IF(TS!B28=\"\",\"\",TS!B28)","v":"AZ22334467"},{"$f":"IF(TS!C28=\"\",\"\",TS!C28)","v":"مريم النسب13"},{"$f":"IF(TS!G28=\"\",\"\",TS!G28)","v":"2012-09-29"},{"$f":"IF(TS!D28=\"\",\"\",TS!D28)","v":"أ"},{"$f":"IF(TS!F28=\"\",\"\",TS!F28)","v":1412},4,1,2.5,3,4.5,3.75,1,1,1,5,6,5.5,4.5,5,4.75,4,6,5,3.75,null,null,null,5.5,8,8,7,7.125,4,3,3.5,5,6.75,5.875,3.5,3.75,3.625,7.5,4,5.75,7,6,6.5,3.5,4,3.75,1,1,1,4.25,7,7,7,1,{"$f":"6+BG22+TS!$P$3","v":7},35.125,5.0178571428571432,24,"متوسط"]
[{"$f":"IF(TS!A29=\"\",\"\",TS!A29)","v":14},{"$f":"IF(TS!B29=\"\",\"\",TS!B29)","v":"AZ22334468"},{"$f":"IF(TS!C29=\"\",\"\",TS!C29)","v":"زكريا النسب14"},{"$f":"IF(TS!G29=\"\",\"\",TS!G29)","v":"2013-02-01"},{"$f":"IF(TS!D29=\"\",\"\",TS!D29)","v":"ذ"},{"$f":"IF(TS!F29=\"\",\"\",TS!F29)","v":1413},8,10,9,8.75,8.75,8.75,6.5,9.5,8,7.75,7,7.375,7,8.75,7.875,8,8.5,8.25,8.2083333333333339,null,null,null,9,9,8,9,8.75,9.5,6.5,8,6,8.5,7.25,7,7,7,6.5,8.5,7.5,8.5,7,7.75,6.5,7,6.75,1,8,4.5,6.625,8.5,8,8.25,1,{"$f":"6+BG23+TS!$P$3","v":7},54.083333333333336,7.7261904761904763,6,"تشجيع"]
[{"$f":"IF(TS!A30=\"\",\"\",TS!A30)","v":15},{"$f":"IF(TS!B30=\"\",\"\",TS!B30)","v":"AZ22334469"},{"$f":"IF(TS!C30=\"\",\"\",TS!C30)","v":"عبد المطلب النسب15"},{"$f":"IF(TS!G30=\"\",\"\",TS!G30)","v":"2012-05-23"},{"$f":"IF(TS!D30=\"\",\"\",TS!D30)","v":"ذ"},{"$f":"IF(TS!F30=\"\",\"\",TS!F30)","v":1414},6,8,7,4,8,6,1,6.5,3.75,6,6.5,6.25,4.5,6.75,5.625,6,7,6.5,5.854166666666667,null,null,null,8.5,7,7.5,7,7.5,3,6.5,4.75,5,7,6,7.5,6.75,7.125,8.75,7,7.875,6.5,6.75,6.625,4.5,6,5.25,1,8,4.5,6.0625,7,7.5,7.25,1,{"$f":"6+BG24+TS!$P$3","v":7},44.541666666666664,6.3630952380952381,14,"لوحة الشرف"]
[{"$f":"IF(TS!A31=\"\",\"\",TS!A31)","v":16},{"$f":"IF(TS!B31=\"\",\"\",TS!B31)","v":"AZ22334470"},{"$f":"IF(TS!C31=\"\",\"\",TS!C31)","v":"حمدي النسب16"},{"$f":"IF(TS!G31=\"\",\"\",TS!G31)","v":"2012-10-15"},{"$f":"IF(TS!D31=\"\",\"\",TS!D31)","v":"ذ"},{"$f":"IF(TS!F31=\"\",\"\",TS!F31)","v":1415},4,1,2.5,5,6.5,5.75,4,2,3,4,4,4,4,5.5,4.75,5,4,4.5,4.083333333333333,null,null,null,6,7,2,4,4.75,3,4,3.5,5,5,5,1,2.75,1.875,4,6.5,5.25,5.5,6,5.75,3,5,4,1,8,4.5,4.875,6.5,6.5,6.5,1,{"$f":"6+BG25+TS!$P$3","v":7},30.583333333333332,4.3690476190476186,26,"تنبيه"]
[{"$f":"IF(TS!A32=\"\",\"\",TS!A32)","v":17},{"$f":"IF(TS!B32=\"\",\"\",TS!B32)","v":"AZ22334471"},{"$f":"IF(TS!C32=\"\",\"\",TS!C32)","v":"اسماعيل النسب17"},{"$f":"IF(TS!G32=\"\",\"\",TS!G32)","v":"2012-11-25"},{"$f":"IF(TS!D32=\"\",\"\",TS!D32)","v":"ذ"},{"$f":"IF(TS!F32=\"\",\"\",TS!F32)","v":1416},4,1,2.5,3,4,3.5,1,2.5,1.75,1,5.75,3.375,3,5,4,1,5.5,3.25,3.0625,null,null,null,3.75,6,3.5,5,4.5625,6,1,3.5,6,6.5,6.25,1.5,2,1.75,5.5,4,4.75,4,6,5,3,4,3.5,1,8,4.5,4.4375,6.5,6.5,6.5,1,{"$f":"6+BG26+TS!$P$3","v":7},30.0625,4.2946428571428568,27,"تنبيه"]
[{"$f":"IF(TS!A33=\"\",\"\",TS!A33)","v":18},{"$f":"IF(TS!B33=\"\",\"\",TS!B33)","v":"AZ22334472"},{"$f":"IF(TS!C33=\"\",\"\",TS!C33)","v":"آدم النسب18"},{"$f":"IF(TS!G33=\"\",\"\",TS!G33)","v":"2012-05-25"},{"$f":"IF(TS!D33=\"\",\"\",TS!D33)","v":"ذ"},{"$f":"IF(TS!F33=\"\",\"\",TS!F33)","v":1417},6.5,9,7.75,7,8.75,7.875,7,6.5,6.75,6.75,6.75,6.75,6.5,6.75,6.625,6.5,6.75,6.625,7.0625,null,null,null,8.25,7,7.25,6.5,7.25,5.25,7,6.125,6,7,6.5,3.75,4.5,4.125,8,6,7,6.75,6.5,6.625,4,5,4.5,7,9,8,6.53125,7,7,7,1,{"$f":"6+BG27+TS!$P$3","v":7},44.59375,6.3705357142857144,13,"لوحة الشرف"]
[{"$f":"IF(TS!A34=\"\",\"\",TS!A34)","v":19},{"$f":"IF(TS!B34=\"\",\"\",TS!B34)","v":"AZ22334473"},{"$f":"IF(TS!C34=\"\",\"\",TS!C34)","v":"مريم النسب19"},{"$f":"IF(TS!G34=\"\",\"\",TS!G34)","v":"2012-11-10"},{"$f":"IF(TS!D34=\"\",\"\",TS!D34)","v":"أ"},{"$f":"IF(TS!F34=\"\",\"\",TS!F34)","v":1418},7.5,9,8.25,8.75,8.75,8.75,9,8.75,8.875,8.75,9,8.875,7,8.75,7.875,8.5,9,8.75,8.5625,null,null,null,9,9,9,9,9,5.5,7.5,6.5,6,8.25,7.125,9,8,8.5,8.5,7,7.75,8.5,7.5,8,6,6.5,6.25,4,8,6,7,8,8,8,1,{"$f":"6+BG28+TS!$P$3","v":7},54.6875,7.8125,5,"تشجيع"]
[{"$f":"IF(TS!A35=\"\",\"\",TS!A35)","v":20},{"$f":"IF(TS!B35=\"\",\"\",TS!B35)","v":"AZ22334474"},{"$f":"IF(TS!C35=\"\",\"\",TS!C35)","v":"راضية النسب20"},{"$f":"IF(TS!G35=\"\",\"\",TS!G35)","v":"2012-05-06"},{"$f":"IF(TS!D35=\"\",\"\",TS!D35)","v":"أ"},{"$f":"IF(TS!F35=\"\",\"\",TS!F35)","v":1419},1,1,1,1,1,1,1,1,1,1,1,1,1,1,1,1,1,1,1,null,null,null,1.5,1,4,2,2.125,1.5,1,1.25,5,4,4.5,1,1,1,3,1,2,1,4,2.5,1,1,1,1,1,1,1.625,6,7,6.5,1,{"$f":"6+BG29+TS!$P$3","v":7},18,2.5714285714285716,29,"توبيخ"]
[{"$f":"IF(TS!A36=\"\",\"\",TS!A36)","v":21},{"$f":"IF(TS!B36=\"\",\"\",TS!B36)","v":"AZ22334475"},{"$f":"IF(TS!C36=\"\",\"\",TS!C36)","v":"ريان النسب21"},{"$f":"IF(TS!G36=\"\",\"\",TS!G36)","v":"2012-09-07"},{"$f":"IF(TS!D36=\"\",\"\",TS!D36)","v":"ذ"},{"$f":"IF(TS!F36=\"\",\"\",TS!F36)","v":1420},7,9,8,7.75,8.5,8.125,4.5,6,5.25,8,6.5,7.25,6,7,6.5,8.5,7,7.75,7.145833333333333,null,null,null,8.5,9,7.5,8,8.25,8,6.25,7.125,7,8,7.5,5,8,6.5,8.75,6,7.375,8.5,6.75,7.625,6,5,5.5,8,9,8.5,7.25,7.5,7.5,7.5,1,{"$f":"6+BG30+TS!$P$3","v":7},51.270833333333336,7.3244047619047619,11,"تشجيع"]
[{"$f":"IF(TS!A37=\"\",\"\",TS!A37)","v":22},{"$f":"IF(TS!B37=\"\",\"\",TS!B37)","v":"AZ22334476"},{"$f":"IF(TS!C37=\"\",\"\",TS!C37)","v":"أيمن النسب22"},{"$f":"IF(TS!G37=\"\",\"\",TS!G37)","v":"2013-02-26"},{"$f":"IF(TS!D37=\"\",\"\",TS!D37)","v":"ذ"},{"$f":"IF(TS!F37=\"\",\"\",TS!F37)","v":1421},6,7,6.5,5.5,7,6.25,1,2.5,1.75,6.5,8,7.25,6,6,6,6,9,7.5,5.875,null,null,null,8,7,7.5,6.5,7.25,4,2.75,3.375,5,7.5,6.25,4,6.25,5.125,8.5,4,6.25,7,6,6.5,5.5,4,4.75,8,1,4.5,5.5,7,7,7,1,{"$f":"6+BG31+TS!$P$3","v":7},40.375,5.7678571428571432,21,"متوسط"]
[{"$f":"IF(TS!A38=\"\",\"\",TS!A38)","v":23},{"$f":"IF(TS!B38=\"\",\"\",TS!B38)","v":"AZ22334477"},{"$f":"IF(TS!C38=\"\",\"\",TS!C38)","v":"ملاك النسب23"},{"$f":"IF(TS!G38=\"\",\"\",TS!G38)","v":"2013-03-21"},{"$f":"IF(TS!D38=\"\",\"\",TS!D38)","v":"أ"},{"$f":"IF(TS!F38=\"\",\"\",TS!F38)","v":1422},6,4,5,3,4,3.5,1,6.5,3.75,6.5,6,6.25,3,6,4.5,7.5,7.5,7.5,5.083333333333333,null,null,null,8,8,4.5,6,6.625,5,4.5,4.75,5,7,6,4.5,3.5,4,8.5,5,6.75,8.5,8.5,8.5,4,4.5,4.25,8,7,7.5,6.75,7,7,7,1,{"$f":"6+BG32+TS!$P$3","v":7},40.208333333333336,5.7440476190476195,22,"متوسط"]
[{"$f":"IF(TS!A39=\"\",\"\",TS!A39)","v":24},{"$f":"IF(TS!B39=\"\",\"\",TS!B39)","v":"AZ22334478"},{"$f":"IF(TS!C39=\"\",\"\",TS!C39)","v":"مريم النسب24"},{"$f":"IF(TS!G39=\"\",\"\",TS!G39)","v":"2013-02-25"},{"$f":"IF(TS!D39=\"\",\"\",TS!D39)","v":"أ"},{"$f":"IF(TS!F39=\"\",\"\",TS!F39)","v":1423},7.5,9,8.25,7,8.5,7.75,4.5,5,4.75,6,6.5,6.25,6,8.75,7.375,6,6.5,6.25,6.770833333333333,null,null,null,8,9,10,9,9,7,9,8,5,8,6.5,10,8.5,9.25,8.5,5.5,7,6,7.5,6.75,6,5,5.5,8,9,8.5,6.9375,7,8,7.5,1,{"$f":"6+BG33+TS!$P$3","v":7},53.958333333333336,7.7083333333333339,7,"تشجيع"]
[{"$f":"IF(TS!A40=\"\",\"\",TS!A40)","v":25},{"$f":"IF(TS!B40=\"\",\"\",TS!B40)","v":"AZ22334479"},{"$f":"IF(TS!C40=\"\",\"\",TS!C40)","v":"أمينة النسب25"},{"$f":"IF(TS!G40=\"\",\"\",TS!G40)","v":"2013-03-27"},{"$f":"IF(TS!D40=\"\",\"\",TS!D40)","v":"أ"},{"$f":"IF(TS!F40=\"\",\"\",TS!F40)","v":1424},6,9,7.5,4,7,5.5,1,3.5,2.25,6,8.5,7.25,5,6.75,5.875,5.5,9,7.25,5.9375,null,null,null,8,7,6,7,7,6,4.5,5.25,6,7.5,6.75,4,5,4.5,8.5,8,8.25,7,6.5,6.75,4.5,4.5,4.5,7,8,7.5,6.75,6.5,7.5,7,1,{"$f":"6+BG34+TS!$P$3","v":7},43.1875,6.1696428571428568,17,"لوحة الشرف"]
[{"$f":"IF(TS!A41=\"\",\"\",TS!A41)","v":26},{"$f":"IF(TS!B41=\"\",\"\",TS!B41)","v":"AZ22334480"},{"$f":"IF(TS!C41=\"\",\"\",TS!C41)","v":"اكرام النسب26"},{"$f":"IF(TS!G41=\"\",\"\",TS!G41)","v":"2012-07-04"},{"$f":"IF(TS!D41=\"\",\"\",TS!D41)","v":"أ"},{"$f":"IF(TS!F41=\"\",\"\",TS!F41)","v":1425},5.5,4,4.75,3,5,4,1,6,3.5,6.25,6.5,6.375,3.5,6,4.75,6.5,6,6.25,4.9375,null,null,null,7,8,7,7,7.25,6,3.5,4.75,6,7,6.5,6,5.25,5.625,3,4,3.5,8,7,7.5,4,4,4,1,8,4.5,4.875,7,7.5,7.25,1,{"$f":"6+BG35+TS!$P$3","v":7},41.1875,5.8839285714285712,18,"متوسط"]
[{"$f":"IF(TS!A42=\"\",\"\",TS!A42)","v":27},{"$f":"IF(TS!B42=\"\",\"\",TS!B42)","v":"AZ22334481"},{"$f":"IF(TS!C42=\"\",\"\",TS!C42)","v":"آية النسب27"},{"$f":"IF(TS!G42=\"\",\"\",TS!G42)","v":"2012-05-15"},{"$f":"IF(TS!D42=\"\",\"\",TS!D42)","v":"أ"},{"$f":"IF(TS!F42=\"\",\"\",TS!F42)","v":1426},5,6,5.5,3,7.5,5.25,3,2.5,2.75,5,6.5,5.75,4.5,6,5.25,5,6.5,5.75,5.041666666666667,null,null,null,7,8,5.5,6.5,6.75,7,3,5,7.5,7.5,7.5,6,7,6.5,5.5,6.5,6,7.5,7,7.25,4.5,5,4.75,8,7.5,7.75,6.4375,6.5,7,6.75,1,{"$f":"6+BG36+TS!$P$3","v":7},43.979166666666664,6.2827380952380949,16,"لوحة الشرف"]
[{"$f":"IF(TS!A43=\"\",\"\",TS!A43)","v":28},{"$f":"IF(TS!B43=\"\",\"\",TS!B43)","v":"AZ22334482"},{"$f":"IF(TS!C43=\"\",\"\",TS!C43)","v":"غفران النسب28"},{"$f":"IF(TS!G43=\"\",\"\",TS!G43)","v":"2012-10-16"},{"$f":"IF(TS!D43=\"\",\"\",TS!D43)","v":"أ"},{"$f":"IF(TS!F43=\"\",\"\",TS!F43)","v":1427},5.5,7,6.25,2,6.5,4.25,1,1,1,5.75,7.5,6.625,6,6.5,6.25,6,7.5,6.75,5.1875,null,null,null,9,6,8.5,7,7.625,5.5,6.25,5.875,6,8,7,6.5,5,5.75,7.5,7,7.25,8,6.5,7.25,4,5,4.5,6,1,3.5,5.625,7,7,7,1,{"$f":"6+BG37+TS!$P$3","v":7},44.0625,6.2946428571428568,15,"لوحة الشرف"]
[{"$f":"IF(TS!A44=\"\",\"\",TS!A44)","v":29},{"$f":"IF(TS!B44=\"\",\"\",TS!B44)","v":"AZ22334483"},{"$f":"IF(TS!C44=\"\",\"\",TS!C44)","v":"أميرة  النسب29"},{"$f":"IF(TS!G44=\"\",\"\",TS!G44)","v":"2012-08-11"},{"$f":"IF(TS!D44=\"\",\"\",TS!D44)","v":"أ"},{"$f":"IF(TS!F44=\"\",\"\",TS!F44)","v":1428},8,9,8.5,8.5,8.75,8.625,8.75,7.5,8.125,8.5,8,8.25,7.25,9,8.125,8.75,9,8.875,8.4166666666666661,null,null,null,7.5,9,8.5,9,8.5,9,7.5,8.25,8,8,8,8.5,6.25,7.375,9,7,8,8.5,8.5,8.5,5,7,6,8,9,8.5,7.75,8,8,8,1,{"$f":"6+BG38+TS!$P$3","v":7},56.291666666666664,8.0416666666666661,2,"تنويه"]
[{"$f":"IF(TS!A45=\"\",\"\",TS!A45)","v":""},{"$f":"IF(TS!B45=\"\",\"\",TS!B45)","v":""},{"$f":"IF(TS!C45=\"\",\"\",TS!C45)","v":""},{"$f":"IF(TS!G45=\"\",\"\",TS!G45)","v":""},{"$f":"IF(TS!D45=\"\",\"\",TS!D45)","v":""},{"$f":"IF(TS!F45=\"\",\"\",TS!F45)","v":""},null,null,"",null,null,"",null,null,"",null,null,"",null,null,"",null,null,"","",null,null,null,null,null,null,null,"",null,null,"",null,null,"",null,null,"",null,null,"",null,null,"",null,null,"",null,null,"","",null,null,"",null,null,null,"","",""]
[{"$f":"IF(TS!A46=\"\",\"\",TS!A46)","v":""},{"$f":"IF(TS!B46=\"\",\"\",TS!B46)","v":""},{"$f":"IF(TS!C46=\"\",\"\",TS!C46)","v":""},{"$f":"IF(TS!G46=\"\",\"\",TS!G46)","v":""},{"$f":"IF(TS!D46=\"\",\"\",TS!D46)","v":""},{"$f":"IF(TS!F46=\"\",\"\",TS!F46)","v":""},null,null,"",null,null,"",null,null,"",null,null,"",null,null,"",null,null,"","",null,null,null,null,null,null,null,"",null,null,"",null,null,"",null,null,"",null,null,"",null,null,"",null,null,"",null,null,"","",null,null,"",null,null,null,"","",""]
[{"$f":"IF(TS!A47=\"\",\"\",TS!A47)","v":""},{"$f":"IF(TS!B47=\"\",\"\",TS!B47)","v":""},{"$f":"IF(TS!C47=\"\",\"\",TS!C47)","v":""},{"$f":"IF(TS!G47=\"\",\"\",TS!G47)","v":""},{"$f":"IF(TS!D47=\"\",\"\",TS!D47)","v":""},{"$f":"IF(TS!F47=\"\",\"\",TS!F47)","v":""},null,null,"",null,null,"",null,null,"",null,null,"",null,null,"",null,null,"","",null,null,null,null,null,null,null,"",null,null,"",null,null,"",null,null,"",null,null,"",null,null,"",null,null,"",null,null,"","",null,null,"",null,null,null,"","",""]
[{"$f":"IF(TS!A48=\"\",\"\",TS!A48)","v":""},{"$f":"IF(TS!B48=\"\",\"\",TS!B48)","v":""},{"$f":"IF(TS!C48=\"\",\"\",TS!C48)","v":""},{"$f":"IF(TS!G48=\"\",\"\",TS!G48)","v":""},{"$f":"IF(TS!D48=\"\",\"\",TS!D48)","v":""},{"$f":"IF(TS!F48=\"\",\"\",TS!F48)","v":""},null,null,"",null,null,"",null,null,"",null,null,"",null,null,"",null,null,"","",null,null,null,null,null,null,null,"",null,null,"",null,null,"",null,null,"",null,null,"",null,null,"",null,null,"",null,null,"","",null,null,"",null,null,null,"","",""]
[{"$f":"IF(TS!A49=\"\",\"\",TS!A49)","v":""},{"$f":"IF(TS!B49=\"\",\"\",TS!B49)","v":""},{"$f":"IF(TS!C49=\"\",\"\",TS!C49)","v":""},{"$f":"IF(TS!G49=\"\",\"\",TS!G49)","v":""},{"$f":"IF(TS!D49=\"\",\"\",TS!D49)","v":""},{"$f":"IF(TS!F49=\"\",\"\",TS!F49)","v":""},null,null,"",null,null,"",null,null,"",null,null,"",null,null,"",null,null,"","",null,null,null,null,null,null,null,"",null,null,"",null,null,"",null,null,"",null,null,"",null,null,"",null,null,"",null,null,"","",null,null,"",null,null,null,"","",""]
[{"$f":"IF(TS!A50=\"\",\"\",TS!A50)","v":""},{"$f":"IF(TS!B50=\"\",\"\",TS!B50)","v":""},{"$f":"IF(TS!C50=\"\",\"\",TS!C50)","v":""},{"$f":"IF(TS!G50=\"\",\"\",TS!G50)","v":""},{"$f":"IF(TS!D50=\"\",\"\",TS!D50)","v":""},{"$f":"IF(TS!F50=\"\",\"\",TS!F50)","v":""},null,null,"",null,null,"",null,null,"",null,null,"",null,null,"",null,null,"","",null,null,null,null,null,null,null,"",null,null,"",null,null,"",null,null,"",null,null,"",null,null,"",null,null,"",null,null,"","",null,null,"",null,null,null,"","",""]
[{"$f":"IF(TS!A51=\"\",\"\",TS!A51)","v":""},{"$f":"IF(TS!B51=\"\",\"\",TS!B51)","v":""},{"$f":"IF(TS!C51=\"\",\"\",TS!C51)","v":""},{"$f":"IF(TS!G51=\"\",\"\",TS!G51)","v":""},{"$f":"IF(TS!D51=\"\",\"\",TS!D51)","v":""},{"$f":"IF(TS!F51=\"\",\"\",TS!F51)","v":""},null,null,"",null,null,"",null,null,"",null,null,"",null,null,"",null,null,"","",null,null,null,null,null,null,null,"",null,null,"",null,null,"",null,null,"",null,null,"",null,null,"",null,null,"",null,null,"","",null,null,"",null,null,null,"","",""]
[{"$f":"IF(TS!A52=\"\",\"\",TS!A52)","v":""},{"$f":"IF(TS!B52=\"\",\"\",TS!B52)","v":""},{"$f":"IF(TS!C52=\"\",\"\",TS!C52)","v":""},{"$f":"IF(TS!G52=\"\",\"\",TS!G52)","v":""},{"$f":"IF(TS!D52=\"\",\"\",TS!D52)","v":""},{"$f":"IF(TS!F52=\"\",\"\",TS!F52)","v":""},null,null,"",null,null,"",null,null,"",null,null,"",null,null,"",null,null,"","",null,null,null,null,null,null,null,"",null,null,"",null,null,"",null,null,"",null,null,"",null,null,"",null,null,"",null,null,"","",null,null,"",null,null,null,"","",""]
[{"$f":"IF(TS!A53=\"\",\"\",TS!A53)","v":""},{"$f":"IF(TS!B53=\"\",\"\",TS!B53)","v":""},{"$f":"IF(TS!C53=\"\",\"\",TS!C53)","v":""},{"$f":"IF(TS!G53=\"\",\"\",TS!G53)","v":""},{"$f":"IF(TS!D53=\"\",\"\",TS!D53)","v":""},{"$f":"IF(TS!F53=\"\",\"\",TS!F53)","v":""},null,null,"",null,null,"",null,null,"",null,null,"",null,null,"",null,null,"","",null,null,null,null,null,null,null,"",null,null,"",null,null,"",null,null,"",null,null,"",null,null,"",null,null,"",null,null,"","",null,null,"",null,null,null,"","",""]
[{"$f":"IF(TS!A54=\"\",\"\",TS!A54)","v":""},{"$f":"IF(TS!B54=\"\",\"\",TS!B54)","v":""},{"$f":"IF(TS!C54=\"\",\"\",TS!C54)","v":""},{"$f":"IF(TS!G54=\"\",\"\",TS!G54)","v":""},{"$f":"IF(TS!D54=\"\",\"\",TS!D54)","v":""},{"$f":"IF(TS!F54=\"\",\"\",TS!F54)","v":""},null,null,"",null,null,"",null,null,"",null,null,"",null,null,"",null,null,"","",null,null,null,null,null,null,null,"",null,null,"",null,null,"",null,null,"",null,null,"",null,null,"",null,null,"",null,null,"","",null,null,"",null,null,null,"","",""]
[{"$f":"IF(TS!A55=\"\",\"\",TS!A55)","v":""},{"$f":"IF(TS!B55=\"\",\"\",TS!B55)","v":""},{"$f":"IF(TS!C55=\"\",\"\",TS!C55)","v":""},{"$f":"IF(TS!G55=\"\",\"\",TS!G55)","v":""},{"$f":"IF(TS!D55=\"\",\"\",TS!D55)","v":""},{"$f":"IF(TS!F55=\"\",\"\",TS!F55)","v":""},null,null,"",null,null,"",null,null,"",null,null,"",null,null,"",null,null,"","",null,null,null,null,null,null,null,"",null,null,"",null,null,"",null,null,"",null,null,"",null,null,"",null,null,"",null,null,"","",null,null,"",null,null,null,"","",""]
[{"$f":"IF(TS!A56=\"\",\"\",TS!A56)","v":""},{"$f":"IF(TS!B56=\"\",\"\",TS!B56)","v":""},{"$f":"IF(TS!C56=\"\",\"\",TS!C56)","v":""},{"$f":"IF(TS!G56=\"\",\"\",TS!G56)","v":""},{"$f":"IF(TS!D56=\"\",\"\",TS!D56)","v":""},{"$f":"IF(TS!F56=\"\",\"\",TS!F56)","v":""},null,null,"",null,null,"",null,null,"",null,null,"",null,null,"",null,null,"","",null,null,null,null,null,null,null,"",null,null,"",null,null,"",null,null,"",null,null,"",null,null,"",null,null,"",null,null,"","",null,null,"",null,null,null,"","",""]
[{"$f":"IF(TS!A57=\"\",\"\",TS!A57)","v":""},{"$f":"IF(TS!B57=\"\",\"\",TS!B57)","v":""},{"$f":"IF(TS!C57=\"\",\"\",TS!C57)","v":""},{"$f":"IF(TS!G57=\"\",\"\",TS!G57)","v":""},{"$f":"IF(TS!D57=\"\",\"\",TS!D57)","v":""},{"$f":"IF(TS!F57=\"\",\"\",TS!F57)","v":""},null,null,"",null,null,"",null,null,"",null,null,"",null,null,"",null,null,"","",null,null,null,null,null,null,null,"",null,null,"",null,null,"",null,null,"",null,null,"",null,null,"",null,null,"",null,null,"","",null,null,"",null,null,null,"","",""]
[{"$f":"IF(TS!A58=\"\",\"\",TS!A58)","v":""},{"$f":"IF(TS!B58=\"\",\"\",TS!B58)","v":""},{"$f":"IF(TS!C58=\"\",\"\",TS!C58)","v":""},{"$f":"IF(TS!G58=\"\",\"\",TS!G58)","v":""},{"$f":"IF(TS!D58=\"\",\"\",TS!D58)","v":""},{"$f":"IF(TS!F58=\"\",\"\",TS!F58)","v":""},null,null,"",null,null,"",null,null,"",null,null,"",null,null,"",null,null,"","",null,null,null,null,null,null,null,"",null,null,"",null,null,"",null,null,"",null,null,"",null,null,"",null,null,"",null,null,"","",null,null,"",null,null,null,"","",""]
[{"$f":"IF(TS!A59=\"\",\"\",TS!A59)","v":""},{"$f":"IF(TS!B59=\"\",\"\",TS!B59)","v":""},{"$f":"IF(TS!C59=\"\",\"\",TS!C59)","v":""},{"$f":"IF(TS!G59=\"\",\"\",TS!G59)","v":""},{"$f":"IF(TS!D59=\"\",\"\",TS!D59)","v":""},{"$f":"IF(TS!F59=\"\",\"\",TS!F59)","v":""},null,null,"",null,null,"",null,null,"",null,null,"",null,null,"",null,null,"","",null,null,null,null,null,null,null,"",null,null,"",null,null,"",null,null,"",null,null,"",null,null,"",null,null,"",null,null,"","",null,null,"",null,null,null,"","",""]
[{"$f":"IF(TS!A60=\"\",\"\",TS!A60)","v":""},{"$f":"IF(TS!B60=\"\",\"\",TS!B60)","v":""},{"$f":"IF(TS!C60=\"\",\"\",TS!C60)","v":""},{"$f":"IF(TS!G60=\"\",\"\",TS!G60)","v":""},{"$f":"IF(TS!D60=\"\",\"\",TS!D60)","v":""},{"$f":"IF(TS!F60=\"\",\"\",TS!F60)","v":""},null,null,"",null,null,"",null,null,"",null,null,"",null,null,"",null,null,"","",null,null,null,null,null,null,null,"",null,null,"",null,null,"",null,null,"",null,null,"",null,null,"",null,null,"",null,null,"","",null,null,"",null,null,null,"","",""]
[{"$f":"IF(TS!A61=\"\",\"\",TS!A61)","v":""},{"$f":"IF(TS!B61=\"\",\"\",TS!B61)","v":""},{"$f":"IF(TS!C61=\"\",\"\",TS!C61)","v":""},{"$f":"IF(TS!G61=\"\",\"\",TS!G61)","v":""},{"$f":"IF(TS!D61=\"\",\"\",TS!D61)","v":""},{"$f":"IF(TS!F61=\"\",\"\",TS!F61)","v":""},null,null,"",null,null,"",null,null,"",null,null,"",null,null,"",null,null,"","",null,null,null,null,null,null,null,"",null,null,"",null,null,"",null,null,"",null,null,"",null,null,"",null,null,"",null,null,"","",null,null,"",null,null,null,"","",""]
[{"$f":"IF(TS!A62=\"\",\"\",TS!A62)","v":""},{"$f":"IF(TS!B62=\"\",\"\",TS!B62)","v":""},{"$f":"IF(TS!C62=\"\",\"\",TS!C62)","v":""},{"$f":"IF(TS!G62=\"\",\"\",TS!G62)","v":""},{"$f":"IF(TS!D62=\"\",\"\",TS!D62)","v":""},{"$f":"IF(TS!F62=\"\",\"\",TS!F62)","v":""},null,null,"",null,null,"",null,null,"",null,null,"",null,null,"",null,null,"","",null,null,null,null,null,null,null,"",null,null,"",null,null,"",null,null,"",null,null,"",null,null,"",null,null,"",null,null,"","",null,null,"",null,null,null,"","",""]
[{"$f":"IF(TS!A63=\"\",\"\",TS!A63)","v":""},{"$f":"IF(TS!B63=\"\",\"\",TS!B63)","v":""},{"$f":"IF(TS!C63=\"\",\"\",TS!C63)","v":""},{"$f":"IF(TS!G63=\"\",\"\",TS!G63)","v":""},{"$f":"IF(TS!D63=\"\",\"\",TS!D63)","v":""},{"$f":"IF(TS!F63=\"\",\"\",TS!F63)","v":""},null,null,"",null,null,"",null,null,"",null,null,"",null,null,"",null,null,"","",null,null,null,null,null,null,null,"",null,null,"",null,null,"",null,null,"",null,null,"",null,null,"",null,null,"",null,null,"","",null,null,"",null,null,null,"","",""]
[{"$f":"IF(TS!A64=\"\",\"\",TS!A64)","v":""},{"$f":"IF(TS!B64=\"\",\"\",TS!B64)","v":""},{"$f":"IF(TS!C64=\"\",\"\",TS!C64)","v":""},{"$f":"IF(TS!G64=\"\",\"\",TS!G64)","v":""},{"$f":"IF(TS!D64=\"\",\"\",TS!D64)","v":""},{"$f":"IF(TS!F64=\"\",\"\",TS!F64)","v":""},null,null,"",null,null,"",null,null,"",null,null,"",null,null,"",null,null,"","",null,null,null,null,null,null,null,"",null,null,"",null,null,"",null,null,"",null,null,"",null,null,"",null,null,"",null,null,"","",null,null,"",null,null,null,"","",""]
[{"$f":"IF(TS!A65=\"\",\"\",TS!A65)","v":""},{"$f":"IF(TS!B65=\"\",\"\",TS!B65)","v":""},{"$f":"IF(TS!C65=\"\",\"\",TS!C65)","v":""},{"$f":"IF(TS!G65=\"\",\"\",TS!G65)","v":""},{"$f":"IF(TS!D65=\"\",\"\",TS!D65)","v":""},{"$f":"IF(TS!F65=\"\",\"\",TS!F65)","v":""},null,null,"",null,null,"",null,null,"",null,null,"",null,null,"",null,null,"","",null,null,null,null,null,null,null,"",null,null,"",null,null,"",null,null,"",null,null,"",null,null,"",null,null,"",null,null,"","",null,null,"",null,null,null,"","",""]
[{"$f":"IF(TS!A66=\"\",\"\",TS!A66)","v":""},{"$f":"IF(TS!B66=\"\",\"\",TS!B66)","v":""},{"$f":"IF(TS!C66=\"\",\"\",TS!C66)","v":""},{"$f":"IF(TS!G66=\"\",\"\",TS!G66)","v":""},{"$f":"IF(TS!D66=\"\",\"\",TS!D66)","v":""},{"$f":"IF(TS!F66=\"\",\"\",TS!F66)","v":""},null,null,"",null,null,"",null,null,"",null,null,"",null,null,"",null,null,"","",null,null,null,null,null,null,null,"",null,null,"",null,null,"",null,null,"",null,null,"",null,null,"",null,null,"",null,null,"","",null,null,"",null,null,null,"","",""]
[{"$f":"IF(TS!A67=\"\",\"\",TS!A67)","v":""},{"$f":"IF(TS!B67=\"\",\"\",TS!B67)","v":""},{"$f":"IF(TS!C67=\"\",\"\",TS!C67)","v":""},{"$f":"IF(TS!G67=\"\",\"\",TS!G67)","v":""},{"$f":"IF(TS!D67=\"\",\"\",TS!D67)","v":""},{"$f":"IF(TS!F67=\"\",\"\",TS!F67)","v":""},null,null,"",null,null,"",null,null,"",null,null,"",null,null,"",null,null,"","",null,null,null,null,null,null,null,"",null,null,"",null,null,"",null,null,"",null,null,"",null,null,"",null,null,"",null,null,"","",null,null,"",null,null,null,"","",""]
[{"$f":"IF(TS!A68=\"\",\"\",TS!A68)","v":""},{"$f":"IF(TS!B68=\"\",\"\",TS!B68)","v":""},{"$f":"IF(TS!C68=\"\",\"\",TS!C68)","v":""},{"$f":"IF(TS!G68=\"\",\"\",TS!G68)","v":""},{"$f":"IF(TS!D68=\"\",\"\",TS!D68)","v":""},{"$f":"IF(TS!F68=\"\",\"\",TS!F68)","v":""},null,null,"",null,null,"",null,null,"",null,null,"",null,null,"",null,null,"","",null,null,null,null,null,null,null,"",null,null,"",null,null,"",null,null,"",null,null,"",null,null,"",null,null,"",null,null,"","",null,null,"",null,null,null,"","",""]
[{"$f":"IF(TS!A69=\"\",\"\",TS!A69)","v":""},{"$f":"IF(TS!B69=\"\",\"\",TS!B69)","v":""},{"$f":"IF(TS!C69=\"\",\"\",TS!C69)","v":""},{"$f":"IF(TS!G69=\"\",\"\",TS!G69)","v":""},{"$f":"IF(TS!D69=\"\",\"\",TS!D69)","v":""},{"$f":"IF(TS!F69=\"\",\"\",TS!F69)","v":""},null,null,"",null,null,"",null,null,"",null,null,"",null,null,"",null,null,"","",null,null,null,null,null,null,null,"",null,null,"",null,null,"",null,null,"",null,null,"",null,null,"",null,null,"",null,null,"","",null,null,"",null,null,null,"","",""]
[{"$f":"IF(TS!A70=\"\",\"\",TS!A70)","v":""},{"$f":"IF(TS!B70=\"\",\"\",TS!B70)","v":""},{"$f":"IF(TS!C70=\"\",\"\",TS!C70)","v":""},{"$f":"IF(TS!G70=\"\",\"\",TS!G70)","v":""},{"$f":"IF(TS!D70=\"\",\"\",TS!D70)","v":""},{"$f":"IF(TS!F70=\"\",\"\",TS!F70)","v":""},null,null,"",null,null,"",null,null,"",null,null,"",null,null,"",null,null,"","",null,null,null,null,null,null,null,"",null,null,"",null,null,"",null,null,"",null,null,"",null,null,"",null,null,"",null,null,"","",null,null,"",null,null,null,"","",""]
[{"$f":"IF(TS!A71=\"\",\"\",TS!A71)","v":""},{"$f":"IF(TS!B71=\"\",\"\",TS!B71)","v":""},{"$f":"IF(TS!C71=\"\",\"\",TS!C71)","v":""},{"$f":"IF(TS!G71=\"\",\"\",TS!G71)","v":""},{"$f":"IF(TS!D71=\"\",\"\",TS!D71)","v":""},{"$f":"IF(TS!F71=\"\",\"\",TS!F71)","v":""},null,null,"",null,null,"",null,null,"",null,null,"",null,null,"",null,null,"","",null,null,null,null,null,null,null,"",null,null,"",null,null,"",null,null,"",null,null,"",null,null,"",null,null,"",null,null,"","",null,null,"",null,null,null,"","",""]
[{"$f":"IF(TS!A72=\"\",\"\",TS!A72)","v":""},{"$f":"IF(TS!B72=\"\",\"\",TS!B72)","v":""},{"$f":"IF(TS!C72=\"\",\"\",TS!C72)","v":""},{"$f":"IF(TS!G72=\"\",\"\",TS!G72)","v":""},{"$f":"IF(TS!D72=\"\",\"\",TS!D72)","v":""},{"$f":"IF(TS!F72=\"\",\"\",TS!F72)","v":""},null,null,"",null,null,"",null,null,"",null,null,"",null,null,"",null,null,"","",null,null,null,null,null,null,null,"",null,null,"",null,null,"",null,null,"",null,null,"",null,null,"",null,null,"",null,null,"","",null,null,"",null,null,null,"","",""]
[{"$f":"IF(TS!A73=\"\",\"\",TS!A73)","v":""},{"$f":"IF(TS!B73=\"\",\"\",TS!B73)","v":""},{"$f":"IF(TS!C73=\"\",\"\",TS!C73)","v":""},{"$f":"IF(TS!G73=\"\",\"\",TS!G73)","v":""},{"$f":"IF(TS!D73=\"\",\"\",TS!D73)","v":""},{"$f":"IF(TS!F73=\"\",\"\",TS!F73)","v":""},null,null,"",null,null,"",null,null,"",null,null,"",null,null,"",null,null,"","",null,null,null,null,null,null,null,"",null,null,"",null,null,"",null,null,"",null,null,"",null,null,"",null,null,"",null,null,"","",null,null,"",null,null,null,"","",""]
[{"$f":"IF(TS!A74=\"\",\"\",TS!A74)","v":""},{"$f":"IF(TS!B74=\"\",\"\",TS!B74)","v":""},{"$f":"IF(TS!C74=\"\",\"\",TS!C74)","v":""},{"$f":"IF(TS!G74=\"\",\"\",TS!G74)","v":""},{"$f":"IF(TS!D74=\"\",\"\",TS!D74)","v":""},{"$f":"IF(TS!F74=\"\",\"\",TS!F74)","v":""},null,null,"",null,null,"",null,null,"",null,null,"",null,null,"",null,null,"","",null,null,null,null,null,null,null,"",null,null,"",null,null,"",null,null,"",null,null,"",null,null,"",null,null,"",null,null,"","",null,null,"",null,null,null,"","",""]
[{"$f":"IF(TS!A75=\"\",\"\",TS!A75)","v":""},{"$f":"IF(TS!B75=\"\",\"\",TS!B75)","v":""},{"$f":"IF(TS!C75=\"\",\"\",TS!C75)","v":""},{"$f":"IF(TS!G75=\"\",\"\",TS!G75)","v":""},{"$f":"IF(TS!D75=\"\",\"\",TS!D75)","v":""},{"$f":"IF(TS!F75=\"\",\"\",TS!F75)","v":""},null,null,"",null,null,"",null,null,"",null,null,"",null,null,"",null,null,"","",null,null,null,null,null,null,null,"",null,null,"",null,null,"",null,null,"",null,null,"",null,null,"",null,null,"",null,null,"","",null,null,"",null,null,null,"","",""]
[{"$f":"IF(TS!A76=\"\",\"\",TS!A76)","v":""},{"$f":"IF(TS!B76=\"\",\"\",TS!B76)","v":""},{"$f":"IF(TS!C76=\"\",\"\",TS!C76)","v":""},{"$f":"IF(TS!G76=\"\",\"\",TS!G76)","v":""},{"$f":"IF(TS!D76=\"\",\"\",TS!D76)","v":""},{"$f":"IF(TS!F76=\"\",\"\",TS!F76)","v":""},null,null,"",null,null,"",null,null,"",null,null,"",null,null,"",null,null,"","",null,null,null,null,null,null,null,"",null,null,"",null,null,"",null,null,"",null,null,"",null,null,"",null,null,"",null,null,"","",null,null,"",null,null,null,"","",""]
[{"$f":"IF(TS!A77=\"\",\"\",TS!A77)","v":""},{"$f":"IF(TS!B77=\"\",\"\",TS!B77)","v":""},{"$f":"IF(TS!C77=\"\",\"\",TS!C77)","v":""},{"$f":"IF(TS!G77=\"\",\"\",TS!G77)","v":""},{"$f":"IF(TS!D77=\"\",\"\",TS!D77)","v":""},{"$f":"IF(TS!F77=\"\",\"\",TS!F77)","v":""},null,null,"",null,null,"",null,null,"",null,null,"",null,null,"",null,null,"","",null,null,null,null,null,null,null,"",null,null,"",null,null,"",null,null,"",null,null,"",null,null,"",null,null,"",null,null,"","",null,null,"",null,null,null,"","",""]
[{"$f":"IF(TS!A78=\"\",\"\",TS!A78)","v":""},{"$f":"IF(TS!B78=\"\",\"\",TS!B78)","v":""},{"$f":"IF(TS!C78=\"\",\"\",TS!C78)","v":""},{"$f":"IF(TS!G78=\"\",\"\",TS!G78)","v":""},{"$f":"IF(TS!D78=\"\",\"\",TS!D78)","v":""},{"$f":"IF(TS!F78=\"\",\"\",TS!F78)","v":""},null,null,"",null,null,"",null,null,"",null,null,"",null,null,"",null,null,"","",null,null,null,null,null,null,null,"",null,null,"",null,null,"",null,null,"",null,null,"",null,null,"",null,null,"",null,null,"","",null,null,"",null,null,null,"","",""]
[{"$f":"IF(TS!A79=\"\",\"\",TS!A79)","v":""},{"$f":"IF(TS!B79=\"\",\"\",TS!B79)","v":""},{"$f":"IF(TS!C79=\"\",\"\",TS!C79)","v":""},{"$f":"IF(TS!G79=\"\",\"\",TS!G79)","v":""},{"$f":"IF(TS!D79=\"\",\"\",TS!D79)","v":""},{"$f":"IF(TS!F79=\"\",\"\",TS!F79)","v":""},null,null,"",null,null,"",null,null,"",null,null,"",null,null,"",null,null,"","",null,null,null,null,null,null,null,"",null,null,"",null,null,"",null,null,"",null,null,"",null,null,"",null,null,"",null,null,"","",null,null,"",null,null,null,"","",""]
[{"$f":"IF(TS!A80=\"\",\"\",TS!A80)","v":""},{"$f":"IF(TS!B80=\"\",\"\",TS!B80)","v":""},{"$f":"IF(TS!C80=\"\",\"\",TS!C80)","v":""},{"$f":"IF(TS!G80=\"\",\"\",TS!G80)","v":""},{"$f":"IF(TS!D80=\"\",\"\",TS!D80)","v":""},{"$f":"IF(TS!F80=\"\",\"\",TS!F80)","v":""},null,null,"",null,null,"",null,null,"",null,null,"",null,null,"",null,null,"","",null,null,null,null,null,null,null,"",null,null,"",null,null,"",null,null,"",null,null,"",null,null,"",null,null,"",null,null,"","",null,null,"",null,null,null,"","",{"$f":"IF(BJ74=\"\",\"\",IF(BJ74>=8,\"تنويه\",IF(BJ74>=7,\"تشجيع\",IF(BJ74>=6,\"لوحة الشرف\",IF(BJ74>=5,\"متوسط\",IF(BJ74>=3,\"تنبيه\",\"توبيخ\"))))))","v":""}]
[{"$f":"IF(TS!A81=\"\",\"\",TS!A81)","v":""},{"$f":"IF(TS!B81=\"\",\"\",TS!B81)","v":""},{"$f":"IF(TS!C81=\"\",\"\",TS!C81)","v":""},{"$f":"IF(TS!G81=\"\",\"\",TS!G81)","v":""},{"$f":"IF(TS!D81=\"\",\"\",TS!D81)","v":""},{"$f":"IF(TS!F81=\"\",\"\",TS!F81)","v":""},null,null,{"$f":"IF(OR(G75=\"\",H75=\"\"),\"\",AVERAGE(G75:H75))","v":""},null,null,{"$f":"IF(OR(J75=\"\",K75=\"\"),\"\",AVERAGE(J75:K75))","v":""},null,null,{"$f":"IF(OR(M75=\"\",N75=\"\"),\"\",AVERAGE(M75:N75))","v":""},null,null,{"$f":"IF(OR(P75=\"\",Q75=\"\"),\"\",AVERAGE(P75:Q75))","v":""},null,null,{"$f":"IF(OR(S75=\"\",T75=\"\"),\"\",AVERAGE(S75:T75))","v":""},null,null,{"$f":"IF(OR(V75=\"\",W75=\"\"),\"\",AVERAGE(V75:W75))","v":""},{"$f":"IF(OR(I75=\"\",L75=\"\",O75=\"\",R75=\"\",U75=\"\",X75=\"\"),\"\",AVERAGE(I75,L75,O75,R75,U75,X75))","v":""},null,null,null,null,null,null,null,{"$f":"IF(OR(AC75=\"\",AD75=\"\",AE75=\"\",AF75=\"\"),\"\",AVERAGE(AC75:AF75))","v":""},null,null,{"$f":"IF(OR(AH75=\"\",AI75=\"\"),\"\",AVERAGE(AH75:AI75))","v":""},null,null,{"$f":"IF(OR(AK75=\"\",AL75=\"\"),\"\",AVERAGE(AK75:AL75))","v":""},null,null,{"$f":"IF(OR(AN75=\"\",AO75=\"\"),\"\",AVERAGE(AN75:AO75))","v":""},null,null,{"$f":"IF(OR(AQ75=\"\",AR75=\"\"),\"\",AVERAGE(AQ75:AR75))","v":""},null,null,{"$f":"IF(OR(AT75=\"\",AU75=\"\"),\"\",AVERAGE(AT75:AU75))","v":""},null,null,{"$f":"IF(OR(AW75=\"\",AX75=\"\"),\"\",AVERAGE(AW75:AX75))","v":""},null,null,{"$f":"IF(OR(AZ75=\"\",BA75=\"\"),\"\",AVERAGE(AZ75:BA75))","v":""},{"$f":"IF(OR(AS75=\"\",AV75=\"\",AY75=\"\",BB75=\"\"),\"\",AVERAGE(AS75,AV75,AY75,BB75))","v":""},null,null,{"$f":"IF(OR(BD75=\"\",BE75=\"\"),\"\",AVERAGE(BD75:BE75))","v":""},null,null,null,{"$f":"IF(B75=\"\",\"\",BI75/BH75)","v":""},{"$f":"IF(BJ75=\"\",\"\",RANK(BJ75,$BJ$10:$BJ$69))","v":""},""]
[{"$f":"IF(TS!A82=\"\",\"\",TS!A82)","v":""},{"$f":"IF(TS!B82=\"\",\"\",TS!B82)","v":""},{"$f":"IF(TS!C82=\"\",\"\",TS!C82)","v":""},{"$f":"IF(TS!G82=\"\",\"\",TS!G82)","v":""},{"$f":"IF(TS!D82=\"\",\"\",TS!D82)","v":""},{"$f":"IF(TS!F82=\"\",\"\",TS!F82)","v":""},null,null,"",null,null,"",null,null,"",null,null,"",null,null,"",null,null,"","",null,null,null,null,null,null,null,"",null,null,"",null,null,"",null,null,"",null,null,"",null,null,"",null,null,"",null,null,"","",null,null,"",null,null,null,"","",""]
[{"$f":"IF(TS!A83=\"\",\"\",TS!A83)","v":""},{"$f":"IF(TS!B83=\"\",\"\",TS!B83)","v":""},{"$f":"IF(TS!C83=\"\",\"\",TS!C83)","v":""},{"$f":"IF(TS!G83=\"\",\"\",TS!G83)","v":""},{"$f":"IF(TS!D83=\"\",\"\",TS!D83)","v":""},{"$f":"IF(TS!F83=\"\",\"\",TS!F83)","v":""},null,null,"",null,null,"",null,null,"",null,null,"",null,null,"",null,null,"","",null,null,null,null,null,null,null,"",null,null,"",null,null,"",null,null,"",null,null,"",null,null,"",null,null,"",null,null,"","",null,null,"",null,null,null,"","",""]
[{"$f":"IF(TS!A84=\"\",\"\",TS!A84)","v":""},{"$f":"IF(TS!B84=\"\",\"\",TS!B84)","v":""},{"$f":"IF(TS!C84=\"\",\"\",TS!C84)","v":""},{"$f":"IF(TS!G84=\"\",\"\",TS!G84)","v":""},{"$f":"IF(TS!D84=\"\",\"\",TS!D84)","v":""},{"$f":"IF(TS!F84=\"\",\"\",TS!F84)","v":""},null,null,"",null,null,"",null,null,"",null,null,"",null,null,"",null,null,"","",null,null,null,null,null,null,null,"",null,null,"",null,null,"",null,null,"",null,null,"",null,null,"",null,null,"",null,null,"","",null,null,"",null,null,null,"","",""]
[{"$f":"IF(TS!A85=\"\",\"\",TS!A85)","v":""},{"$f":"IF(TS!B85=\"\",\"\",TS!B85)","v":""},{"$f":"IF(TS!C85=\"\",\"\",TS!C85)","v":""},{"$f":"IF(TS!G85=\"\",\"\",TS!G85)","v":""},{"$f":"IF(TS!D85=\"\",\"\",TS!D85)","v":""},{"$f":"IF(TS!F85=\"\",\"\",TS!F85)","v":""},null,null,"",null,null,"",null,null,"",null,null,"",null,null,"",null,null,"","",null,null,null,null,null,null,null,"",null,null,"",null,null,"",null,null,"",null,null,"",null,null,"",null,null,"",null,null,"","",null,null,"",null,null,null,"","",""]
[{"$f":"IF(TS!A86=\"\",\"\",TS!A86)","v":""},{"$f":"IF(TS!B86=\"\",\"\",TS!B86)","v":""},{"$f":"IF(TS!C86=\"\",\"\",TS!C86)","v":""},{"$f":"IF(TS!G86=\"\",\"\",TS!G86)","v":""},{"$f":"IF(TS!D86=\"\",\"\",TS!D86)","v":""},{"$f":"IF(TS!F86=\"\",\"\",TS!F86)","v":""},null,null,"",null,null,"",null,null,"",null,null,"",null,null,"",null,null,"","",null,null,null,null,null,null,null,"",null,null,"",null,null,"",null,null,"",null,null,"",null,null,"",null,null,"",null,null,"","",null,null,"",null,null,null,"","",""]
[{"$f":"IF(TS!A87=\"\",\"\",TS!A87)","v":""},{"$f":"IF(TS!B87=\"\",\"\",TS!B87)","v":""},{"$f":"IF(TS!C87=\"\",\"\",TS!C87)","v":""},{"$f":"IF(TS!G87=\"\",\"\",TS!G87)","v":""},{"$f":"IF(TS!D87=\"\",\"\",TS!D87)","v":""},{"$f":"IF(TS!F87=\"\",\"\",TS!F87)","v":""},null,null,"",null,null,"",null,null,"",null,null,"",null,null,"",null,null,"","",null,null,null,null,null,null,null,"",null,null,"",null,null,"",null,null,"",null,null,"",null,null,"",null,null,"",null,null,"","",null,null,"",null,null,null,"","",""]
[{"$f":"IF(TS!A88=\"\",\"\",TS!A88)","v":""},{"$f":"IF(TS!B88=\"\",\"\",TS!B88)","v":""},{"$f":"IF(TS!C88=\"\",\"\",TS!C88)","v":""},{"$f":"IF(TS!G88=\"\",\"\",TS!G88)","v":""},{"$f":"IF(TS!D88=\"\",\"\",TS!D88)","v":""},{"$f":"IF(TS!F88=\"\",\"\",TS!F88)","v":""},null,null,"",null,null,"",null,null,"",null,null,"",null,null,"",null,null,"","",null,null,null,null,null,null,null,"",null,null,"",null,null,"",null,null,"",null,null,"",null,null,"",null,null,"",null,null,"","",null,null,"",null,null,null,"","",""]
[{"$f":"IF(TS!A89=\"\",\"\",TS!A89)","v":""},{"$f":"IF(TS!B89=\"\",\"\",TS!B89)","v":""},{"$f":"IF(TS!C89=\"\",\"\",TS!C89)","v":""},{"$f":"IF(TS!G89=\"\",\"\",TS!G89)","v":""},{"$f":"IF(TS!D89=\"\",\"\",TS!D89)","v":""},{"$f":"IF(TS!F89=\"\",\"\",TS!F89)","v":""},null,null,"",null,null,"",null,null,"",null,null,"",null,null,"",null,null,"","",null,null,null,null,null,null,null,"",null,null,"",null,null,"",null,null,"",null,null,"",null,null,"",null,null,"",null,null,"","",null,null,"",null,null,null,"","",""]
[{"$f":"IF(TS!A90=\"\",\"\",TS!A90)","v":""},{"$f":"IF(TS!B90=\"\",\"\",TS!B90)","v":""},{"$f":"IF(TS!C90=\"\",\"\",TS!C90)","v":""},{"$f":"IF(TS!G90=\"\",\"\",TS!G90)","v":""},{"$f":"IF(TS!D90=\"\",\"\",TS!D90)","v":""},{"$f":"IF(TS!F90=\"\",\"\",TS!F90)","v":""},null,null,"",null,null,"",null,null,"",null,null,"",null,null,"",null,null,"","",null,null,null,null,null,null,null,"",null,null,"",null,null,"",null,null,"",null,null,"",null,null,"",null,null,"",null,null,"","",null,null,"",null,null,null,"","",""]
[{"$f":"IF(TS!A91=\"\",\"\",TS!A91)","v":""},{"$f":"IF(TS!B91=\"\",\"\",TS!B91)","v":""},{"$f":"IF(TS!C91=\"\",\"\",TS!C91)","v":""},{"$f":"IF(TS!G91=\"\",\"\",TS!G91)","v":""},{"$f":"IF(TS!D91=\"\",\"\",TS!D91)","v":""},{"$f":"IF(TS!F91=\"\",\"\",TS!F91)","v":""},null,null,"",null,null,"",null,null,"",null,null,"",null,null,"",null,null,"","",null,null,null,null,null,null,null,"",null,null,"",null,null,"",null,null,"",null,null,"",null,null,"",null,null,"",null,null,"","",null,null,"",null,null,null,"","",""]
[{"$f":"IF(TS!A92=\"\",\"\",TS!A92)","v":""},{"$f":"IF(TS!B92=\"\",\"\",TS!B92)","v":""},{"$f":"IF(TS!C92=\"\",\"\",TS!C92)","v":""},{"$f":"IF(TS!G92=\"\",\"\",TS!G92)","v":""},{"$f":"IF(TS!D92=\"\",\"\",TS!D92)","v":""},{"$f":"IF(TS!F92=\"\",\"\",TS!F92)","v":""},null,null,"",null,null,"",null,null,"",null,null,"",null,null,"",null,null,"","",null,null,null,null,null,null,null,"",null,null,"",null,null,"",null,null,"",null,null,"",null,null,"",null,null,"",null,null,"","",null,null,"",null,null,null,"","",""]
[{"$f":"IF(TS!A93=\"\",\"\",TS!A93)","v":""},{"$f":"IF(TS!B93=\"\",\"\",TS!B93)","v":""},{"$f":"IF(TS!C93=\"\",\"\",TS!C93)","v":""},{"$f":"IF(TS!G93=\"\",\"\",TS!G93)","v":""},{"$f":"IF(TS!D93=\"\",\"\",TS!D93)","v":""},{"$f":"IF(TS!F93=\"\",\"\",TS!F93)","v":""},null,null,"",null,null,"",null,null,"",null,null,"",null,null,"",null,null,"","",null,null,null,null,null,null,null,"",null,null,"",null,null,"",null,null,"",null,null,"",null,null,"",null,null,"",null,null,"","",null,null,"",null,null,null,"","",""]
[{"$f":"IF(TS!A94=\"\",\"\",TS!A94)","v":""},{"$f":"IF(TS!B94=\"\",\"\",TS!B94)","v":""},{"$f":"IF(TS!C94=\"\",\"\",TS!C94)","v":""},{"$f":"IF(TS!G94=\"\",\"\",TS!G94)","v":""},{"$f":"IF(TS!D94=\"\",\"\",TS!D94)","v":""},{"$f":"IF(TS!F94=\"\",\"\",TS!F94)","v":""},null,null,"",null,null,"",null,null,"",null,null,"",null,null,"",null,null,"","",null,null,null,null,null,null,null,"",null,null,"",null,null,"",null,null,"",null,null,"",null,null,"",null,null,"",null,null,"","",null,null,"",null,null,null,"","",""]
[{"$f":"IF(TS!A95=\"\",\"\",TS!A95)","v":""},{"$f":"IF(TS!B95=\"\",\"\",TS!B95)","v":""},{"$f":"IF(TS!C95=\"\",\"\",TS!C95)","v":""},{"$f":"IF(TS!G95=\"\",\"\",TS!G95)","v":""},{"$f":"IF(TS!D95=\"\",\"\",TS!D95)","v":""},{"$f":"IF(TS!F95=\"\",\"\",TS!F95)","v":""},null,null,"",null,null,"",null,null,"",null,null,"",null,null,"",null,null,"","",null,null,null,null,null,null,null,"",null,null,"",null,null,"",null,null,"",null,null,"",null,null,"",null,null,"",null,null,"","",null,null,"",null,null,null,"","",""]
[{"$f":"IF(TS!A96=\"\",\"\",TS!A96)","v":""},{"$f":"IF(TS!B96=\"\",\"\",TS!B96)","v":""},{"$f":"IF(TS!C96=\"\",\"\",TS!C96)","v":""},{"$f":"IF(TS!G96=\"\",\"\",TS!G96)","v":""},{"$f":"IF(TS!D96=\"\",\"\",TS!D96)","v":""},{"$f":"IF(TS!F96=\"\",\"\",TS!F96)","v":""},null,null,"",null,null,"",null,null,"",null,null,"",null,null,"",null,null,"","",null,null,null,null,null,null,null,"",null,null,"",null,null,"",null,null,"",null,null,"",null,null,"",null,null,"",null,null,"","",null,null,"",null,null,null,"","",""]
[{"$f":"IF(TS!A97=\"\",\"\",TS!A97)","v":""},{"$f":"IF(TS!B97=\"\",\"\",TS!B97)","v":""},{"$f":"IF(TS!C97=\"\",\"\",TS!C97)","v":""},{"$f":"IF(TS!G97=\"\",\"\",TS!G97)","v":""},{"$f":"IF(TS!D97=\"\",\"\",TS!D97)","v":""},{"$f":"IF(TS!F97=\"\",\"\",TS!F97)","v":""},null,null,"",null,null,"",null,null,"",null,null,"",null,null,"",null,null,"","",null,null,null,null,null,null,null,"",null,null,"",null,null,"",null,null,"",null,null,"",null,null,"",null,null,"",null,null,"","",null,null,"",null,null,null,"","",""]
[{"$f":"IF(TS!A98=\"\",\"\",TS!A98)","v":""},{"$f":"IF(TS!B98=\"\",\"\",TS!B98)","v":""},{"$f":"IF(TS!C98=\"\",\"\",TS!C98)","v":""},{"$f":"IF(TS!G98=\"\",\"\",TS!G98)","v":""},{"$f":"IF(TS!D98=\"\",\"\",TS!D98)","v":""},{"$f":"IF(TS!F98=\"\",\"\",TS!F98)","v":""},null,null,"",null,null,"",null,null,"",null,null,"",null,null,"",null,null,"","",null,null,null,null,null,null,null,"",null,null,"",null,null,"",null,null,"",null,null,"",null,null,"",null,null,"",null,null,"","",null,null,"",null,null,null,"","",""]
[{"$f":"IF(TS!A99=\"\",\"\",TS!A99)","v":""},{"$f":"IF(TS!B99=\"\",\"\",TS!B99)","v":""},{"$f":"IF(TS!C99=\"\",\"\",TS!C99)","v":""},{"$f":"IF(TS!G99=\"\",\"\",TS!G99)","v":""},{"$f":"IF(TS!D99=\"\",\"\",TS!D99)","v":""},{"$f":"IF(TS!F99=\"\",\"\",TS!F99)","v":""},null,null,"",null,null,"",null,null,"",null,null,"",null,null,"",null,null,"","",null,null,null,null,null,null,null,"",null,null,"",null,null,"",null,null,"",null,null,"",null,null,"",null,null,"",null,null,"","",null,null,"",null,null,null,"","",""]
[{"$f":"IF(TS!A100=\"\",\"\",TS!A100)","v":""},{"$f":"IF(TS!B100=\"\",\"\",TS!B100)","v":""},{"$f":"IF(TS!C100=\"\",\"\",TS!C100)","v":""},{"$f":"IF(TS!G100=\"\",\"\",TS!G100)","v":""},{"$f":"IF(TS!D100=\"\",\"\",TS!D100)","v":""},{"$f":"IF(TS!F100=\"\",\"\",TS!F100)","v":""},null,null,"",null,null,"",null,null,"",null,null,"",null,null,"",null,null,"","",null,null,null,null,null,null,null,"",null,null,"",null,null,"",null,null,"",null,null,"",null,null,"",null,null,"",null,null,"","",null,null,"",null,null,null,"","",""]
[{"$f":"IF(TS!A101=\"\",\"\",TS!A101)","v":""},{"$f":"IF(TS!B101=\"\",\"\",TS!B101)","v":""},{"$f":"IF(TS!C101=\"\",\"\",TS!C101)","v":""},{"$f":"IF(TS!G101=\"\",\"\",TS!G101)","v":""},{"$f":"IF(TS!D101=\"\",\"\",TS!D101)","v":""},{"$f":"IF(TS!F101=\"\",\"\",TS!F101)","v":""},null,null,"",null,null,"",null,null,"",null,null,"",null,null,"",null,null,"","",null,null,null,null,null,null,null,"",null,null,null,null,null,"",null,null,"",null,null,"",null,null,"",null,null,"",null,null,"","",null,null,"",null,null,null,"","",""]
[{"$f":"IF(TS!A102=\"\",\"\",TS!A102)","v":""},{"$f":"IF(TS!B102=\"\",\"\",TS!B102)","v":""},{"$f":"IF(TS!C102=\"\",\"\",TS!C102)","v":""},{"$f":"IF(TS!G102=\"\",\"\",TS!G102)","v":""},{"$f":"IF(TS!D102=\"\",\"\",TS!D102)","v":""},{"$f":"IF(TS!F102=\"\",\"\",TS!F102)","v":""},null,null,"",null,null,"",null,null,"",null,null,"",null,null,"",null,null,"","",null,null,null,null,null,null,null,"",null,null,null,null,null,"",null,null,"",null,null,"",null,null,"",null,null,"",null,null,"","",null,null,"",null,null,null,"","",""]
[{"$f":"IF(TS!A103=\"\",\"\",TS!A103)","v":""},{"$f":"IF(TS!B103=\"\",\"\",TS!B103)","v":""},{"$f":"IF(TS!C103=\"\",\"\",TS!C103)","v":""},{"$f":"IF(TS!G103=\"\",\"\",TS!G103)","v":""},{"$f":"IF(TS!D103=\"\",\"\",TS!D103)","v":""},{"$f":"IF(TS!F103=\"\",\"\",TS!F103)","v":""},null,null,"",null,null,"",null,null,"",null,null,"",null,null,"",null,null,"","",null,null,null,null,null,null,null,"",null,null,null,null,null,"",null,null,"",null,null,"",null,null,"",null,null,"",null,null,"","",null,null,"",null,null,null,"","",""]
[{"$f":"IF(TS!A104=\"\",\"\",TS!A104)","v":""},{"$f":"IF(TS!B104=\"\",\"\",TS!B104)","v":""},{"$f":"IF(TS!C104=\"\",\"\",TS!C104)","v":""},{"$f":"IF(TS!G104=\"\",\"\",TS!G104)","v":""},{"$f":"IF(TS!D104=\"\",\"\",TS!D104)","v":""},{"$f":"IF(TS!F104=\"\",\"\",TS!F104)","v":""},null,null,"",null,null,"",null,null,"",null,null,"",null,null,"",null,null,"","",null,null,null,null,null,null,null,"",null,null,null,null,null,"",null,null,"",null,null,"",null,null,"",null,null,"",null,null,"","",null,null,"",null,null,null,"","",""]
[{"$f":"IF(TS!A105=\"\",\"\",TS!A105)","v":""},{"$f":"IF(TS!B105=\"\",\"\",TS!B105)","v":""},{"$f":"IF(TS!C105=\"\",\"\",TS!C105)","v":""},{"$f":"IF(TS!G105=\"\",\"\",TS!G105)","v":""},{"$f":"IF(TS!D105=\"\",\"\",TS!D105)","v":""},{"$f":"IF(TS!F105=\"\",\"\",TS!F105)","v":""},null,null,"",null,null,"",null,null,"",null,null,"",null,null,"",null,null,"","",null,null,null,null,null,null,null,"",null,null,null,null,null,"",null,null,"",null,null,"",null,null,"",null,null,"",null,null,"","",null,null,"",null,null,null,"","",""]
[{"$f":"IF(TS!A106=\"\",\"\",TS!A106)","v":""},{"$f":"IF(TS!B106=\"\",\"\",TS!B106)","v":""},{"$f":"IF(TS!C106=\"\",\"\",TS!C106)","v":""},{"$f":"IF(TS!G106=\"\",\"\",TS!G106)","v":""},{"$f":"IF(TS!D106=\"\",\"\",TS!D106)","v":""},{"$f":"IF(TS!F106=\"\",\"\",TS!F106)","v":""},null,null,"",null,null,"",null,null,"",null,null,"",null,null,"",null,null,"","",null,null,null,null,null,null,null,"",null,null,null,null,null,"",null,null,"",null,null,"",null,null,"",null,null,"",null,null,"","",null,null,"",null,null,null,"","",""]
[null,null,{"$f":"IF(TS!C107=\"\",\"\",TS!C107)","v":""},null,null,null,null,null,null,null,null,null,null,null,null,null,null,null,null,null,null,null,null,null,"",null,null,null,null,null,null,null,null,null,null,null,null,null,null,null,null,null,null,null,null,null,null,"",null,null,""]

{"sheet":"B1","index":3,"n_rows":49,"n_cols":14,"rows_kept":49,"cut":false,"hidden":false,"merged":[[2,0,2,5],[2,10,2,12],[2,13,2,14],[3,0,3,5],[3,10,3,12],[3,13,3,14],[0,10,0,12],[0,13,0,14],[1,10,1,12],[1,13,1,14],[0,0,1,5],[6,10,6,12],[6,13,6,14],[8,1,9,13],[11,2,11,7],[11,8,11,12],[12,2,12,7],[12,8,12,12],[4,0,4,5],[4,10,4,12],[4,13,4,14],[5,0,5,5],[5,10,5,12],[5,13,5,14],[18,12,24,14],[19,3,19,5],[19,6,19,7],[19,8,19,9],[20,3,20,5],[20,6,20,7],[14,1,14,13],[16,0,17,2],[16,3,17,5],[16,6,16,11],[16,12,17,14],[17,6,17,7],[17,8,17,9],[23,3,23,5],[23,6,23,7],[23,8,23,9],[24,3,24,5],[20,8,20,9],[21,3,21,5],[21,6,21,7],[21,8,21,9],[22,3,22,5],[22,6,22,7],[22,8,22,9],[18,0,24,2],[18,3,18,5],[18,6,18,7],[18,8,18,9],[29,0,31,2],[29,3,29,5],[29,6,29,9],[30,3,30,5],[30,6,30,9],[31,3,31,5],[32,0,32,2],[32,3,32,5],[32,6,32,7],[32,8,32,9],[32,11,33,11],[32,12,33,14],[33,0,33,2],[33,3,33,5],[25,11,26,11],[25,12,26,14],[26,0,26,2],[26,3,26,5],[27,0,28,2],[27,3,27,5],[27,6,27,9],[27,12,31,14],[28,3,28,5],[28,6,28,9],[25,0,25,2],[25,3,25,5],[25,6,25,7],[25,8,25,9],[43,8,43,9],[34,0,34,2],[34,3,34,5],[34,6,34,7],[34,8,34,9],[34,11,35,11],[34,12,35,14],[35,0,35,2],[35,3,35,5],[36,0,37,2],[36,3,36,5],[36,6,36,7],[36,8,36,9],[36,11,37,11],[36,12,37,14],[37,3,37,5],[40,8,40,9],[41,3,41,5],[41,6,41,7],[41,8,41,9],[38,0,42,2],[38,3,38,5],[38,6,38,7],[38,8,38,9],[47,0,47,3],[47,4,47,5],[47,7,48,9],[38,12,42,14],[39,3,39,5],[39,6,39,7],[39,8,39,9],[40,3,40,5],[40,6,40,7],[42,3,42,5],[47,11,48,14],[48,0,48,3],[48,4,48,5],[43,11,44,11],[43,12,44,14],[44,0,44,2],[44,3,44,5],[46,0,46,3],[46,4,46,5],[46,7,46,9],[46,11,46,14],[43,0,43,2],[43,3,43,5],[43,6,43,7]]}
[null,null,null,null,null,null,null,null,null,null,"الموسم الدراسي",null,null,{"$f":"IF(TS!$M$1=\"\",\"\",TS!$M$1)","v":"2020-2019"}]
[null,null,null,null,null,null,null,null,null,null,"الاسم و النسب",null,null,{"$f":"IF(N7=\"\",\"\",VLOOKUP(N5,base1,3,0))","v":"ياسين النسب1"}]
[{"$f":"IF(TS!$A$5=\"\",\"\",TS!$A$5)","v":"الأكاديمية الجهوية للتربية والتكوين"},null,null,null,null,null,null,null,null,null,"الرقم الوطني",null,null,{"$f":"IF(N7=\"\",\"\",VLOOKUP(N5,base1,2,0))","v":"AZ22334455"}]
[{"$f":"IF(TS!$A$6=\"\",\"\",TS!$A$6)","v":"جهة: الدارالبيضاء-سطات"},null,null,null,null,null,null,null,null,null,"رقم التسجيل",null,null,{"$f":"IF(N7=\"\",\"\",VLOOKUP(N5,base1,6,0))","v":1400}]
[{"$f":"IF(TS!$A$7=\"\",\"\",TS!$A$7)","v":"مديرية :المحمدية"},null,null,null,null,null,null,null,null,null,"رقم ت في القسم",null,null,1]
[{"$f":"IF(TS!$A$8=\"\",\"\",TS!$A$8)","v":"مؤسسة :النجاح"},null,null,null,null,null,null,null,null,null,"المستوى",null,null,{"$f":"IF(TS!$M$3=\"\",\"\",TS!$M$3)","v":"الأول"}]
[null,null,null,null,null,null,null,null,null,null,"عدد التلاميذ",null,null,{"$f":"IF(TS!$O$12=0,\"\",TS!$O$12)","v":29}]
[]
[null,"بطاقة المراقبة المستمرة"]
[]
[]
[null,null,"مدرسة",null,null,null,null,null,{"$f":"IF(TS!$M$4=\"\",\"\",TS!$M$4)","v":"المركزية"}]
[null,null,"الاسم والنسب",null,null,null,null,null,{"$f":"IF(N7=\"\",\"\",VLOOKUP(N5,base1,3,0))","v":"ياسين النسب1"}]
[]
[null,"نتائج الأسدوس الأول"]
[]
["الوحدات",null,null,"الانشطة",null,null,"الدورة الأولى",null,null,null,null,null,"ملاحظات"]
[null,null,null,null,null,null,"النقطة1",null,"النقطة2",null,null,"المعدل"]
["اللغة العربية",null,null,"التعبيرالكتابي",null,null,{"$f":"IF(N7=\"\",\"\",VLOOKUP(N5,base1,7,0))","v":6},null,{"$f":"IF(N7=\"\",\"\",VLOOKUP(N5,base1,8,0))","v":6},null,null,{"$f":"IF(N7=\"\",\"\",VLOOKUP(N5,base1,9,0))","v":6},{"$f":"IF(L25=\"\",\"\",IF(L25>=9,\"عمل ممتاز\",IF(L25>=8,\"نتائج حسنة\",IF(L25>=7,\"عمل مستحسن\",IF(L25>=6,\"نتائج لابأس بها\",IF(L25>=5,\"عمل متوسط\",IF(L25>=4,\"عمل دون متوسط\",\"عليك بالاجتهاد أكثر\")))))))","v":"عمل متوسط"}]
[null,null,null,"القراءة",null,null,{"$f":"IF(N7=\"\",\"\",VLOOKUP(N5,base1,10,0))","v":4},null,{"$f":"IF(N7=\"\",\"\",VLOOKUP(N5,base1,11,0))","v":5},null,null,{"$f":"IF(N7=\"\",\"\",VLOOKUP(N5,base1,12,0))","v":4.5}]
[null,null,null,"الإملاء",null,null,{"$f":"IF(N7=\"\",\"\",VLOOKUP(N5,base1,13,0))","v":3},null,{"$f":"IF(N7=\"\",\"\",VLOOKUP(N5,base1,14,0))","v":8},null,null,{"$f":"IF(N7=\"\",\"\",VLOOKUP(N5,base1,15,0))","v":5.5}]
[null,null,null,"الخط",null,null,{"$f":"IF(N7=\"\",\"\",VLOOKUP(N5,base1,16,0))","v":6},null,{"$f":"IF(N7=\"\",\"\",VLOOKUP(N5,base1,17,0))","v":6.5},null,null,{"$f":"IF(N7=\"\",\"\",VLOOKUP(N5,base1,18,0))","v":6.25}]
[null,null,null,"الاستماع والتحدث",null,null,{"$f":"IF(N7=\"\",\"\",VLOOKUP(N5,base1,19,0))","v":4},null,{"$f":"IF(N7=\"\",\"\",VLOOKUP(N5,base1,20,0))","v":5.5},null,null,{"$f":"IF(N7=\"\",\"\",VLOOKUP(N5,base1,21,0))","v":4.75}]
[null,null,null,"النقل",null,null,{"$f":"IF(N7=\"\",\"\",VLOOKUP(N5,base1,22,0))","v":6.75},null,{"$f":"IF(N7=\"\",\"\",VLOOKUP(N5,base1,23,0))","v":7},null,null,{"$f":"IF(N7=\"\",\"\",VLOOKUP(N5,base1,24,0))","v":6.875}]
[null,null,null,"معدل الوحدة",null,null,null,null,null,null,null,{"$f":"IF(N7=\"\",\"\",VLOOKUP(N5,base1,25,0))","v":5.645833333333333}]
["اللغة",null,null,"الأمازيغية",null,null,{"$f":"IF(TS!$P$3=0,\"\",VLOOKUP(N5,base1,26,0))","v":""},null,{"$f":"IF(TS!$P$3=0,\"\",VLOOKUP(N5,base1,27,0))","v":""},null,null,{"$f":"IF(TS!$P$3=0,\"\",VLOOKUP(N5,base1,28,0))","v":""},{"$f":"IF(L27=\"\",\"الأمازيغية غير معممة\",IF(L27>=9,\"عمل ممتاز\",IF(L27>=8,\"نتائج حسنة\",IF(L27>=7,\"عمل مستحسن\",IF(L27>=6,\"نتائج لابأس بها\",IF(L27>=5,\"عمل متوسط\",IF(L27>=4,\"عمل دون متوسط\",\"عليك بالاجتهاد أكثر\")))))))","v":"الأمازيغية غير معممة"}]
["الأمازيغية",null,null,"معدل الوحدة"]
["التربية ",null,null,"الفرض 1",null,null,{"$f":"IF(N7=\"\",\"\",VLOOKUP(N5,base1,29,0))","v":5},null,null,null,null,{"$f":"IF(N7=\"\",\"\",VLOOKUP(N5,base1,29,0))","v":5},{"$f":"IF(L32=\"\",\"\",IF(L32>=9,\"عمل ممتاز\",IF(L32>=8,\"نتائج حسنة\",IF(L32>=7,\"عمل مستحسن\",IF(L32>=6,\"نتائج لابأس بها\",IF(L32>=5,\"عمل متوسط\",IF(L32>=4,\"عمل دون متوسط\",\"عليك بالاجتهاد أكثر\")))))))","v":"عمل دون متوسط"}]
[null,null,null,"الفرض 2",null,null,{"$f":"IF(N7=\"\",\"\",VLOOKUP(N5,base1,30,0))","v":4},null,null,null,null,{"$f":"IF(N7=\"\",\"\",VLOOKUP(N5,base1,30,0))","v":4}]
["الإسلامية",null,null,"الفرض 3",null,null,{"$f":"IF(N7=\"\",\"\",VLOOKUP(N5,base1,31,0))","v":5},null,null,null,null,{"$f":"IF(N7=\"\",\"\",VLOOKUP(N5,base1,31,0))","v":5}]
[null,null,null,"أنشطة",null,null,{"$f":"IF(N7=\"\",\"\",VLOOKUP(N5,base1,32,0))","v":4},null,null,null,null,{"$f":"IF(N7=\"\",\"\",VLOOKUP(N5,base1,32,0))","v":4}]
[null,null,null,"معدل الوحدة",null,null,null,null,null,null,null,{"$f":"IF(N7=\"\",\"\",VLOOKUP(N5,base1,33,0))","v":4.5}]
["النشاط ",null,null,"النشاط العلمي",null,null,{"$f":"IF(N7=\"\",\"\",VLOOKUP(N5,base1,34,0))","v":6.5},null,{"$f":"IF(N7=\"\",\"\",VLOOKUP(N5,base1,35,0))","v":4},null,null,{"$f":"IF(N7=\"\",\"\",VLOOKUP(N5,base1,36,0))","v":5.25},{"$f":"IF(L33=\"\",\"\",IF(L33>=9,\"عمل ممتاز\",IF(L33>=8,\"نتائج حسنة\",IF(L33>=7,\"عمل مستحسن\",IF(L33>=6,\"نتائج لابأس بها\",IF(L33>=5,\"عمل متوسط\",IF(L33>=4,\"عمل دون متوسط\",\"عليك بالاجتهاد أكثر\")))))))","v":"عمل متوسط"}]
["العلمي",null,null,"معدل الوحدة"]
["التربية",null,null,"التربية الفنية",null,null,{"$f":"IF(N7=\"\",\"\",VLOOKUP(N5,base1,37,0))","v":5},null,{"$f":"IF(N7=\"\",\"\",VLOOKUP(N5,base1,38,0))","v":7},null,null,{"$f":"IF(N7=\"\",\"\",VLOOKUP(N5,base1,39,0))","v":6},{"$f":"IF(L35=\"\",\"\",IF(L35>=9,\"عمل ممتاز\",IF(L35>=8,\"نتائج حسنة\",IF(L35>=7,\"عمل مستحسن\",IF(L35>=6,\"نتائج لابأس بها\",IF(L35>=5,\"عمل متوسط\",IF(L35>=4,\"عمل دون متوسط\",\"عليك بالاجتهاد أكثر\")))))))","v":"نتائج لابأس بها"}]
["الفنية",null,null,"معدل الوحدة"]
["الرياضيات",null,null,"الرياضيات",null,null,{"$f":"IF(N7=\"\",\"\",VLOOKUP(N5,base1,40,0))","v":3},null,{"$f":"IF(N7=\"\",\"\",VLOOKUP(N5,base1,41,0))","v":3},null,null,{"$f":"IF(N7=\"\",\"\",VLOOKUP(N5,base1,42,0))","v":3},{"$f":"IF(L37=\"\",\"\",IF(L37>=9,\"عمل ممتاز\",IF(L37>=8,\"نتائج حسنة\",IF(L37>=7,\"عمل مستحسن\",IF(L37>=6,\"نتائج لابأس بها\",IF(L37>=5,\"عمل متوسط\",IF(L37>=4,\"عمل دون متوسط\",\"عليك بالاجتهاد أكثر\")))))))","v":"عليك بالاجتهاد أكثر"}]
[null,null,null,"معدل الوحدة"]
["الفرنسية",null,null,"Comptine/chant",null,null,{"$f":"IF(N7=\"\",\"\",VLOOKUP(N5,base1,43,0))","v":4},null,{"$f":"IF(N7=\"\",\"\",VLOOKUP(N5,base1,44,0))","v":3},null,null,{"$f":"IF(N7=\"\",\"\",VLOOKUP(N5,base1,45,0))","v":3.5}]
[null,null,null,"Graphisme",null,null,{"$f":"IF(N7=\"\",\"\",VLOOKUP(N5,base1,46,0))","v":7.5},null,{"$f":"IF(N7=\"\",\"\",VLOOKUP(N5,base1,47,0))","v":6},null,null,{"$f":"IF(N7=\"\",\"\",VLOOKUP(N5,base1,48,0))","v":6.75}]
[null,null,null,"Act.orales",null,null,{"$f":"IF(N7=\"\",\"\",VLOOKUP(N5,base1,49,0))","v":3},null,{"$f":"IF(N7=\"\",\"\",VLOOKUP(N5,base1,50,0))","v":4},null,null,{"$f":"IF(N7=\"\",\"\",VLOOKUP(N5,base1,51,0))","v":3.5}]
[null,null,null,"Projet de classe",null,null,{"$f":"IF(N7=\"\",\"\",VLOOKUP(N5,base1,52,0))","v":1},null,{"$f":"IF(N7=\"\",\"\",VLOOKUP(N5,base1,53,0))","v":1},null,null,{"$f":"IF(N7=\"\",\"\",VLOOKUP(N5,base1,54,0))","v":1}]
[null,null,null,"معدل الوحدة",null,null,null,null,null,null,null,{"$f":"IF(N7=\"\",\"\",VLOOKUP(N5,base1,55,0))","v":3.6875}]
["التربية",null,null,"التربية البدنية",null,null,{"$f":"IF(N7=\"\",\"\",VLOOKUP(N5,base1,56,0))","v":7},null,{"$f":"IF(N7=\"\",\"\",VLOOKUP(N5,base1,57,0))","v":8},null,null,{"$f":"IF(N7=\"\",\"\",VLOOKUP(N5,base1,58,0))","v":7.5},{"$f":"IF(L44=\"\",\"\",IF(L44>=9,\"عمل ممتاز\",IF(L44>=8,\"نتائج حسنة\",IF(L44>=7,\"عمل مستحسن\",IF(L44>=6,\"نتائج لابأس بها\",IF(L44>=5,\"عمل متوسط\",IF(L44>=4,\"عمل دون متوسط\",\"عليك بالاجتهاد أكثر\")))))))","v":"عمل مستحسن"}]
["البدنية",null,null,"معدل الوحدة"]
[]
["مجموع معدل الوحدات",null,null,null,{"$f":"IF(N7=\"\",\"\",VLOOKUP(N5,base1,61,0))","v":35.583333333333336},null,null,"الميزة",null,null,null,"خاتم و توقيع رئيس المؤسسة"]
["المعدل الدوري",null,null,null,{"$f":"IF(N7=\"\",\"\",VLOOKUP(N5,base1,62,0))","v":5.0833333333333339},null,null,{"$f":"IF(N7=\"\",\"\",VLOOKUP(N5,base1,64,0))","v":"متوسط"}]
["الرتبة",null,null,null,{"$f":"IF(N7=\"\",\"\",VLOOKUP(N5,base1,63,0))","v":23}]

{"sheet":"T2","index":4,"n_rows":101,"n_cols":72,"rows_kept":101,"cut":false,"hidden":false,"merged":[[2,2,2,5],[2,37,2,39],[2,40,2,42],[0,2,1,5],[0,37,0,39],[0,40,0,42],[1,37,1,39],[1,40,1,42],[3,2,3,5],[3,8,4,34],[3,37,3,39],[3,40,3,42],[4,2,4,5],[4,37,4,39],[4,40,4,42],[6,36,7,37],[6,38,7,38],[6,39,7,40],[5,2,5,5],[6,6,6,23],[6,24,7,24],[6,25,7,26],[6,27,7,27],[6,28,6,31],[7,5,8,5],[7,6,7,8],[7,9,7,11],[7,12,7,14],[6,66,8,66],[7,0,8,0],[7,1,8,1],[7,2,8,2],[7,3,8,3],[7,4,8,4],[6,41,7,41],[6,42,6,53],[6,54,7,54],[6,55,7,56],[6,57,7,57],[6,58,8,58],[7,47,8,47],[7,48,7,49],[7,50,8,50],[7,51,7,52],[6,62,8,62],[6,63,8,63],[6,65,8,65],[7,15,7,17],[7,18,7,20],[7,21,7,23],[7,42,7,43],[7,44,8,44],[7,45,7,46],[6,59,8,59],[6,60,8,60],[6,61,8,61],[6,64,8,64],[6,32,7,32],[6,33,7,34],[6,35,7,35],[19,67,19,72],[20,67,20,70],[6,67,8,67],[6,68,7,70],[6,71,8,72],[10,67,18,67],[10,68,10,70],[11,68,11,70],[12,68,13,70],[16,68,16,70],[17,68,17,70],[18,68,18,69]]}
[null,null,null,null,null,null,null,null,null,null,null,null,null,null,null,null,null,null,null,null,null,null,null,null,null,null,null,null,null,null,null,null,null,null,null,null,null,"العــام الدراســي ",null,null,{"$f":"IF(TS!M1=\"\",\"\",TS!M1)","v":"2020-2019"}]
[null,null,null,null,null,null,null,null,null,null,null,null,null,null,null,null,null,null,null,null,null,null,null,null,null,null,null,null,null,null,null,null,null,null,null,null,null,"الأستاذ"]
[null,null,{"$f":"IF(TS!A5=\"\",\"\",TS!A5)","v":"الأكاديمية الجهوية للتربية والتكوين"},null,null,null,null,null,null,null,null,null,null,null,null,null,null,null,null,null,null,null,null,null,null,null,null,null,null,null,null,null,null,null,null,null,null,"المستوى "]
[null,null,{"$f":"IF(TS!A6=\"\",\"\",TS!A6)","v":"جهة: الدارالبيضاء-سطات"},null,null,null,null,null,"مجمل  نتائج الأسدوس الثاني",null,null,null,null,null,null,null,null,null,null,null,null,null,null,null,null,null,null,null,null,null,null,null,null,null,null,null,null,"الوحدة المدرسية"]
[null,null,{"$f":"IF(TS!A7=\"\",\"\",TS!A7)","v":"مديرية :المحمدية"},null,null,null,null,null,null,null,null,null,null,null,null,null,null,null,null,null,null,null,null,null,null,null,null,null,null,null,null,null,null,null,null,null,null,"الفوج"]
[null,null,{"$f":"IF(TS!A8=\"\",\"\",TS!A8)","v":"مؤسسة :النجاح"}]
[null,null,null,null,null,null,"اللغة العربية",null,null,null,null,null,null,null,null,null,null,null,null,null,null,null,null,null,"معدل","الأمازيغية",null,"معدل","التربية الإسلامية",null,null,null,"معدل","النشاط العلمي",null,"معدل","التربية الفنية",null,"معدل","الرياضيات",null,"معدل","الفرنسية",null,null,null,null,null,null,null,null,null,null,null,"المعدل ","التربية البدنية",null,"معدل","معامل ت ب","مج المعاملات","مج المعدلات","معدل د2","معدل 1","معدل سنوي","الرتبة","القرار","الميزة","العتبة","عدد الناجحين حسب العتبة",null,null,"استثمار النتائج"]
["ر.ت","رقم التلميذ","الاسم و النسب","تاريخ الإزدياد","الجنس","ر.التسجيل","التعبير الكتابي",null,null,"القراءة",null,null,"الإملاء",null,null,"الخط",null,null,"الاستماع والتحدث",null,null,"النقل",null,null,null,null,null,null,"فرض1","فرض2","فرض3","أنشطة",null,null,null,null,null,null,null,null,null,null,"Comptine/chant",null,"معدل","Graphisme",null,"معدل","Activités orales",null,"معدل","Projet de classe",null,"معدل"]
[null,null,null,null,null,null,"ن1","ن2","معدل","ن1","ن2","معدل","ن1","ن2","معدل","ن1","ن2","معدل","ن1","ن2","معدل","ن1","ن2","معدل","الوحدة","ن1","ن2","الوحدة","ن1","ن2","ن3","ن4","الوحدة","ن1","ن2","الوحدة","ن1","ن2","الوحدة","ن1","ن2","الوحدة","ن1","ن2",null,"ن1","ن2",null,"ن1","ن2",null,"ن1","ن2",null,"للوحدة","ن1","ن2","الوحدة",null,null,null,null,null,null,null,null,null,null,"إناث","ذكور","المجموع"]
[{"$f":"IF(TS!A16=\"\",\"\",TS!A16)","v":1},{"$f":"IF(TS!B16=\"\",\"\",TS!B16)","v":"AZ22334455"},{"$f":"IF(TS!C16=\"\",\"\",TS!C16)","v":"ياسين النسب1"},{"$f":"IF(TS!G16=\"\",\"\",TS!G16)","v":"2010-07-20"},{"$f":"IF(TS!D16=\"\",\"\",TS!D16)","v":"ذ"},{"$f":"IF(TS!F16=\"\",\"\",TS!F16)","v":1400},6,6,{"$f":"IF(OR(G10=\"\",H10=\"\"),\"\",AVERAGE(G10:H10))","v":6},4,5,{"$f":"IF(OR(J10=\"\",K10=\"\"),\"\",AVERAGE(J10:K10))","v":4.5},3,8,{"$f":"IF(OR(M10=\"\",N10=\"\"),\"\",AVERAGE(M10:N10))","v":5.5},6,6.5,{"$f":"IF(OR(P10=\"\",Q10=\"\"),\"\",AVERAGE(P10:Q10))","v":6.25},4,5.5,{"$f":"IF(OR(S10=\"\",T10=\"\"),\"\",AVERAGE(S10:T10))","v":4.75},6.75,7,{"$f":"IF(OR(V10=\"\",W10=\"\"),\"\",AVERAGE(V10:W10))","v":6.875},{"$f":"IF(OR(I10=\"\",L10=\"\",O10=\"\",R10=\"\",U10=\"\",X10=\"\"),\"\",AVERAGE(I10,L10,O10,R10,U10,X10))","v":5.645833333333333},null,null,{"$f":"IF(OR(Z10=\"\",AA10=\"\"),\"\",AVERAGE(Z10:AA10))","v":""},5,4,5,4,{"$f":"IF(OR(AC10=\"\",AD10=\"\",AE10=\"\",AF10=\"\"),\"\",AVERAGE(AC10:AF10))","v":4.5},6.5,4,{"$f":"IF(OR(AH10=\"\",AI10=\"\"),\"\",AVERAGE(AH10:AI10))","v":5.25},5,7,{"$f":"IF(OR(AK10=\"\",AL10=\"\"),\"\",AVERAGE(AK10:AL10))","v":6},3,3,{"$f":"IF(OR(AN10=\"\",AO10=\"\"),\"\",AVERAGE(AN10:AO10))","v":3},4,3,{"$f":"IF(OR(AQ10=\"\",AR10=\"\"),\"\",AVERAGE(AQ10:AR10))","v":3.5},7.5,6,{"$f":"IF(OR(AT10=\"\",AU10=\"\"),\"\",AVERAGE(AT10:AU10))","v":6.75},3,4,{"$f":"IF(OR(AW10=\"\",AX10=\"\"),\"\",AVERAGE(AW10:AX10))","v":3.5},1,1,{"$f":"IF(OR(AZ10=\"\",BA10=\"\"),\"\",AVERAGE(AZ10:BA10))","v":1},{"$f":"IF(OR(AS10=\"\",AV10=\"\",AY10=\"\",BB10=\"\"),\"\",AVERAGE(AS10,AV10,AY10,BB10))","v":3.6875},7,8,{"$f":"IF(OR(BD10=\"\",BE10=\"\"),\"\",AVERAGE(BD10:BE10))","v":7.5},1,{"$f":"6+BG10+TS!$P$3","v":7},{"$f":"SUM(BF10,BC10,AP10,AM10,AJ10,AG10,AB10,Y10)","v":35.583333333333336},{"$f":"IF(B10=\"\",\"\",BI10/BH10)","v":5.0833333333333339},{"$f":"IF('T1'!BJ10=\"\",\"\",'T1'!BJ10)","v":5.0833333333333339},{"$f":"AVERAGE(BJ10:BK10)","v":5.0833333333333339},{"$f":"IF(BL10=\"\",\"\",RANK(BL10,$BL$10:$BL$69))","v":23},{"$f":"IF(BL10<5,\"يكرر\",\"ينتقل\")","v":"ينتقل"},{"$f":"IF(BJ10=\"\",\"\",IF(BJ10>=8,\"تنويه\",IF(BJ10>=7,\"تشجيع\",IF(BJ10>=6,\"لوحة الشرف\",IF(BJ10>=5,\"متوسط\",IF(BJ10>=3,\"تنبيه\",\"توبيخ\"))))))","v":"متوسط"},5,null,null,null,"] 3 - 0 ]"]
[{"$f":"IF(TS!A17=\"\",\"\",TS!A17)","v":2},{"$f":"IF(TS!B17=\"\",\"\",TS!B17)","v":"AZ22334456"},{"$f":"IF(TS!C17=\"\",\"\",TS!C17)","v":"ريان النسب2"},{"$f":"IF(TS!G17=\"\",\"\",TS!G17)","v":"2012-07-04"},{"$f":"IF(TS!D17=\"\",\"\",TS!D17)","v":"ذ"},{"$f":"IF(TS!F17=\"\",\"\",TS!F17)","v":1401},5.5,9,{"$f":"IF(OR(G11=\"\",H11=\"\"),\"\",AVERAGE(G11:H11))","v":7.25},4.5,6.5,{"$f":"IF(OR(J11=\"\",K11=\"\"),\"\",AVERAGE(J11:K11))","v":5.5},1,2.5,{"$f":"IF(OR(M11=\"\",N11=\"\"),\"\",AVERAGE(M11:N11))","v":1.75},6,7,{"$f":"IF(OR(P11=\"\",Q11=\"\"),\"\",AVERAGE(P11:Q11))","v":6.5},5.5,6,{"$f":"IF(OR(S11=\"\",T11=\"\"),\"\",AVERAGE(S11:T11))","v":5.75},5.5,7.5,{"$f":"IF(OR(V11=\"\",W11=\"\"),\"\",AVERAGE(V11:W11))","v":6.5},{"$f":"IF(OR(I11=\"\",L11=\"\",O11=\"\",R11=\"\",U11=\"\",X11=\"\"),\"\",AVERAGE(I11,L11,O11,R11,U11,X11))","v":5.541666666666667},null,null,null,7.75,8,5,6,{"$f":"IF(OR(AC11=\"\",AD11=\"\",AE11=\"\",AF11=\"\"),\"\",AVERAGE(AC11:AF11))","v":6.6875},8,1.5,{"$f":"IF(OR(AH11=\"\",AI11=\"\"),\"\",AVERAGE(AH11:AI11))","v":4.75},6,6.75,{"$f":"IF(OR(AK11=\"\",AL11=\"\"),\"\",AVERAGE(AK11:AL11))","v":6.375},5,4.75,{"$f":"IF(OR(AN11=\"\",AO11=\"\"),\"\",AVERAGE(AN11:AO11))","v":4.875},8.5,5,{"$f":"IF(OR(AQ11=\"\",AR11=\"\"),\"\",AVERAGE(AQ11:AR11))","v":6.75},7,6,{"$f":"IF(OR(AT11=\"\",AU11=\"\"),\"\",AVERAGE(AT11:AU11))","v":6.5},4,5,{"$f":"IF(OR(AW11=\"\",AX11=\"\"),\"\",AVERAGE(AW11:AX11))","v":4.5},1,8.5,{"$f":"IF(OR(AZ11=\"\",BA11=\"\"),\"\",AVERAGE(AZ11:BA11))","v":4.75},{"$f":"IF(OR(AS11=\"\",AV11=\"\",AY11=\"\",BB11=\"\"),\"\",AVERAGE(AS11,AV11,AY11,BB11))","v":5.625},7,7.5,{"$f":"IF(OR(BD11=\"\",BE11=\"\"),\"\",AVERAGE(BD11:BE11))","v":7.25},1,{"$f":"6+BG11+TS!$P$3","v":7},{"$f":"SUM(BF11,BC11,AP11,AM11,AJ11,AG11,AB11,Y11)","v":41.104166666666664},{"$f":"IF(B11=\"\",\"\",BI11/BH11)","v":5.8720238095238093},{"$f":"IF('T1'!BJ11=\"\",\"\",'T1'!BJ11)","v":5.8720238095238093},{"$f":"AVERAGE(BJ11:BK11)","v":5.8720238095238093},{"$f":"IF(BL11=\"\",\"\",RANK(BL11,$BL$10:$BL$69))","v":20},{"$f":"IF(BL11<5,\"يكرر\",\"ينتقل\")","v":"ينتقل"},{"$f":"IF(BJ11=\"\",\"\",IF(BJ11>=8,\"تنويه\",IF(BJ11>=7,\"تشجيع\",IF(BJ11>=6,\"لوحة الشرف\",IF(BJ11>=5,\"متوسط\",IF(BJ11>=3,\"تنبيه\",\"توبيخ\"))))))","v":"متوسط"},null,"نسبة النجاح",null,null,"] 4 - 3 ]"]
[{"$f":"IF(TS!A18=\"\",\"\",TS!A18)","v":3},{"$f":"IF(TS!B18=\"\",\"\",TS!B18)","v":"AZ22334457"},{"$f":"IF(TS!C18=\"\",\"\",TS!C18)","v":"يوسف النسب3"},{"$f":"IF(TS!G18=\"\",\"\",TS!G18)","v":"2010-08-01"},{"$f":"IF(TS!D18=\"\",\"\",TS!D18)","v":"ذ"},{"$f":"IF(TS!F18=\"\",\"\",TS!F18)","v":1402},8,10,9,8.5,8.5,8.5,4,9,6.5,9,9,9,7,8.5,7.75,9,9,9,8.2916666666666661,null,null,null,9,9,9,8,8.75,10,8.5,9.25,6,8.5,7.25,9.5,9,9.25,8.5,7,7.75,8.75,8.5,8.625,6.5,6,6.25,3,9,6,7.15625,8.5,7.5,8,1,{"$f":"6+BG12+TS!$P$3","v":7},57.947916666666664,8.2782738095238084,{"$f":"IF('T1'!BJ12=\"\",\"\",'T1'!BJ12)","v":8.2782738095238084},8.2782738095238084,1,"ينتقل","تنويه",null,null,null,null,"] 5 - 4 ]"]
[{"$f":"IF(TS!A19=\"\",\"\",TS!A19)","v":4},{"$f":"IF(TS!B19=\"\",\"\",TS!B19)","v":"AZ22334458"},{"$f":"IF(TS!C19=\"\",\"\",TS!C19)","v":"ايناس النسب4"},{"$f":"IF(TS!G19=\"\",\"\",TS!G19)","v":"2012-12-02"},{"$f":"IF(TS!D19=\"\",\"\",TS!D19)","v":"أ"},{"$f":"IF(TS!F19=\"\",\"\",TS!F19)","v":1403},8,9,8.5,8.75,9,8.875,8.5,9,8.75,9,9,9,7.5,8.5,8,8.75,9,8.875,8.6666666666666661,null,null,null,8,9,7,9,8.25,7,8,7.5,5,8,6.5,7.5,7.25,7.375,8,7,7.5,8.5,8.5,8.5,6,7,6.5,7,9,8,7.625,8,8,8,1,{"$f":"6+BG13+TS!$P$3","v":7},53.916666666666664,7.7023809523809517,{"$f":"IF('T1'!BJ13=\"\",\"\",'T1'!BJ13)","v":7.7023809523809517},7.7023809523809517,8,"ينتقل","تشجيع",null,"عدد الراسبين حسب العتبة",null,null,"[5]"]
[{"$f":"IF(TS!A20=\"\",\"\",TS!A20)","v":5},{"$f":"IF(TS!B20=\"\",\"\",TS!B20)","v":"AZ22334459"},{"$f":"IF(TS!C20=\"\",\"\",TS!C20)","v":"طه النسب5"},{"$f":"IF(TS!G20=\"\",\"\",TS!G20)","v":"2012-09-25"},{"$f":"IF(TS!D20=\"\",\"\",TS!D20)","v":"ذ"},{"$f":"IF(TS!F20=\"\",\"\",TS!F20)","v":1404},7,9,8,7.5,8.5,8,7,5,6,7.5,7.5,7.5,6,6.5,6.25,7,7.5,7.25,7.166666666666667,null,null,null,7.75,8,6.5,7,7.3125,9.75,8,8.875,7.5,7.5,7.5,7.5,6,6.75,8.5,6,7.25,8.5,6,7.25,5,5,5,8,8,8,6.875,6.75,7.5,7.125,1,{"$f":"6+BG14+TS!$P$3","v":7},51.604166666666664,7.3720238095238093,{"$f":"IF('T1'!BJ14=\"\",\"\",'T1'!BJ14)","v":7.3720238095238093},7.3720238095238093,10,"ينتقل","تشجيع",null,null,null,null,"] 6 - 5 ["]
[{"$f":"IF(TS!A21=\"\",\"\",TS!A21)","v":6},{"$f":"IF(TS!B21=\"\",\"\",TS!B21)","v":"AZ22334460"},{"$f":"IF(TS!C21=\"\",\"\",TS!C21)","v":"أمين النسب6"},{"$f":"IF(TS!G21=\"\",\"\",TS!G21)","v":"2012-03-12"},{"$f":"IF(TS!D21=\"\",\"\",TS!D21)","v":"ذ"},{"$f":"IF(TS!F21=\"\",\"\",TS!F21)","v":1405},5.5,7,6.25,4,6.5,5.25,1,7,4,4.5,6.5,5.5,4.5,6,5.25,6,7,6.5,5.458333333333333,null,null,null,8,9,8,8,8.25,3,7,5,4,8,6,4,5.75,4.875,8.75,5,6.875,3,8,5.5,4.5,4,4.25,6,1,3.5,5.03125,6,7,6.5,1,{"$f":"6+BG15+TS!$P$3","v":7},41.114583333333336,5.8735119047619051,{"$f":"IF('T1'!BJ15=\"\",\"\",'T1'!BJ15)","v":5.8735119047619051},5.8735119047619051,19,"ينتقل","متوسط",null,"إناث","ذكور","المجموع","] 7 - 6 ]"]
[{"$f":"IF(TS!A22=\"\",\"\",TS!A22)","v":7},{"$f":"IF(TS!B22=\"\",\"\",TS!B22)","v":"AZ22334461"},{"$f":"IF(TS!C22=\"\",\"\",TS!C22)","v":"ريان النسب7"},{"$f":"IF(TS!G22=\"\",\"\",TS!G22)","v":"2012-10-01"},{"$f":"IF(TS!D22=\"\",\"\",TS!D22)","v":"ذ"},{"$f":"IF(TS!F22=\"\",\"\",TS!F22)","v":1406},2,3,2.5,3.5,3,3.25,1,3,2,4,4,4,3.5,3,3.25,1,3,2,2.8333333333333335,null,null,null,2.5,5,3,4,3.625,1.5,3,2.25,5,5,5,1,3,2,2,4,3,6.75,5,5.875,3,3,3,1,1,1,3.21875,6.5,7,6.75,1,{"$f":"6+BG16+TS!$P$3","v":7},25.677083333333332,3.6681547619047619,{"$f":"IF('T1'!BJ16=\"\",\"\",'T1'!BJ16)","v":3.6681547619047619},3.6681547619047619,28,"يكرر","تنبيه",null,null,null,null,"] 8 - 7 ]"]
[{"$f":"IF(TS!A23=\"\",\"\",TS!A23)","v":8},{"$f":"IF(TS!B23=\"\",\"\",TS!B23)","v":"AZ22334462"},{"$f":"IF(TS!C23=\"\",\"\",TS!C23)","v":"نبيل النسب8"},{"$f":"IF(TS!G23=\"\",\"\",TS!G23)","v":"2012-10-05"},{"$f":"IF(TS!D23=\"\",\"\",TS!D23)","v":"ذ"},{"$f":"IF(TS!F23=\"\",\"\",TS!F23)","v":1407},7,10,8.5,7.5,8.5,8,6.5,10,8.25,8.75,9.5,9.125,6.75,8.75,7.75,8.75,9.5,9.125,8.4583333333333339,null,null,null,9,9,7,9,8.5,5.5,9.5,7.5,6,8.75,7.375,10,6,8,8.5,7,7.75,8.75,8.5,8.625,5,6,5.5,7,9,8,7.46875,8,8,8,1,{"$f":"6+BG17+TS!$P$3","v":7},55.302083333333336,7.9002976190476195,{"$f":"IF('T1'!BJ17=\"\",\"\",'T1'!BJ17)","v":7.9002976190476195},7.9002976190476195,4,"ينتقل","تشجيع",null,"نسبة الرسوب",null,null,"] 9 - 8 ]"]
[{"$f":"IF(TS!A24=\"\",\"\",TS!A24)","v":9},{"$f":"IF(TS!B24=\"\",\"\",TS!B24)","v":"AZ22334463"},{"$f":"IF(TS!C24=\"\",\"\",TS!C24)","v":"يحيى النسب9"},{"$f":"IF(TS!G24=\"\",\"\",TS!G24)","v":"2012-07-06"},{"$f":"IF(TS!D24=\"\",\"\",TS!D24)","v":"ذ"},{"$f":"IF(TS!F24=\"\",\"\",TS!F24)","v":1408},7,8,7.5,8.5,9,8.75,4,6,5,8,8.75,8.375,6.75,7,6.875,8.5,9,8.75,7.541666666666667,null,null,null,7,7.5,6.5,7,7,7.5,3.75,5.625,5,7,6,4.5,8,6.25,8,6.5,7.25,8.5,6.5,7.5,4,6,5,1,6,3.5,5.8125,7.5,7.5,7.5,1,{"$f":"6+BG18+TS!$P$3","v":7},45.729166666666664,6.5327380952380949,{"$f":"IF('T1'!BJ18=\"\",\"\",'T1'!BJ18)","v":6.5327380952380949},6.5327380952380949,12,"ينتقل","لوحة الشرف",null,null,null,null,"] 10 - 9 ]"]
[{"$f":"IF(TS!A25=\"\",\"\",TS!A25)","v":10},{"$f":"IF(TS!B25=\"\",\"\",TS!B25)","v":"AZ22334464"},{"$f":"IF(TS!C25=\"\",\"\",TS!C25)","v":"كريم النسب10"},{"$f":"IF(TS!G25=\"\",\"\",TS!G25)","v":"2012-10-30"},{"$f":"IF(TS!D25=\"\",\"\",TS!D25)","v":"أ"},{"$f":"IF(TS!F25=\"\",\"\",TS!F25)","v":1409},7.5,7,7.25,8.5,8.75,8.625,6.75,8.75,7.75,7,8.75,7.875,5.75,7.5,6.625,7.75,8.5,8.125,7.708333333333333,null,null,null,8,8,8,7.5,7.875,6.75,8.5,7.625,6,7,6.5,7.5,8.5,8,7.75,6,6.875,8,6.5,7.25,4,6,5,7,7,7,6.53125,8,7.5,7.75,1,{"$f":"6+BG19+TS!$P$3","v":7},51.989583333333336,7.4270833333333339,{"$f":"IF('T1'!BJ19=\"\",\"\",'T1'!BJ19)","v":7.4270833333333339},7.4270833333333339,9,"ينتقل","تشجيع",null,"المجموع",null,null,"[10]"]
[{"$f":"IF(TS!A26=\"\",\"\",TS!A26)","v":11},{"$f":"IF(TS!B26=\"\",\"\",TS!B26)","v":"AZ22334465"},{"$f":"IF(TS!C26=\"\",\"\",TS!C26)","v":"محمد ياسين النسب11"},{"$f":"IF(TS!G26=\"\",\"\",TS!G26)","v":"2013-03-23"},{"$f":"IF(TS!D26=\"\",\"\",TS!D26)","v":"ذ"},{"$f":"IF(TS!F26=\"\",\"\",TS!F26)","v":1410},8,10,9,8.75,9,8.875,9,9,9,9,9,9,7.5,9,8.25,9,9,9,8.8541666666666661,null,null,null,8,9,7,8.5,8.125,8,9,8.5,7,8,7.5,7.5,8.25,7.875,8.5,7,7.75,8.75,8.5,8.625,5,6,5.5,6,7,6.5,7.09375,8.5,8,8.25,1,{"$f":"6+BG20+TS!$P$3","v":7},56.197916666666664,8.0282738095238084,{"$f":"IF('T1'!BJ20=\"\",\"\",'T1'!BJ20)","v":8.0282738095238084},8.0282738095238084,3,"ينتقل","تنويه"]
[{"$f":"IF(TS!A27=\"\",\"\",TS!A27)","v":12},{"$f":"IF(TS!B27=\"\",\"\",TS!B27)","v":"AZ22334466"},{"$f":"IF(TS!C27=\"\",\"\",TS!C27)","v":"دعاء النسب12"},{"$f":"IF(TS!G27=\"\",\"\",TS!G27)","v":"2013-03-16"},{"$f":"IF(TS!D27=\"\",\"\",TS!D27)","v":"أ"},{"$f":"IF(TS!F27=\"\",\"\",TS!F27)","v":1411},4,2,3,3,4,3.5,1,1,1,5,6,5.5,4,5.75,4.875,4,6,5,3.8125,null,null,null,7.5,7,5.5,6,6.5,4,2.75,3.375,5,6.75,5.875,1.5,1.25,1.375,7,5.5,6.25,6.5,6,6.25,3,4,3.5,1,8,4.5,5.125,7,7,7,1,{"$f":"6+BG21+TS!$P$3","v":7},33.0625,4.7232142857142856,{"$f":"IF('T1'!BJ21=\"\",\"\",'T1'!BJ21)","v":4.7232142857142856},4.7232142857142856,25,"يكرر","تنبيه",null,null,null,null,"المجموع"]
[{"$f":"IF(TS!A28=\"\",\"\",TS!A28)","v":13},{"$f":"IF(TS!B28=\"\",\"\",TS!B28)","v":"AZ22334467"},{"$f":"IF(TS!C28=\"\",\"\",TS!C28)","v":"مريم النسب13"},{"$f":"IF(TS!G28=\"\",\"\",TS!G28)","v":"2012-09-29"},{"$f":"IF(TS!D28=\"\",\"\",TS!D28)","v":"أ"},{"$f":"IF(TS!F28=\"\",\"\",TS!F28)","v":1412},4,1,2.5,3,4.5,3.75,1,1,1,5,6,5.5,4.5,5,4.75,4,6,5,3.75,null,null,null,5.5,8,8,7,7.125,4,3,3.5,5,6.75,5.875,3.5,3.75,3.625,7.5,4,5.75,7,6,6.5,3.5,4,3.75,1,1,1,4.25,7,7,7,1,{"$f":"6+BG22+TS!$P$3","v":7},35.125,5.0178571428571432,{"$f":"IF('T1'!BJ22=\"\",\"\",'T1'!BJ22)","v":5.0178571428571432},5.0178571428571432,24,"ينتقل","متوسط"]
[{"$f":"IF(TS!A29=\"\",\"\",TS!A29)","v":14},{"$f":"IF(TS!B29=\"\",\"\",TS!B29)","v":"AZ22334468"},{"$f":"IF(TS!C29=\"\",\"\",TS!C29)","v":"زكريا النسب14"},{"$f":"IF(TS!G29=\"\",\"\",TS!G29)","v":"2013-02-01"},{"$f":"IF(TS!D29=\"\",\"\",TS!D29)","v":"ذ"},{"$f":"IF(TS!F29=\"\",\"\",TS!F29)","v":1413},8,10,9,8.75,8.75,8.75,6.5,9.5,8,7.75,7,7.375,7,8.75,7.875,8,8.5,8.25,8.2083333333333339,null,null,null,9,9,8,9,8.75,9.5,6.5,8,6,8.5,7.25,7,7,7,6.5,8.5,7.5,8.5,7,7.75,6.5,7,6.75,1,8,4.5,6.625,8.5,8,8.25,1,{"$f":"6+BG23+TS!$P$3","v":7},54.083333333333336,7.7261904761904763,{"$f":"IF('T1'!BJ23=\"\",\"\",'T1'!BJ23)","v":7.7261904761904763},7.7261904761904763,6,"ينتقل","تشجيع"]
[{"$f":"IF(TS!A30=\"\",\"\",TS!A30)","v":15},{"$f":"IF(TS!B30=\"\",\"\",TS!B30)","v":"AZ22334469"},{"$f":"IF(TS!C30=\"\",\"\",TS!C30)","v":"عبد المطلب النسب15"},{"$f":"IF(TS!G30=\"\",\"\",TS!G30)","v":"2012-05-23"},{"$f":"IF(TS!D30=\"\",\"\",TS!D30)","v":"ذ"},{"$f":"IF(TS!F30=\"\",\"\",TS!F30)","v":1414},6,8,7,4,8,6,1,6.5,3.75,6,6.5,6.25,4.5,6.75,5.625,6,7,6.5,5.854166666666667,null,null,null,8.5,7,7.5,7,7.5,3,6.5,4.75,5,7,6,7.5,6.75,7.125,8.75,7,7.875,6.5,6.75,6.625,4.5,6,5.25,1,8,4.5,6.0625,7,7.5,7.25,1,{"$f":"6+BG24+TS!$P$3","v":7},44.541666666666664,6.3630952380952381,{"$f":"IF('T1'!BJ24=\"\",\"\",'T1'!BJ24)","v":6.3630952380952381},6.3630952380952381,14,"ينتقل","لوحة الشرف"]
[{"$f":"IF(TS!A31=\"\",\"\",TS!A31)","v":16},{"$f":"IF(TS!B31=\"\",\"\",TS!B31)","v":"AZ22334470"},{"$f":"IF(TS!C31=\"\",\"\",TS!C31)","v":"حمدي النسب16"},{"$f":"IF(TS!G31=\"\",\"\",TS!G31)","v":"2012-10-15"},{"$f":"IF(TS!D31=\"\",\"\",TS!D31)","v":"ذ"},{"$f":"IF(TS!F31=\"\",\"\",TS!F31)","v":1415},4,1,2.5,5,6.5,5.75,4,2,3,4,4,4,4,5.5,4.75,5,4,4.5,4.083333333333333,null,null,null,6,7,2,4,4.75,3,4,3.5,5,5,5,1,2.75,1.875,4,6.5,5.25,5.5,6,5.75,3,5,4,1,8,4.5,4.875,6.5,6.5,6.5,1,{"$f":"6+BG25+TS!$P$3","v":7},30.583333333333332,4.3690476190476186,{"$f":"IF('T1'!BJ25=\"\",\"\",'T1'!BJ25)","v":4.3690476190476186},4.3690476190476186,26,"يكرر","تنبيه"]
[{"$f":"IF(TS!A32=\"\",\"\",TS!A32)","v":17},{"$f":"IF(TS!B32=\"\",\"\",TS!B32)","v":"AZ22334471"},{"$f":"IF(TS!C32=\"\",\"\",TS!C32)","v":"اسماعيل النسب17"},{"$f":"IF(TS!G32=\"\",\"\",TS!G32)","v":"2012-11-25"},{"$f":"IF(TS!D32=\"\",\"\",TS!D32)","v":"ذ"},{"$f":"IF(TS!F32=\"\",\"\",TS!F32)","v":1416},4,1,2.5,3,4,3.5,1,2.5,1.75,1,5.75,3.375,3,5,4,1,5.5,3.25,3.0625,null,null,null,3.75,6,3.5,5,4.5625,6,1,3.5,6,6.5,6.25,1.5,2,1.75,5.5,4,4.75,4,6,5,3,4,3.5,1,8,4.5,4.4375,6.5,6.5,6.5,1,{"$f":"6+BG26+TS!$P$3","v":7},30.0625,4.2946428571428568,{"$f":"IF('T1'!BJ26=\"\",\"\",'T1'!BJ26)","v":4.2946428571428568},4.2946428571428568,27,"يكرر","تنبيه"]
[{"$f":"IF(TS!A33=\"\",\"\",TS!A33)","v":18},{"$f":"IF(TS!B33=\"\",\"\",TS!B33)","v":"AZ22334472"},{"$f":"IF(TS!C33=\"\",\"\",TS!C33)","v":"آدم النسب18"},{"$f":"IF(TS!G33=\"\",\"\",TS!G33)","v":"2012-05-25"},{"$f":"IF(TS!D33=\"\",\"\",TS!D33)","v":"ذ"},{"$f":"IF(TS!F33=\"\",\"\",TS!F33)","v":1417},6.5,9,7.75,7,8.75,7.875,7,6.5,6.75,6.75,6.75,6.75,6.5,6.75,6.625,6.5,6.75,6.625,7.0625,null,null,null,8.25,7,7.25,6.5,7.25,5.25,7,6.125,6,7,6.5,3.75,4.5,4.125,8,6,7,6.75,6.5,6.625,4,5,4.5,7,9,8,6.53125,7,7,7,1,{"$f":"6+BG27+TS!$P$3","v":7},44.59375,6.3705357142857144,{"$f":"IF('T1'!BJ27=\"\",\"\",'T1'!BJ27)","v":6.3705357142857144},6.3705357142857144,13,"ينتقل","لوحة الشرف"]
[{"$f":"IF(TS!A34=\"\",\"\",TS!A34)","v":19},{"$f":"IF(TS!B34=\"\",\"\",TS!B34)","v":"AZ22334473"},{"$f":"IF(TS!C34=\"\",\"\",TS!C34)","v":"مريم النسب19"},{"$f":"IF(TS!G34=\"\",\"\",TS!G34)","v":"2012-11-10"},{"$f":"IF(TS!D34=\"\",\"\",TS!D34)","v":"أ"},{"$f":"IF(TS!F34=\"\",\"\",TS!F34)","v":1418},7.5,9,8.25,8.75,8.75,8.75,9,8.75,8.875,8.75,9,8.875,7,8.75,7.875,8.5,9,8.75,8.5625,null,null,null,9,9,9,9,9,5.5,7.5,6.5,6,8.25,7.125,9,8,8.5,8.5,7,7.75,8.5,7.5,8,6,6.5,6.25,4,8,6,7,8,8,8,1,{"$f":"6+BG28+TS!$P$3","v":7},54.6875,7.8125,{"$f":"IF('T1'!BJ28=\"\",\"\",'T1'!BJ28)","v":7.8125},7.8125,5,"ينتقل","تشجيع"]
[{"$f":"IF(TS!A35=\"\",\"\",TS!A35)","v":20},{"$f":"IF(TS!B35=\"\",\"\",TS!B35)","v":"AZ22334474"},{"$f":"IF(TS!C35=\"\",\"\",TS!C35)","v":"راضية النسب20"},{"$f":"IF(TS!G35=\"\",\"\",TS!G35)","v":"2012-05-06"},{"$f":"IF(TS!D35=\"\",\"\",TS!D35)","v":"أ"},{"$f":"IF(TS!F35=\"\",\"\",TS!F35)","v":1419},1,1,1,1,1,1,1,1,1,1,1,1,1,1,1,1,1,1,1,null,null,null,1.5,1,4,2,2.125,1.5,1,1.25,5,4,4.5,1,1,1,3,1,2,1,4,2.5,1,1,1,1,1,1,1.625,6,7,6.5,1,{"$f":"6+BG29+TS!$P$3","v":7},18,2.5714285714285716,{"$f":"IF('T1'!BJ29=\"\",\"\",'T1'!BJ29)","v":2.5714285714285716},2.5714285714285716,29,"يكرر","توبيخ"]
[{"$f":"IF(TS!A36=\"\",\"\",TS!A36)","v":21},{"$f":"IF(TS!B36=\"\",\"\",TS!B36)","v":"AZ22334475"},{"$f":"IF(TS!C36=\"\",\"\",TS!C36)","v":"ريان النسب21"},{"$f":"IF(TS!G36=\"\",\"\",TS!G36)","v":"2012-09-07"},{"$f":"IF(TS!D36=\"\",\"\",TS!D36)","v":"ذ"},{"$f":"IF(TS!F36=\"\",\"\",TS!F36)","v":1420},7,9,8,7.75,8.5,8.125,4.5,6,5.25,8,6.5,7.25,6,7,6.5,8.5,7,7.75,7.145833333333333,null,null,null,8.5,9,7.5,8,8.25,8,6.25,7.125,7,8,7.5,5,8,6.5,8.75,6,7.375,8.5,6.75,7.625,6,5,5.5,8,9,8.5,7.25,7.5,7.5,7.5,1,{"$f":"6+BG30+TS!$P$3","v":7},51.270833333333336,7.3244047619047619,{"$f":"IF('T1'!BJ30=\"\",\"\",'T1'!BJ30)","v":7.3244047619047619},7.3244047619047619,11,"ينتقل","تشجيع"]
[{"$f":"IF(TS!A37=\"\",\"\",TS!A37)","v":22},{"$f":"IF(TS!B37=\"\",\"\",TS!B37)","v":"AZ22334476"},{"$f":"IF(TS!C37=\"\",\"\",TS!C37)","v":"أيمن النسب22"},{"$f":"IF(TS!G37=\"\",\"\",TS!G37)","v":"2013-02-26"},{"$f":"IF(TS!D37=\"\",\"\",TS!D37)","v":"ذ"},{"$f":"IF(TS!F37=\"\",\"\",TS!F37)","v":1421},6,7,6.5,5.5,7,6.25,1,2.5,1.75,6.5,8,7.25,6,6,6,6,9,7.5,5.875,null,null,null,8,7,7.5,6.5,7.25,4,2.75,3.375,5,7.5,6.25,4,6.25,5.125,8.5,4,6.25,7,6,6.5,5.5,4,4.75,8,1,4.5,5.5,7,7,7,1,{"$f":"6+BG31+TS!$P$3","v":7},40.375,5.7678571428571432,{"$f":"IF('T1'!BJ31=\"\",\"\",'T1'!BJ31)","v":5.7678571428571432},5.7678571428571432,21,"ينتقل","متوسط"]
[{"$f":"IF(TS!A38=\"\",\"\",TS!A38)","v":23},{"$f":"IF(TS!B38=\"\",\"\",TS!B38)","v":"AZ22334477"},{"$f":"IF(TS!C38=\"\",\"\",TS!C38)","v":"ملاك النسب23"},{"$f":"IF(TS!G38=\"\",\"\",TS!G38)","v":"2013-03-21"},{"$f":"IF(TS!D38=\"\",\"\",TS!D38)","v":"أ"},{"$f":"IF(TS!F38=\"\",\"\",TS!F38)","v":1422},6,4,5,3,4,3.5,1,6.5,3.75,6.5,6,6.25,3,6,4.5,7.5,7.5,7.5,5.083333333333333,null,null,null,8,8,4.5,6,6.625,5,4.5,4.75,5,7,6,4.5,3.5,4,8.5,5,6.75,8.5,8.5,8.5,4,4.5,4.25,8,7,7.5,6.75,7,7,7,1,{"$f":"6+BG32+TS!$P$3","v":7},40.208333333333336,5.7440476190476195,{"$f":"IF('T1'!BJ32=\"\",\"\",'T1'!BJ32)","v":5.7440476190476195},5.7440476190476195,22,"ينتقل","متوسط"]
[{"$f":"IF(TS!A39=\"\",\"\",TS!A39)","v":24},{"$f":"IF(TS!B39=\"\",\"\",TS!B39)","v":"AZ22334478"},{"$f":"IF(TS!C39=\"\",\"\",TS!C39)","v":"مريم النسب24"},{"$f":"IF(TS!G39=\"\",\"\",TS!G39)","v":"2013-02-25"},{"$f":"IF(TS!D39=\"\",\"\",TS!D39)","v":"أ"},{"$f":"IF(TS!F39=\"\",\"\",TS!F39)","v":1423},7.5,9,8.25,7,8.5,7.75,4.5,5,4.75,6,6.5,6.25,6,8.75,7.375,6,6.5,6.25,6.770833333333333,null,null,null,8,9,10,9,9,7,9,8,5,8,6.5,10,8.5,9.25,8.5,5.5,7,6,7.5,6.75,6,5,5.5,8,9,8.5,6.9375,7,8,7.5,1,{"$f":"6+BG33+TS!$P$3","v":7},53.958333333333336,7.7083333333333339,{"$f":"IF('T1'!BJ33=\"\",\"\",'T1'!BJ33)","v":7.7083333333333339},7.7083333333333339,7,"ينتقل","تشجيع"]
[{"$f":"IF(TS!A40=\"\",\"\",TS!A40)","v":25},{"$f":"IF(TS!B40=\"\",\"\",TS!B40)","v":"AZ22334479"},{"$f":"IF(TS!C40=\"\",\"\",TS!C40)","v":"أمينة النسب25"},{"$f":"IF(TS!G40=\"\",\"\",TS!G40)","v":"2013-03-27"},{"$f":"IF(TS!D40=\"\",\"\",TS!D40)","v":"أ"},{"$f":"IF(TS!F40=\"\",\"\",TS!F40)","v":1424},6,9,7.5,4,7,5.5,1,3.5,2.25,6,8.5,7.25,5,6.75,5.875,5.5,9,7.25,5.9375,null,null,null,8,7,6,7,7,6,4.5,5.25,6,7.5,6.75,4,5,4.5,8.5,8,8.25,7,6.5,6.75,4.5,4.5,4.5,7,8,7.5,6.75,6.5,7.5,7,1,{"$f":"6+BG34+TS!$P$3","v":7},43.1875,6.1696428571428568,{"$f":"IF('T1'!BJ34=\"\",\"\",'T1'!BJ34)","v":6.1696428571428568},6.1696428571428568,17,"ينتقل","لوحة الشرف"]
[{"$f":"IF(TS!A41=\"\",\"\",TS!A41)","v":26},{"$f":"IF(TS!B41=\"\",\"\",TS!B41)","v":"AZ22334480"},{"$f":"IF(TS!C41=\"\",\"\",TS!C41)","v":"اكرام النسب26"},{"$f":"IF(TS!G41=\"\",\"\",TS!G41)","v":"2012-07-04"},{"$f":"IF(TS!D41=\"\",\"\",TS!D41)","v":"أ"},{"$f":"IF(TS!F41=\"\",\"\",TS!F41)","v":1425},5.5,4,4.75,3,5,4,1,6,3.5,6.25,6.5,6.375,3.5,6,4.75,6.5,6,6.25,4.9375,null,null,null,7,8,7,7,7.25,6,3.5,4.75,6,7,6.5,6,5.25,5.625,3,4,3.5,8,7,7.5,4,4,4,1,8,4.5,4.875,7,7.5,7.25,1,{"$f":"6+BG35+TS!$P$3","v":7},41.1875,5.8839285714285712,{"$f":"IF('T1'!BJ35=\"\",\"\",'T1'!BJ35)","v":5.8839285714285712},5.8839285714285712,18,"ينتقل","متوسط"]
[{"$f":"IF(TS!A42=\"\",\"\",TS!A42)","v":27},{"$f":"IF(TS!B42=\"\",\"\",TS!B42)","v":"AZ22334481"},{"$f":"IF(TS!C42=\"\",\"\",TS!C42)","v":"آية النسب27"},{"$f":"IF(TS!G42=\"\",\"\",TS!G42)","v":"2012-05-15"},{"$f":"IF(TS!D42=\"\",\"\",TS!D42)","v":"أ"},{"$f":"IF(TS!F42=\"\",\"\",TS!F42)","v":1426},5,6,5.5,3,7.5,5.25,3,2.5,2.75,5,6.5,5.75,4.5,6,5.25,5,6.5,5.75,5.041666666666667,null,null,null,7,8,5.5,6.5,6.75,7,3,5,7.5,7.5,7.5,6,7,6.5,5.5,6.5,6,7.5,7,7.25,4.5,5,4.75,8,7.5,7.75,6.4375,6.5,7,6.75,1,{"$f":"6+BG36+TS!$P$3","v":7},43.979166666666664,6.2827380952380949,{"$f":"IF('T1'!BJ36=\"\",\"\",'T1'!BJ36)","v":6.2827380952380949},6.2827380952380949,16,"ينتقل","لوحة الشرف"]
[{"$f":"IF(TS!A43=\"\",\"\",TS!A43)","v":28},{"$f":"IF(TS!B43=\"\",\"\",TS!B43)","v":"AZ22334482"},{"$f":"IF(TS!C43=\"\",\"\",TS!C43)","v":"غفران النسب28"},{"$f":"IF(TS!G43=\"\",\"\",TS!G43)","v":"2012-10-16"},{"$f":"IF(TS!D43=\"\",\"\",TS!D43)","v":"أ"},{"$f":"IF(TS!F43=\"\",\"\",TS!F43)","v":1427},5.5,7,6.25,2,6.5,4.25,1,1,1,5.75,7.5,6.625,6,6.5,6.25,6,7.5,6.75,5.1875,null,null,null,9,6,8.5,7,7.625,5.5,6.25,5.875,6,8,7,6.5,5,5.75,7.5,7,7.25,8,6.5,7.25,4,5,4.5,6,1,3.5,5.625,7,7,7,1,{"$f":"6+BG37+TS!$P$3","v":7},44.0625,6.2946428571428568,{"$f":"IF('T1'!BJ37=\"\",\"\",'T1'!BJ37)","v":6.2946428571428568},6.2946428571428568,15,"ينتقل","لوحة الشرف"]
[{"$f":"IF(TS!A44=\"\",\"\",TS!A44)","v":29},{"$f":"IF(TS!B44=\"\",\"\",TS!B44)","v":"AZ22334483"},{"$f":"IF(TS!C44=\"\",\"\",TS!C44)","v":"أميرة  النسب29"},{"$f":"IF(TS!G44=\"\",\"\",TS!G44)","v":"2012-08-11"},{"$f":"IF(TS!D44=\"\",\"\",TS!D44)","v":"أ"},{"$f":"IF(TS!F44=\"\",\"\",TS!F44)","v":1428},8,9,8.5,8.5,8.75,8.625,8.75,7.5,8.125,8.5,8,8.25,7.25,9,8.125,8.75,9,8.875,8.4166666666666661,null,null,null,7.5,9,8.5,9,8.5,9,7.5,8.25,8,8,8,8.5,6.25,7.375,9,7,8,8.5,8.5,8.5,5,7,6,8,9,8.5,7.75,8,8,8,1,{"$f":"6+BG38+TS!$P$3","v":7},56.291666666666664,8.0416666666666661,{"$f":"IF('T1'!BJ38=\"\",\"\",'T1'!BJ38)","v":8.0416666666666661},8.0416666666666661,2,"ينتقل","تنويه"]
[{"$f":"IF(TS!A45=\"\",\"\",TS!A45)","v":""},{"$f":"IF(TS!B45=\"\",\"\",TS!B45)","v":""},{"$f":"IF(TS!C45=\"\",\"\",TS!C45)","v":""},{"$f":"IF(TS!G45=\"\",\"\",TS!G45)","v":""},{"$f":"IF(TS!D45=\"\",\"\",TS!D45)","v":""},{"$f":"IF(TS!F45=\"\",\"\",TS!F45)","v":""},null,null,"",null,null,"",null,null,"",null,null,"",null,null,"",null,null,"","",null,null,null,null,null,null,null,"",null,null,"",null,null,"",null,null,"",null,null,"",null,null,"",null,null,"",null,null,"","",null,null,"",null,null,null,"",{"$f":"IF('T1'!BJ39=\"\",\"\",'T1'!BJ39)","v":""},null,"",null,""]
[{"$f":"IF(TS!A46=\"\",\"\",TS!A46)","v":""},{"$f":"IF(TS!B46=\"\",\"\",TS!B46)","v":""},{"$f":"IF(TS!C46=\"\",\"\",TS!C46)","v":""},{"$f":"IF(TS!G46=\"\",\"\",TS!G46)","v":""},{"$f":"IF(TS!D46=\"\",\"\",TS!D46)","v":""},{"$f":"IF(TS!F46=\"\",\"\",TS!F46)","v":""},null,null,"",null,null,"",null,null,"",null,null,"",null,null,"",null,null,"","",null,null,null,null,null,null,null,"",null,null,"",null,null,"",null,null,"",null,null,"",null,null,"",null,null,"",null,null,"","",null,null,"",null,null,null,"",{"$f":"IF('T1'!BJ40=\"\",\"\",'T1'!BJ40)","v":""},null,"",null,""]
[{"$f":"IF(TS!A47=\"\",\"\",TS!A47)","v":""},{"$f":"IF(TS!B47=\"\",\"\",TS!B47)","v":""},{"$f":"IF(TS!C47=\"\",\"\",TS!C47)","v":""},{"$f":"IF(TS!G47=\"\",\"\",TS!G47)","v":""},{"$f":"IF(TS!D47=\"\",\"\",TS!D47)","v":""},{"$f":"IF(TS!F47=\"\",\"\",TS!F47)","v":""},null,null,"",null,null,"",null,null,"",null,null,"",null,null,"",null,null,"","",null,null,null,null,null,null,null,"",null,null,"",null,null,"",null,null,"",null,null,"",null,null,"",null,null,"",null,null,"","",null,null,"",null,null,null,"",{"$f":"IF('T1'!BJ41=\"\",\"\",'T1'!BJ41)","v":""},null,"",null,""]
[{"$f":"IF(TS!A48=\"\",\"\",TS!A48)","v":""},{"$f":"IF(TS!B48=\"\",\"\",TS!B48)","v":""},{"$f":"IF(TS!C48=\"\",\"\",TS!C48)","v":""},{"$f":"IF(TS!G48=\"\",\"\",TS!G48)","v":""},{"$f":"IF(TS!D48=\"\",\"\",TS!D48)","v":""},{"$f":"IF(TS!F48=\"\",\"\",TS!F48)","v":""},null,null,"",null,null,"",null,null,"",null,null,"",null,null,"",null,null,"","",null,null,null,null,null,null,null,"",null,null,"",null,null,"",null,null,"",null,null,"",null,null,"",null,null,"",null,null,"","",null,null,"",null,null,null,"",{"$f":"IF('T1'!BJ42=\"\",\"\",'T1'!BJ42)","v":""},null,"",null,""]
[{"$f":"IF(TS!A49=\"\",\"\",TS!A49)","v":""},{"$f":"IF(TS!B49=\"\",\"\",TS!B49)","v":""},{"$f":"IF(TS!C49=\"\",\"\",TS!C49)","v":""},{"$f":"IF(TS!G49=\"\",\"\",TS!G49)","v":""},{"$f":"IF(TS!D49=\"\",\"\",TS!D49)","v":""},{"$f":"IF(TS!F49=\"\",\"\",TS!F49)","v":""},null,null,"",null,null,"",null,null,"",null,null,"",null,null,"",null,null,"","",null,null,null,null,null,null,null,"",null,null,"",null,null,"",null,null,"",null,null,"",null,null,"",null,null,"",null,null,"","",null,null,"",null,null,null,"",{"$f":"IF('T1'!BJ43=\"\",\"\",'T1'!BJ43)","v":""},null,"",null,""]
[{"$f":"IF(TS!A50=\"\",\"\",TS!A50)","v":""},{"$f":"IF(TS!B50=\"\",\"\",TS!B50)","v":""},{"$f":"IF(TS!C50=\"\",\"\",TS!C50)","v":""},{"$f":"IF(TS!G50=\"\",\"\",TS!G50)","v":""},{"$f":"IF(TS!D50=\"\",\"\",TS!D50)","v":""},{"$f":"IF(TS!F50=\"\",\"\",TS!F50)","v":""},null,null,"",null,null,"",null,null,"",null,null,"",null,null,"",null,null,"","",null,null,null,null,null,null,null,"",null,null,"",null,null,"",null,null,"",null,null,"",null,null,"",null,null,"",null,null,"","",null,null,"",null,null,null,"",{"$f":"IF('T1'!BJ44=\"\",\"\",'T1'!BJ44)","v":""},null,"",null,""]
[{"$f":"IF(TS!A51=\"\",\"\",TS!A51)","v":""},{"$f":"IF(TS!B51=\"\",\"\",TS!B51)","v":""},{"$f":"IF(TS!C51=\"\",\"\",TS!C51)","v":""},{"$f":"IF(TS!G51=\"\",\"\",TS!G51)","v":""},{"$f":"IF(TS!D51=\"\",\"\",TS!D51)","v":""},{"$f":"IF(TS!F51=\"\",\"\",TS!F51)","v":""},null,null,"",null,null,"",null,null,"",null,null,"",null,null,"",null,null,"","",null,null,null,null,null,null,null,"",null,null,"",null,null,"",null,null,"",null,null,"",null,null,"",null,null,"",null,null,"","",null,null,"",null,null,null,"",{"$f":"IF('T1'!BJ45=\"\",\"\",'T1'!BJ45)","v":""},null,"",null,""]
[{"$f":"IF(TS!A52=\"\",\"\",TS!A52)","v":""},{"$f":"IF(TS!B52=\"\",\"\",TS!B52)","v":""},{"$f":"IF(TS!C52=\"\",\"\",TS!C52)","v":""},{"$f":"IF(TS!G52=\"\",\"\",TS!G52)","v":""},{"$f":"IF(TS!D52=\"\",\"\",TS!D52)","v":""},{"$f":"IF(TS!F52=\"\",\"\",TS!F52)","v":""},null,null,"",null,null,"",null,null,"",null,null,"",null,null,"",null,null,"","",null,null,null,null,null,null,null,"",null,null,"",null,null,"",null,null,"",null,null,"",null,null,"",null,null,"",null,null,"","",null,null,"",null,null,null,"",{"$f":"IF('T1'!BJ46=\"\",\"\",'T1'!BJ46)","v":""},null,"",null,""]
[{"$f":"IF(TS!A53=\"\",\"\",TS!A53)","v":""},{"$f":"IF(TS!B53=\"\",\"\",TS!B53)","v":""},{"$f":"IF(TS!C53=\"\",\"\",TS!C53)","v":""},{"$f":"IF(TS!G53=\"\",\"\",TS!G53)","v":""},{"$f":"IF(TS!D53=\"\",\"\",TS!D53)","v":""},{"$f":"IF(TS!F53=\"\",\"\",TS!F53)","v":""},null,null,"",null,null,"",null,null,"",null,null,"",null,null,"",null,null,"","",null,null,null,null,null,null,null,"",null,null,"",null,null,"",null,null,"",null,null,"",null,null,"",null,null,"",null,null,"","",null,null,"",null,null,null,"",{"$f":"IF('T1'!BJ47=\"\",\"\",'T1'!BJ47)","v":""},null,"",null,""]
[{"$f":"IF(TS!A54=\"\",\"\",TS!A54)","v":""},{"$f":"IF(TS!B54=\"\",\"\",TS!B54)","v":""},{"$f":"IF(TS!C54=\"\",\"\",TS!C54)","v":""},{"$f":"IF(TS!G54=\"\",\"\",TS!G54)","v":""},{"$f":"IF(TS!D54=\"\",\"\",TS!D54)","v":""},{"$f":"IF(TS!F54=\"\",\"\",TS!F54)","v":""},null,null,"",null,null,"",null,null,"",null,null,"",null,null,"",null,null,"","",null,null,null,null,null,null,null,"",null,null,"",null,null,"",null,null,"",null,null,"",null,null,"",null,null,"",null,null,"","",null,null,"",null,null,null,"",{"$f":"IF('T1'!BJ48=\"\",\"\",'T1'!BJ48)","v":""},null,"",null,""]
[{"$f":"IF(TS!A55=\"\",\"\",TS!A55)","v":""},{"$f":"IF(TS!B55=\"\",\"\",TS!B55)","v":""},{"$f":"IF(TS!C55=\"\",\"\",TS!C55)","v":""},{"$f":"IF(TS!G55=\"\",\"\",TS!G55)","v":""},{"$f":"IF(TS!D55=\"\",\"\",TS!D55)","v":""},{"$f":"IF(TS!F55=\"\",\"\",TS!F55)","v":""},null,null,"",null,null,"",null,null,"",null,null,"",null,null,"",null,null,"","",null,null,null,null,null,null,null,"",null,null,"",null,null,"",null,null,"",null,null,"",null,null,"",null,null,"",null,null,"","",null,null,"",null,null,null,"",{"$f":"IF('T1'!BJ49=\"\",\"\",'T1'!BJ49)","v":""},null,"",null,""]
[{"$f":"IF(TS!A56=\"\",\"\",TS!A56)","v":""},{"$f":"IF(TS!B56=\"\",\"\",TS!B56)","v":""},{"$f":"IF(TS!C56=\"\",\"\",TS!C56)","v":""},{"$f":"IF(TS!G56=\"\",\"\",TS!G56)","v":""},{"$f":"IF(TS!D56=\"\",\"\",TS!D56)","v":""},{"$f":"IF(TS!F56=\"\",\"\",TS!F56)","v":""},null,null,"",null,null,"",null,null,"",null,null,"",null,null,"",null,null,"","",null,null,null,null,null,null,null,"",null,null,"",null,null,"",null,null,"",null,null,"",null,null,"",null,null,"",null,null,"","",null,null,"",null,null,null,"",{"$f":"IF('T1'!BJ50=\"\",\"\",'T1'!BJ50)","v":""},null,"",null,""]
[{"$f":"IF(TS!A57=\"\",\"\",TS!A57)","v":""},{"$f":"IF(TS!B57=\"\",\"\",TS!B57)","v":""},{"$f":"IF(TS!C57=\"\",\"\",TS!C57)","v":""},{"$f":"IF(TS!G57=\"\",\"\",TS!G57)","v":""},{"$f":"IF(TS!D57=\"\",\"\",TS!D57)","v":""},{"$f":"IF(TS!F57=\"\",\"\",TS!F57)","v":""},null,null,"",null,null,"",null,null,"",null,null,"",null,null,"",null,null,"","",null,null,null,null,null,null,null,"",null,null,"",null,null,"",null,null,"",null,null,"",null,null,"",null,null,"",null,null,"","",null,null,"",null,null,null,"",{"$f":"IF('T1'!BJ51=\"\",\"\",'T1'!BJ51)","v":""},null,"",null,""]
[{"$f":"IF(TS!A58=\"\",\"\",TS!A58)","v":""},{"$f":"IF(TS!B58=\"\",\"\",TS!B58)","v":""},{"$f":"IF(TS!C58=\"\",\"\",TS!C58)","v":""},{"$f":"IF(TS!G58=\"\",\"\",TS!G58)","v":""},{"$f":"IF(TS!D58=\"\",\"\",TS!D58)","v":""},{"$f":"IF(TS!F58=\"\",\"\",TS!F58)","v":""},null,null,"",null,null,"",null,null,"",null,null,"",null,null,"",null,null,"","",null,null,null,null,null,null,null,"",null,null,"",null,null,"",null,null,"",null,null,"",null,null,"",null,null,"",null,null,"","",null,null,"",null,null,null,"",{"$f":"IF('T1'!BJ52=\"\",\"\",'T1'!BJ52)","v":""},null,"",null,""]
[{"$f":"IF(TS!A59=\"\",\"\",TS!A59)","v":""},{"$f":"IF(TS!B59=\"\",\"\",TS!B59)","v":""},{"$f":"IF(TS!C59=\"\",\"\",TS!C59)","v":""},{"$f":"IF(TS!G59=\"\",\"\",TS!G59)","v":""},{"$f":"IF(TS!D59=\"\",\"\",TS!D59)","v":""},{"$f":"IF(TS!F59=\"\",\"\",TS!F59)","v":""},null,null,"",null,null,"",null,null,"",null,null,"",null,null,"",null,null,"","",null,null,null,null,null,null,null,"",null,null,"",null,null,"",null,null,"",null,null,"",null,null,"",null,null,"",null,null,"","",null,null,"",null,null,null,"",{"$f":"IF('T1'!BJ53=\"\",\"\",'T1'!BJ53)","v":""},null,"",null,""]
[{"$f":"IF(TS!A60=\"\",\"\",TS!A60)","v":""},{"$f":"IF(TS!B60=\"\",\"\",TS!B60)","v":""},{"$f":"IF(TS!C60=\"\",\"\",TS!C60)","v":""},{"$f":"IF(TS!G60=\"\",\"\",TS!G60)","v":""},{"$f":"IF(TS!D60=\"\",\"\",TS!D60)","v":""},{"$f":"IF(TS!F60=\"\",\"\",TS!F60)","v":""},null,null,"",null,null,"",null,null,"",null,null,"",null,null,"",null,null,"","",null,null,null,null,null,null,null,"",null,null,"",null,null,"",null,null,"",null,null,"",null,null,"",null,null,"",null,null,"","",null,null,"",null,null,null,"",{"$f":"IF('T1'!BJ54=\"\",\"\",'T1'!BJ54)","v":""},null,"",null,""]
[{"$f":"IF(TS!A61=\"\",\"\",TS!A61)","v":""},{"$f":"IF(TS!B61=\"\",\"\",TS!B61)","v":""},{"$f":"IF(TS!C61=\"\",\"\",TS!C61)","v":""},{"$f":"IF(TS!G61=\"\",\"\",TS!G61)","v":""},{"$f":"IF(TS!D61=\"\",\"\",TS!D61)","v":""},{"$f":"IF(TS!F61=\"\",\"\",TS!F61)","v":""},null,null,"",null,null,"",null,null,"",null,null,"",null,null,"",null,null,"","",null,null,null,null,null,null,null,"",null,null,"",null,null,"",null,null,"",null,null,"",null,null,"",null,null,"",null,null,"","",null,null,"",null,null,null,"",{"$f":"IF('T1'!BJ55=\"\",\"\",'T1'!BJ55)","v":""},null,"",null,""]
[{"$f":"IF(TS!A62=\"\",\"\",TS!A62)","v":""},{"$f":"IF(TS!B62=\"\",\"\",TS!B62)","v":""},{"$f":"IF(TS!C62=\"\",\"\",TS!C62)","v":""},{"$f":"IF(TS!G62=\"\",\"\",TS!G62)","v":""},{"$f":"IF(TS!D62=\"\",\"\",TS!D62)","v":""},{"$f":"IF(TS!F62=\"\",\"\",TS!F62)","v":""},null,null,"",null,null,"",null,null,"",null,null,"",null,null,"",null,null,"","",null,null,null,null,null,null,null,"",null,null,"",null,null,"",null,null,"",null,null,"",null,null,"",null,null,"",null,null,"","",null,null,"",null,null,null,"",{"$f":"IF('T1'!BJ56=\"\",\"\",'T1'!BJ56)","v":""},null,"",null,""]
[{"$f":"IF(TS!A63=\"\",\"\",TS!A63)","v":""},{"$f":"IF(TS!B63=\"\",\"\",TS!B63)","v":""},{"$f":"IF(TS!C63=\"\",\"\",TS!C63)","v":""},{"$f":"IF(TS!G63=\"\",\"\",TS!G63)","v":""},{"$f":"IF(TS!D63=\"\",\"\",TS!D63)","v":""},{"$f":"IF(TS!F63=\"\",\"\",TS!F63)","v":""},null,null,"",null,null,"",null,null,"",null,null,"",null,null,"",null,null,"","",null,null,null,null,null,null,null,"",null,null,"",null,null,"",null,null,"",null,null,"",null,null,"",null,null,"",null,null,"","",null,null,"",null,null,null,"",{"$f":"IF('T1'!BJ57=\"\",\"\",'T1'!BJ57)","v":""},null,"",null,""]
[{"$f":"IF(TS!A64=\"\",\"\",TS!A64)","v":""},{"$f":"IF(TS!B64=\"\",\"\",TS!B64)","v":""},{"$f":"IF(TS!C64=\"\",\"\",TS!C64)","v":""},{"$f":"IF(TS!G64=\"\",\"\",TS!G64)","v":""},{"$f":"IF(TS!D64=\"\",\"\",TS!D64)","v":""},{"$f":"IF(TS!F64=\"\",\"\",TS!F64)","v":""},null,null,"",null,null,"",null,null,"",null,null,"",null,null,"",null,null,"","",null,null,null,null,null,null,null,"",null,null,"",null,null,"",null,null,"",null,null,"",null,null,"",null,null,"",null,null,"","",null,null,"",null,null,null,"",{"$f":"IF('T1'!BJ58=\"\",\"\",'T1'!BJ58)","v":""},null,"",null,""]
[{"$f":"IF(TS!A65=\"\",\"\",TS!A65)","v":""},{"$f":"IF(TS!B65=\"\",\"\",TS!B65)","v":""},{"$f":"IF(TS!C65=\"\",\"\",TS!C65)","v":""},{"$f":"IF(TS!G65=\"\",\"\",TS!G65)","v":""},{"$f":"IF(TS!D65=\"\",\"\",TS!D65)","v":""},{"$f":"IF(TS!F65=\"\",\"\",TS!F65)","v":""},null,null,"",null,null,"",null,null,"",null,null,"",null,null,"",null,null,"","",null,null,null,null,null,null,null,"",null,null,"",null,null,"",null,null,"",null,null,"",null,null,"",null,null,"",null,null,"","",null,null,"",null,null,null,"",{"$f":"IF('T1'!BJ59=\"\",\"\",'T1'!BJ59)","v":""},null,"",null,""]
[{"$f":"IF(TS!A66=\"\",\"\",TS!A66)","v":""},{"$f":"IF(TS!B66=\"\",\"\",TS!B66)","v":""},{"$f":"IF(TS!C66=\"\",\"\",TS!C66)","v":""},{"$f":"IF(TS!G66=\"\",\"\",TS!G66)","v":""},{"$f":"IF(TS!D66=\"\",\"\",TS!D66)","v":""},{"$f":"IF(TS!F66=\"\",\"\",TS!F66)","v":""},null,null,"",null,null,"",null,null,"",null,null,"",null,null,"",null,null,"","",null,null,null,null,null,null,null,"",null,null,"",null,null,"",null,null,"",null,null,"",null,null,"",null,null,"",null,null,"","",null,null,"",null,null,null,"",{"$f":"IF('T1'!BJ60=\"\",\"\",'T1'!BJ60)","v":""},null,"",null,""]
[{"$f":"IF(TS!A67=\"\",\"\",TS!A67)","v":""},{"$f":"IF(TS!B67=\"\",\"\",TS!B67)","v":""},{"$f":"IF(TS!C67=\"\",\"\",TS!C67)","v":""},{"$f":"IF(TS!G67=\"\",\"\",TS!G67)","v":""},{"$f":"IF(TS!D67=\"\",\"\",TS!D67)","v":""},{"$f":"IF(TS!F67=\"\",\"\",TS!F67)","v":""},null,null,"",null,null,"",null,null,"",null,null,"",null,null,"",null,null,"","",null,null,null,null,null,null,null,"",null,null,"",null,null,"",null,null,"",null,null,"",null,null,"",null,null,"",null,null,"","",null,null,"",null,null,null,"",{"$f":"IF('T1'!BJ61=\"\",\"\",'T1'!BJ61)","v":""},null,"",null,""]
[{"$f":"IF(TS!A68=\"\",\"\",TS!A68)","v":""},{"$f":"IF(TS!B68=\"\",\"\",TS!B68)","v":""},{"$f":"IF(TS!C68=\"\",\"\",TS!C68)","v":""},{"$f":"IF(TS!G68=\"\",\"\",TS!G68)","v":""},{"$f":"IF(TS!D68=\"\",\"\",TS!D68)","v":""},{"$f":"IF(TS!F68=\"\",\"\",TS!F68)","v":""},null,null,"",null,null,"",null,null,"",null,null,"",null,null,"",null,null,"","",null,null,null,null,null,null,null,"",null,null,"",null,null,"",null,null,"",null,null,"",null,null,"",null,null,"",null,null,"","",null,null,"",null,null,null,"",{"$f":"IF('T1'!BJ62=\"\",\"\",'T1'!BJ62)","v":""},null,"",null,""]
[{"$f":"IF(TS!A69=\"\",\"\",TS!A69)","v":""},{"$f":"IF(TS!B69=\"\",\"\",TS!B69)","v":""},{"$f":"IF(TS!C69=\"\",\"\",TS!C69)","v":""},{"$f":"IF(TS!G69=\"\",\"\",TS!G69)","v":""},{"$f":"IF(TS!D69=\"\",\"\",TS!D69)","v":""},{"$f":"IF(TS!F69=\"\",\"\",TS!F69)","v":""},null,null,"",null,null,"",null,null,"",null,null,"",null,null,"",null,null,"","",null,null,null,null,null,null,null,"",null,null,"",null,null,"",null,null,"",null,null,"",null,null,"",null,null,"",null,null,"","",null,null,"",null,null,null,"",{"$f":"IF('T1'!BJ63=\"\",\"\",'T1'!BJ63)","v":""},null,"",null,""]
[{"$f":"IF(TS!A70=\"\",\"\",TS!A70)","v":""},{"$f":"IF(TS!B70=\"\",\"\",TS!B70)","v":""},{"$f":"IF(TS!C70=\"\",\"\",TS!C70)","v":""},{"$f":"IF(TS!G70=\"\",\"\",TS!G70)","v":""},{"$f":"IF(TS!D70=\"\",\"\",TS!D70)","v":""},{"$f":"IF(TS!F70=\"\",\"\",TS!F70)","v":""},null,null,"",null,null,"",null,null,"",null,null,"",null,null,"",null,null,"","",null,null,null,null,null,null,null,"",null,null,"",null,null,"",null,null,"",null,null,"",null,null,"",null,null,"",null,null,"","",null,null,"",null,null,null,"",{"$f":"IF('T1'!BJ64=\"\",\"\",'T1'!BJ64)","v":""},null,"",null,""]
[{"$f":"IF(TS!A71=\"\",\"\",TS!A71)","v":""},{"$f":"IF(TS!B71=\"\",\"\",TS!B71)","v":""},{"$f":"IF(TS!C71=\"\",\"\",TS!C71)","v":""},{"$f":"IF(TS!G71=\"\",\"\",TS!G71)","v":""},{"$f":"IF(TS!D71=\"\",\"\",TS!D71)","v":""},{"$f":"IF(TS!F71=\"\",\"\",TS!F71)","v":""},null,null,"",null,null,"",null,null,"",null,null,"",null,null,"",null,null,"","",null,null,null,null,null,null,null,"",null,null,"",null,null,"",null,null,"",null,null,"",null,null,"",null,null,"",null,null,"","",null,null,"",null,null,null,"",{"$f":"IF('T1'!BJ65=\"\",\"\",'T1'!BJ65)","v":""},null,"",null,""]
[{"$f":"IF(TS!A72=\"\",\"\",TS!A72)","v":""},{"$f":"IF(TS!B72=\"\",\"\",TS!B72)","v":""},{"$f":"IF(TS!C72=\"\",\"\",TS!C72)","v":""},{"$f":"IF(TS!G72=\"\",\"\",TS!G72)","v":""},{"$f":"IF(TS!D72=\"\",\"\",TS!D72)","v":""},{"$f":"IF(TS!F72=\"\",\"\",TS!F72)","v":""},null,null,"",null,null,"",null,null,"",null,null,"",null,null,"",null,null,"","",null,null,null,null,null,null,null,"",null,null,"",null,null,"",null,null,"",null,null,"",null,null,"",null,null,"",null,null,"","",null,null,"",null,null,null,"",{"$f":"IF('T1'!BJ66=\"\",\"\",'T1'!BJ66)","v":""},null,"",null,""]
[{"$f":"IF(TS!A73=\"\",\"\",TS!A73)","v":""},{"$f":"IF(TS!B73=\"\",\"\",TS!B73)","v":""},{"$f":"IF(TS!C73=\"\",\"\",TS!C73)","v":""},{"$f":"IF(TS!G73=\"\",\"\",TS!G73)","v":""},{"$f":"IF(TS!D73=\"\",\"\",TS!D73)","v":""},{"$f":"IF(TS!F73=\"\",\"\",TS!F73)","v":""},null,null,"",null,null,"",null,null,"",null,null,"",null,null,"",null,null,"","",null,null,null,null,null,null,null,"",null,null,"",null,null,"",null,null,"",null,null,"",null,null,"",null,null,"",null,null,"","",null,null,"",null,null,null,"",{"$f":"IF('T1'!BJ67=\"\",\"\",'T1'!BJ67)","v":""},null,"",null,""]
[{"$f":"IF(TS!A74=\"\",\"\",TS!A74)","v":""},{"$f":"IF(TS!B74=\"\",\"\",TS!B74)","v":""},{"$f":"IF(TS!C74=\"\",\"\",TS!C74)","v":""},{"$f":"IF(TS!G74=\"\",\"\",TS!G74)","v":""},{"$f":"IF(TS!D74=\"\",\"\",TS!D74)","v":""},{"$f":"IF(TS!F74=\"\",\"\",TS!F74)","v":""},null,null,"",null,null,"",null,null,"",null,null,"",null,null,"",null,null,"","",null,null,null,null,null,null,null,"",null,null,"",null,null,"",null,null,"",null,null,"",null,null,"",null,null,"",null,null,"","",null,null,"",null,null,null,"",{"$f":"IF('T1'!BJ68=\"\",\"\",'T1'!BJ68)","v":""},null,"",null,""]
[{"$f":"IF(TS!A75=\"\",\"\",TS!A75)","v":""},{"$f":"IF(TS!B75=\"\",\"\",TS!B75)","v":""},{"$f":"IF(TS!C75=\"\",\"\",TS!C75)","v":""},{"$f":"IF(TS!G75=\"\",\"\",TS!G75)","v":""},{"$f":"IF(TS!D75=\"\",\"\",TS!D75)","v":""},{"$f":"IF(TS!F75=\"\",\"\",TS!F75)","v":""},null,null,"",null,null,"",null,null,"",null,null,"",null,null,"",null,null,"","",null,null,null,null,null,null,null,"",null,null,"",null,null,"",null,null,"",null,null,"",null,null,"",null,null,"",null,null,"","",null,null,"",null,null,null,"",{"$f":"IF('T1'!BJ69=\"\",\"\",'T1'!BJ69)","v":""},null,"",null,""]
[{"$f":"IF(TS!A76=\"\",\"\",TS!A76)","v":""},{"$f":"IF(TS!B76=\"\",\"\",TS!B76)","v":""},{"$f":"IF(TS!C76=\"\",\"\",TS!C76)","v":""},{"$f":"IF(TS!G76=\"\",\"\",TS!G76)","v":""},{"$f":"IF(TS!D76=\"\",\"\",TS!D76)","v":""},{"$f":"IF(TS!F76=\"\",\"\",TS!F76)","v":""},null,null,"",null,null,"",null,null,"",null,null,"",null,null,"",null,null,"","",null,null,null,null,null,null,null,"",null,null,"",null,null,"",null,null,"",null,null,"",null,null,"",null,null,"",null,null,"","",null,null,"",null,null,null,"",{"$f":"IF('T1'!BJ70=\"\",\"\",'T1'!BJ70)","v":""},null,"",null,""]
[{"$f":"IF(TS!A77=\"\",\"\",TS!A77)","v":""},{"$f":"IF(TS!B77=\"\",\"\",TS!B77)","v":""},{"$f":"IF(TS!C77=\"\",\"\",TS!C77)","v":""},{"$f":"IF(TS!G77=\"\",\"\",TS!G77)","v":""},{"$f":"IF(TS!D77=\"\",\"\",TS!D77)","v":""},{"$f":"IF(TS!F77=\"\",\"\",TS!F77)","v":""},null,null,"",null,null,"",null,null,"",null,null,"",null,null,"",null,null,"","",null,null,null,null,null,null,null,"",null,null,"",null,null,"",null,null,"",null,null,"",null,null,"",null,null,"",null,null,"","",null,null,"",null,null,null,"",{"$f":"IF('T1'!BJ71=\"\",\"\",'T1'!BJ71)","v":""},null,"",null,""]
[{"$f":"IF(TS!A78=\"\",\"\",TS!A78)","v":""},{"$f":"IF(TS!B78=\"\",\"\",TS!B78)","v":""},{"$f":"IF(TS!C78=\"\",\"\",TS!C78)","v":""},{"$f":"IF(TS!G78=\"\",\"\",TS!G78)","v":""},{"$f":"IF(TS!D78=\"\",\"\",TS!D78)","v":""},{"$f":"IF(TS!F78=\"\",\"\",TS!F78)","v":""},null,null,"",null,null,"",null,null,"",null,null,"",null,null,"",null,null,"","",null,null,null,null,null,null,null,"",null,null,"",null,null,"",null,null,"",null,null,"",null,null,"",null,null,"",null,null,"","",null,null,"",null,null,null,"",{"$f":"IF('T1'!BJ72=\"\",\"\",'T1'!BJ72)","v":""},null,"",null,""]
[{"$f":"IF(TS!A79=\"\",\"\",TS!A79)","v":""},{"$f":"IF(TS!B79=\"\",\"\",TS!B79)","v":""},{"$f":"IF(TS!C79=\"\",\"\",TS!C79)","v":""},{"$f":"IF(TS!G79=\"\",\"\",TS!G79)","v":""},{"$f":"IF(TS!D79=\"\",\"\",TS!D79)","v":""},{"$f":"IF(TS!F79=\"\",\"\",TS!F79)","v":""},null,null,"",null,null,"",null,null,"",null,null,"",null,null,"",null,null,"","",null,null,null,null,null,null,null,"",null,null,"",null,null,"",null,null,"",null,null,"",null,null,"",null,null,"",null,null,"","",null,null,"",null,null,null,"",{"$f":"IF('T1'!BJ73=\"\",\"\",'T1'!BJ73)","v":""},null,"",null,""]
[{"$f":"IF(TS!A80=\"\",\"\",TS!A80)","v":""},{"$f":"IF(TS!B80=\"\",\"\",TS!B80)","v":""},{"$f":"IF(TS!C80=\"\",\"\",TS!C80)","v":""},{"$f":"IF(TS!G80=\"\",\"\",TS!G80)","v":""},{"$f":"IF(TS!D80=\"\",\"\",TS!D80)","v":""},{"$f":"IF(TS!F80=\"\",\"\",TS!F80)","v":""},null,null,"",null,null,"",null,null,"",null,null,"",null,null,"",null,null,"","",null,null,null,null,null,null,null,"",null,null,"",null,null,"",null,null,"",null,null,"",null,null,"",null,null,"",null,null,"","",null,null,"",null,null,null,"",{"$f":"IF('T1'!BJ74=\"\",\"\",'T1'!BJ74)","v":""},null,"",null,""]
[{"$f":"IF(TS!A81=\"\",\"\",TS!A81)","v":""},{"$f":"IF(TS!B81=\"\",\"\",TS!B81)","v":""},{"$f":"IF(TS!C81=\"\",\"\",TS!C81)","v":""},{"$f":"IF(TS!G81=\"\",\"\",TS!G81)","v":""},{"$f":"IF(TS!D81=\"\",\"\",TS!D81)","v":""},{"$f":"IF(TS!F81=\"\",\"\",TS!F81)","v":""},null,null,{"$f":"IF(OR(G75=\"\",H75=\"\"),\"\",AVERAGE(G75:H75))","v":""},null,null,{"$f":"IF(OR(J75=\"\",K75=\"\"),\"\",AVERAGE(J75:K75))","v":""},null,null,{"$f":"IF(OR(M75=\"\",N75=\"\"),\"\",AVERAGE(M75:N75))","v":""},null,null,{"$f":"IF(OR(P75=\"\",Q75=\"\"),\"\",AVERAGE(P75:Q75))","v":""},null,null,{"$f":"IF(OR(S75=\"\",T75=\"\"),\"\",AVERAGE(S75:T75))","v":""},null,null,{"$f":"IF(OR(V75=\"\",W75=\"\"),\"\",AVERAGE(V75:W75))","v":""},{"$f":"IF(OR(I75=\"\",L75=\"\",O75=\"\",R75=\"\",U75=\"\",X75=\"\"),\"\",AVERAGE(I75,L75,O75,R75,U75,X75))","v":""},null,null,null,null,null,null,null,{"$f":"IF(OR(AC75=\"\",AD75=\"\",AE75=\"\",AF75=\"\"),\"\",AVERAGE(AC75:AF75))","v":""},null,null,{"$f":"IF(OR(AH75=\"\",AI75=\"\"),\"\",AVERAGE(AH75:AI75))","v":""},null,null,{"$f":"IF(OR(AK75=\"\",AL75=\"\"),\"\",AVERAGE(AK75:AL75))","v":""},null,null,{"$f":"IF(OR(AN75=\"\",AO75=\"\"),\"\",AVERAGE(AN75:AO75))","v":""},null,null,{"$f":"IF(OR(AQ75=\"\",AR75=\"\"),\"\",AVERAGE(AQ75:AR75))","v":""},null,null,{"$f":"IF(OR(AT75=\"\",AU75=\"\"),\"\",AVERAGE(AT75:AU75))","v":""},null,null,{"$f":"IF(OR(AW75=\"\",AX75=\"\"),\"\",AVERAGE(AW75:AX75))","v":""},null,null,{"$f":"IF(OR(AZ75=\"\",BA75=\"\"),\"\",AVERAGE(AZ75:BA75))","v":""},{"$f":"IF(OR(AS75=\"\",AV75=\"\",AY75=\"\",BB75=\"\"),\"\",AVERAGE(AS75,AV75,AY75,BB75))","v":""},null,null,{"$f":"IF(OR(BD75=\"\",BE75=\"\"),\"\",AVERAGE(BD75:BE75))","v":""},null,null,null,{"$f":"IF(B75=\"\",\"\",BI75/BH75)","v":""},{"$f":"IF('T1'!BJ75=\"\",\"\",'T1'!BJ75)","v":""},null,{"$f":"IF(BL75=\"\",\"\",RANK(BL75,$BL$10:$BL$69))","v":""},null,{"$f":"IF(BJ75=\"\",\"\",IF(BJ75>=8,\"تنويه\",IF(BJ75>=7,\"تشجيع\",IF(BJ75>=6,\"لوحة الشرف\",IF(BJ75>=5,\"متوسط\",IF(BJ75>=3,\"تنبيه\",\"توبيخ\"))))))","v":""}]
[{"$f":"IF(TS!A82=\"\",\"\",TS!A82)","v":""},{"$f":"IF(TS!B82=\"\",\"\",TS!B82)","v":""},{"$f":"IF(TS!C82=\"\",\"\",TS!C82)","v":""},{"$f":"IF(TS!G82=\"\",\"\",TS!G82)","v":""},{"$f":"IF(TS!D82=\"\",\"\",TS!D82)","v":""},{"$f":"IF(TS!F82=\"\",\"\",TS!F82)","v":""},null,null,"",null,null,"",null,null,"",null,null,"",null,null,"",null,null,"","",null,null,null,null,null,null,null,"",null,null,"",null,null,"",null,null,"",null,null,"",null,null,"",null,null,"",null,null,"","",null,null,"",null,null,null,"",{"$f":"IF('T1'!BJ76=\"\",\"\",'T1'!BJ76)","v":""},null,"",null,""]
[{"$f":"IF(TS!A83=\"\",\"\",TS!A83)","v":""},{"$f":"IF(TS!B83=\"\",\"\",TS!B83)","v":""},{"$f":"IF(TS!C83=\"\",\"\",TS!C83)","v":""},{"$f":"IF(TS!G83=\"\",\"\",TS!G83)","v":""},{"$f":"IF(TS!D83=\"\",\"\",TS!D83)","v":""},{"$f":"IF(TS!F83=\"\",\"\",TS!F83)","v":""},null,null,"",null,null,"",null,null,"",null,null,"",null,null,"",null,null,"","",null,null,null,null,null,null,null,"",null,null,"",null,null,"",null,null,"",null,null,"",null,null,"",null,null,"",null,null,"","",null,null,"",null,null,null,"",{"$f":"IF('T1'!BJ77=\"\",\"\",'T1'!BJ77)","v":""},null,"",null,""]
[{"$f":"IF(TS!A84=\"\",\"\",TS!A84)","v":""},{"$f":"IF(TS!B84=\"\",\"\",TS!B84)","v":""},{"$f":"IF(TS!C84=\"\",\"\",TS!C84)","v":""},{"$f":"IF(TS!G84=\"\",\"\",TS!G84)","v":""},{"$f":"IF(TS!D84=\"\",\"\",TS!D84)","v":""},{"$f":"IF(TS!F84=\"\",\"\",TS!F84)","v":""},null,null,"",null,null,"",null,null,"",null,null,"",null,null,"",null,null,"","",null,null,null,null,null,null,null,"",null,null,"",null,null,"",null,null,"",null,null,"",null,null,"",null,null,"",null,null,"","",null,null,"",null,null,null,"",{"$f":"IF('T1'!BJ78=\"\",\"\",'T1'!BJ78)","v":""},null,"",null,""]
[{"$f":"IF(TS!A85=\"\",\"\",TS!A85)","v":""},{"$f":"IF(TS!B85=\"\",\"\",TS!B85)","v":""},{"$f":"IF(TS!C85=\"\",\"\",TS!C85)","v":""},{"$f":"IF(TS!G85=\"\",\"\",TS!G85)","v":""},{"$f":"IF(TS!D85=\"\",\"\",TS!D85)","v":""},{"$f":"IF(TS!F85=\"\",\"\",TS!F85)","v":""},null,null,"",null,null,"",null,null,"",null,null,"",null,null,"",null,null,"","",null,null,null,null,null,null,null,"",null,null,"",null,null,"",null,null,"",null,null,"",null,null,"",null,null,"",null,null,"","",null,null,"",null,null,null,"",{"$f":"IF('T1'!BJ79=\"\",\"\",'T1'!BJ79)","v":""},null,"",null,""]
[{"$f":"IF(TS!A86=\"\",\"\",TS!A86)","v":""},{"$f":"IF(TS!B86=\"\",\"\",TS!B86)","v":""},{"$f":"IF(TS!C86=\"\",\"\",TS!C86)","v":""},{"$f":"IF(TS!G86=\"\",\"\",TS!G86)","v":""},{"$f":"IF(TS!D86=\"\",\"\",TS!D86)","v":""},{"$f":"IF(TS!F86=\"\",\"\",TS!F86)","v":""},null,null,"",null,null,"",null,null,"",null,null,"",null,null,"",null,null,"","",null,null,null,null,null,null,null,"",null,null,"",null,null,"",null,null,"",null,null,"",null,null,"",null,null,"",null,null,"","",null,null,"",null,null,null,"",{"$f":"IF('T1'!BJ80=\"\",\"\",'T1'!BJ80)","v":""},null,"",null,""]
[{"$f":"IF(TS!A87=\"\",\"\",TS!A87)","v":""},{"$f":"IF(TS!B87=\"\",\"\",TS!B87)","v":""},{"$f":"IF(TS!C87=\"\",\"\",TS!C87)","v":""},{"$f":"IF(TS!G87=\"\",\"\",TS!G87)","v":""},{"$f":"IF(TS!D87=\"\",\"\",TS!D87)","v":""},{"$f":"IF(TS!F87=\"\",\"\",TS!F87)","v":""},null,null,"",null,null,"",null,null,"",null,null,"",null,null,"",null,null,"","",null,null,null,null,null,null,null,"",null,null,"",null,null,"",null,null,"",null,null,"",null,null,"",null,null,"",null,null,"","",null,null,"",null,null,null,"",{"$f":"IF('T1'!BJ81=\"\",\"\",'T1'!BJ81)","v":""},null,"",null,""]
[{"$f":"IF(TS!A88=\"\",\"\",TS!A88)","v":""},{"$f":"IF(TS!B88=\"\",\"\",TS!B88)","v":""},{"$f":"IF(TS!C88=\"\",\"\",TS!C88)","v":""},{"$f":"IF(TS!G88=\"\",\"\",TS!G88)","v":""},{"$f":"IF(TS!D88=\"\",\"\",TS!D88)","v":""},{"$f":"IF(TS!F88=\"\",\"\",TS!F88)","v":""},null,null,"",null,null,"",null,null,"",null,null,"",null,null,"",null,null,"","",null,null,null,null,null,null,null,"",null,null,"",null,null,"",null,null,"",null,null,"",null,null,"",null,null,"",null,null,"","",null,null,"",null,null,null,"",{"$f":"IF('T1'!BJ82=\"\",\"\",'T1'!BJ82)","v":""},null,"",null,""]
[{"$f":"IF(TS!A89=\"\",\"\",TS!A89)","v":""},{"$f":"IF(TS!B89=\"\",\"\",TS!B89)","v":""},{"$f":"IF(TS!C89=\"\",\"\",TS!C89)","v":""},{"$f":"IF(TS!G89=\"\",\"\",TS!G89)","v":""},{"$f":"IF(TS!D89=\"\",\"\",TS!D89)","v":""},{"$f":"IF(TS!F89=\"\",\"\",TS!F89)","v":""},null,null,"",null,null,"",null,null,"",null,null,"",null,null,"",null,null,"","",null,null,null,null,null,null,null,"",null,null,"",null,null,"",null,null,"",null,null,"",null,null,"",null,null,"",null,null,"","",null,null,"",null,null,null,"",{"$f":"IF('T1'!BJ83=\"\",\"\",'T1'!BJ83)","v":""},null,"",null,""]
[{"$f":"IF(TS!A90=\"\",\"\",TS!A90)","v":""},{"$f":"IF(TS!B90=\"\",\"\",TS!B90)","v":""},{"$f":"IF(TS!C90=\"\",\"\",TS!C90)","v":""},{"$f":"IF(TS!G90=\"\",\"\",TS!G90)","v":""},{"$f":"IF(TS!D90=\"\",\"\",TS!D90)","v":""},{"$f":"IF(TS!F90=\"\",\"\",TS!F90)","v":""},null,null,"",null,null,"",null,null,"",null,null,"",null,null,"",null,null,"","",null,null,null,null,null,null,null,"",null,null,"",null,null,"",null,null,"",null,null,"",null,null,"",null,null,"",null,null,"","",null,null,"",null,null,null,"",{"$f":"IF('T1'!BJ84=\"\",\"\",'T1'!BJ84)","v":""},null,"",null,""]
[{"$f":"IF(TS!A91=\"\",\"\",TS!A91)","v":""},{"$f":"IF(TS!B91=\"\",\"\",TS!B91)","v":""},{"$f":"IF(TS!C91=\"\",\"\",TS!C91)","v":""},{"$f":"IF(TS!G91=\"\",\"\",TS!G91)","v":""},{"$f":"IF(TS!D91=\"\",\"\",TS!D91)","v":""},{"$f":"IF(TS!F91=\"\",\"\",TS!F91)","v":""},null,null,"",null,null,"",null,null,"",null,null,"",null,null,"",null,null,"","",null,null,null,null,null,null,null,"",null,null,"",null,null,"",null,null,"",null,null,"",null,null,"",null,null,"",null,null,"","",null,null,"",null,null,null,"",{"$f":"IF('T1'!BJ85=\"\",\"\",'T1'!BJ85)","v":""},null,"",null,""]
[{"$f":"IF(TS!A92=\"\",\"\",TS!A92)","v":""},{"$f":"IF(TS!B92=\"\",\"\",TS!B92)","v":""},{"$f":"IF(TS!C92=\"\",\"\",TS!C92)","v":""},{"$f":"IF(TS!G92=\"\",\"\",TS!G92)","v":""},{"$f":"IF(TS!D92=\"\",\"\",TS!D92)","v":""},{"$f":"IF(TS!F92=\"\",\"\",TS!F92)","v":""},null,null,"",null,null,"",null,null,"",null,null,"",null,null,"",null,null,"","",null,null,null,null,null,null,null,"",null,null,"",null,null,"",null,null,"",null,null,"",null,null,"",null,null,"",null,null,"","",null,null,"",null,null,null,"",{"$f":"IF('T1'!BJ86=\"\",\"\",'T1'!BJ86)","v":""},null,"",null,""]
[{"$f":"IF(TS!A93=\"\",\"\",TS!A93)","v":""},{"$f":"IF(TS!B93=\"\",\"\",TS!B93)","v":""},{"$f":"IF(TS!C93=\"\",\"\",TS!C93)","v":""},{"$f":"IF(TS!G93=\"\",\"\",TS!G93)","v":""},{"$f":"IF(TS!D93=\"\",\"\",TS!D93)","v":""},{"$f":"IF(TS!F93=\"\",\"\",TS!F93)","v":""},null,null,"",null,null,"",null,null,"",null,null,"",null,null,"",null,null,"","",null,null,null,null,null,null,null,"",null,null,"",null,null,"",null,null,"",null,null,"",null,null,"",null,null,"",null,null,"","",null,null,"",null,null,null,"",{"$f":"IF('T1'!BJ87=\"\",\"\",'T1'!BJ87)","v":""},null,{"$f":"IF(BJ87=\"\",\"\",RANK(BJ87,$BJ$10:$BJ$69))","v":""},null,""]
[{"$f":"IF(TS!A94=\"\",\"\",TS!A94)","v":""},{"$f":"IF(TS!B94=\"\",\"\",TS!B94)","v":""},{"$f":"IF(TS!C94=\"\",\"\",TS!C94)","v":""},{"$f":"IF(TS!G94=\"\",\"\",TS!G94)","v":""},{"$f":"IF(TS!D94=\"\",\"\",TS!D94)","v":""},{"$f":"IF(TS!F94=\"\",\"\",TS!F94)","v":""},null,null,"",null,null,"",null,null,"",null,null,"",null,null,"",null,null,"","",null,null,null,null,null,null,null,"",null,null,"",null,null,"",null,null,"",null,null,"",null,null,"",null,null,"",null,null,"","",null,null,"",null,null,null,"",{"$f":"IF('T1'!BJ88=\"\",\"\",'T1'!BJ88)","v":""},null,"",null,""]
[{"$f":"IF(TS!A95=\"\",\"\",TS!A95)","v":""},{"$f":"IF(TS!B95=\"\",\"\",TS!B95)","v":""},{"$f":"IF(TS!C95=\"\",\"\",TS!C95)","v":""},{"$f":"IF(TS!G95=\"\",\"\",TS!G95)","v":""},{"$f":"IF(TS!D95=\"\",\"\",TS!D95)","v":""},{"$f":"IF(TS!F95=\"\",\"\",TS!F95)","v":""},null,null,"",null,null,"",null,null,"",null,null,"",null,null,"",null,null,"","",null,null,null,null,null,null,null,"",null,null,"",null,null,"",null,null,"",null,null,"",null,null,"",null,null,"",null,null,"","",null,null,"",null,null,null,"",{"$f":"IF('T1'!BJ89=\"\",\"\",'T1'!BJ89)","v":""},null,"",null,""]
[{"$f":"IF(TS!A96=\"\",\"\",TS!A96)","v":""},{"$f":"IF(TS!B96=\"\",\"\",TS!B96)","v":""},{"$f":"IF(TS!C96=\"\",\"\",TS!C96)","v":""},{"$f":"IF(TS!G96=\"\",\"\",TS!G96)","v":""},{"$f":"IF(TS!D96=\"\",\"\",TS!D96)","v":""},{"$f":"IF(TS!F96=\"\",\"\",TS!F96)","v":""},null,null,"",null,null,"",null,null,"",null,null,"",null,null,"",null,null,"","",null,null,null,null,null,null,null,"",null,null,"",null,null,"",null,null,"",null,null,"",null,null,"",null,null,"",null,null,"","",null,null,"",null,null,null,"",{"$f":"IF('T1'!BJ90=\"\",\"\",'T1'!BJ90)","v":""},null,"",null,""]
[{"$f":"IF(TS!A97=\"\",\"\",TS!A97)","v":""},{"$f":"IF(TS!B97=\"\",\"\",TS!B97)","v":""},{"$f":"IF(TS!C97=\"\",\"\",TS!C97)","v":""},{"$f":"IF(TS!G97=\"\",\"\",TS!G97)","v":""},{"$f":"IF(TS!D97=\"\",\"\",TS!D97)","v":""},{"$f":"IF(TS!F97=\"\",\"\",TS!F97)","v":""},null,null,"",null,null,"",null,null,"",null,null,"",null,null,"",null,null,"","",null,null,null,null,null,null,null,"",null,null,"",null,null,"",null,null,"",null,null,"",null,null,"",null,null,"",null,null,"","",null,null,"",null,null,null,"",{"$f":"IF('T1'!BJ91=\"\",\"\",'T1'!BJ91)","v":""},null,"",null,""]
[{"$f":"IF(TS!A98=\"\",\"\",TS!A98)","v":""},{"$f":"IF(TS!B98=\"\",\"\",TS!B98)","v":""},{"$f":"IF(TS!C98=\"\",\"\",TS!C98)","v":""},{"$f":"IF(TS!G98=\"\",\"\",TS!G98)","v":""},{"$f":"IF(TS!D98=\"\",\"\",TS!D98)","v":""},{"$f":"IF(TS!F98=\"\",\"\",TS!F98)","v":""},null,null,"",null,null,"",null,null,"",null,null,"",null,null,"",null,null,"","",null,null,null,null,null,null,null,"",null,null,"",null,null,"",null,null,"",null,null,"",null,null,"",null,null,"",null,null,"","",null,null,"",null,null,null,"",{"$f":"IF('T1'!BJ92=\"\",\"\",'T1'!BJ92)","v":""},null,"",null,""]
[{"$f":"IF(TS!A99=\"\",\"\",TS!A99)","v":""},{"$f":"IF(TS!B99=\"\",\"\",TS!B99)","v":""},{"$f":"IF(TS!C99=\"\",\"\",TS!C99)","v":""},{"$f":"IF(TS!G99=\"\",\"\",TS!G99)","v":""},{"$f":"IF(TS!D99=\"\",\"\",TS!D99)","v":""},{"$f":"IF(TS!F99=\"\",\"\",TS!F99)","v":""},null,null,"",null,null,"",null,null,"",null,null,"",null,null,"",null,null,"","",null,null,null,null,null,null,null,"",null,null,"",null,null,"",null,null,"",null,null,"",null,null,"",null,null,"",null,null,"","",null,null,"",null,null,null,"",{"$f":"IF('T1'!BJ93=\"\",\"\",'T1'!BJ93)","v":""},null,"",null,""]
[{"$f":"IF(TS!A100=\"\",\"\",TS!A100)","v":""},{"$f":"IF(TS!B100=\"\",\"\",TS!B100)","v":""},{"$f":"IF(TS!C100=\"\",\"\",TS!C100)","v":""},{"$f":"IF(TS!G100=\"\",\"\",TS!G100)","v":""},{"$f":"IF(TS!D100=\"\",\"\",TS!D100)","v":""},{"$f":"IF(TS!F100=\"\",\"\",TS!F100)","v":""},null,null,"",null,null,"",null,null,"",null,null,"",null,null,"",null,null,"","",null,null,null,null,null,null,null,"",null,null,"",null,null,"",null,null,"",null,null,"",null,null,"",null,null,"",null,null,"","",null,null,"",null,null,null,"",{"$f":"IF('T1'!BJ94=\"\",\"\",'T1'!BJ94)","v":""},null,"",null,""]
[{"$f":"IF(TS!A101=\"\",\"\",TS!A101)","v":""},{"$f":"IF(TS!B101=\"\",\"\",TS!B101)","v":""},{"$f":"IF(TS!C101=\"\",\"\",TS!C101)","v":""},{"$f":"IF(TS!G101=\"\",\"\",TS!G101)","v":""},{"$f":"IF(TS!D101=\"\",\"\",TS!D101)","v":""},{"$f":"IF(TS!F101=\"\",\"\",TS!F101)","v":""},null,null,"",null,null,"",null,null,"",null,null,"",null,null,"",null,null,"","",null,null,null,null,null,null,null,"",null,null,null,null,null,"",null,null,"",null,null,"",null,null,"",null,null,"",null,null,"","",null,null,"",null,null,null,"",{"$f":"IF('T1'!BJ95=\"\",\"\",'T1'!BJ95)","v":""},null,"",null,""]
[{"$f":"IF(TS!A102=\"\",\"\",TS!A102)","v":""},{"$f":"IF(TS!B102=\"\",\"\",TS!B102)","v":""},{"$f":"IF(TS!C102=\"\",\"\",TS!C102)","v":""},{"$f":"IF(TS!G102=\"\",\"\",TS!G102)","v":""},{"$f":"IF(TS!D102=\"\",\"\",TS!D102)","v":""},{"$f":"IF(TS!F102=\"\",\"\",TS!F102)","v":""},null,null,"",null,null,"",null,null,"",null,null,"",null,null,"",null,null,"","",null,null,null,null,null,null,null,"",null,null,null,null,null,"",null,null,"",null,null,"",null,null,"",null,null,"",null,null,"","",null,null,"",null,null,null,"",{"$f":"IF('T1'!BJ96=\"\",\"\",'T1'!BJ96)","v":""},null,"",null,""]
[{"$f":"IF(TS!A103=\"\",\"\",TS!A103)","v":""},{"$f":"IF(TS!B103=\"\",\"\",TS!B103)","v":""},{"$f":"IF(TS!C103=\"\",\"\",TS!C103)","v":""},{"$f":"IF(TS!G103=\"\",\"\",TS!G103)","v":""},{"$f":"IF(TS!D103=\"\",\"\",TS!D103)","v":""},{"$f":"IF(TS!F103=\"\",\"\",TS!F103)","v":""},null,null,"",null,null,"",null,null,"",null,null,"",null,null,"",null,null,"","",null,null,null,null,null,null,null,"",null,null,null,null,null,"",null,null,"",null,null,"",null,null,"",null,null,"",null,null,"","",null,null,"",null,null,null,"",{"$f":"IF('T1'!BJ97=\"\",\"\",'T1'!BJ97)","v":""},null,"",null,""]
[{"$f":"IF(TS!A104=\"\",\"\",TS!A104)","v":""},{"$f":"IF(TS!B104=\"\",\"\",TS!B104)","v":""},{"$f":"IF(TS!C104=\"\",\"\",TS!C104)","v":""},{"$f":"IF(TS!G104=\"\",\"\",TS!G104)","v":""},{"$f":"IF(TS!D104=\"\",\"\",TS!D104)","v":""},{"$f":"IF(TS!F104=\"\",\"\",TS!F104)","v":""},null,null,"",null,null,"",null,null,"",null,null,"",null,null,"",null,null,"","",null,null,null,null,null,null,null,"",null,null,null,null,null,"",null,null,"",null,null,"",null,null,"",null,null,"",null,null,"","",null,null,"",null,null,null,"",{"$f":"IF('T1'!BJ98=\"\",\"\",'T1'!BJ98)","v":""},null,"",null,""]
[{"$f":"IF(TS!A105=\"\",\"\",TS!A105)","v":""},{"$f":"IF(TS!B105=\"\",\"\",TS!B105)","v":""},{"$f":"IF(TS!C105=\"\",\"\",TS!C105)","v":""},{"$f":"IF(TS!G105=\"\",\"\",TS!G105)","v":""},{"$f":"IF(TS!D105=\"\",\"\",TS!D105)","v":""},{"$f":"IF(TS!F105=\"\",\"\",TS!F105)","v":""},null,null,"",null,null,"",null,null,"",null,null,"",null,null,"",null,null,"","",null,null,null,null,null,null,null,"",null,null,null,null,null,"",null,null,"",null,null,"",null,null,"",null,null,"",null,null,"","",null,null,"",null,null,null,"",{"$f":"IF('T1'!BJ99=\"\",\"\",'T1'!BJ99)","v":""},null,"",null,""]
[{"$f":"IF(TS!A106=\"\",\"\",TS!A106)","v":""},{"$f":"IF(TS!B106=\"\",\"\",TS!B106)","v":""},{"$f":"IF(TS!C106=\"\",\"\",TS!C106)","v":""},{"$f":"IF(TS!G106=\"\",\"\",TS!G106)","v":""},{"$f":"IF(TS!D106=\"\",\"\",TS!D106)","v":""},{"$f":"IF(TS!F106=\"\",\"\",TS!F106)","v":""},null,null,"",null,null,"",null,null,"",null,null,"",null,null,"",null,null,"","",null,null,null,null,null,null,null,"",null,null,null,null,null,"",null,null,"",null,null,"",null,null,"",null,null,"",null,null,"","",null,null,"",null,null,null,"",{"$f":"IF('T1'!BJ100=\"\",\"\",'T1'!BJ100)","v":""},null,"",null,""]
[null,null,{"$f":"IF(TS!C107=\"\",\"\",TS!C107)","v":""},null,null,null,null,null,null,null,null,null,null,null,null,null,null,null,null,null,null,null,null,null,"",null,null,null,null,null,null,null,null,null,null,null,null,null,null,null,null,null,null,null,null,null,null,"",null,null,""]

{"sheet":"B2","index":5,"n_rows":51,"n_cols":14,"rows_kept":51,"cut":false,"hidden":false,"merged":[[47,11,50,14],[5,0,5,5],[5,10,5,12],[5,13,5,14],[6,10,6,12],[6,13,6,14],[8,1,9,13],[3,0,3,5],[3,10,3,12],[3,13,3,14],[4,0,4,5],[4,10,4,12],[4,13,4,14],[11,2,11,7],[11,8,11,12],[12,2,12,7],[20,3,20,5],[23,3,23,5],[23,6,23,7],[23,8,23,9],[24,3,24,5],[21,3,21,5],[21,6,21,7],[21,8,21,9],[0,0,1,5],[0,10,0,12],[0,13,0,14],[1,10,1,12],[1,13,1,14],[2,0,2,5],[2,10,2,12],[2,13,2,14],[20,6,20,7],[20,8,20,9],[22,3,22,5],[22,6,22,7],[22,8,22,9],[12,8,12,12],[14,1,14,13],[16,0,17,2],[16,3,17,5],[16,6,16,11],[16,12,17,14],[17,6,17,7],[17,8,17,9],[18,0,24,2],[18,3,18,5],[18,6,18,7],[18,8,18,9],[18,12,24,14],[19,3,19,5],[19,6,19,7],[19,8,19,9],[29,0,31,2],[29,3,29,5],[29,6,29,9],[30,3,30,5],[30,6,30,9],[31,3,31,5],[25,11,26,11],[25,12,26,14],[26,0,26,2],[26,3,26,5],[27,0,28,2],[27,3,27,5],[27,6,27,9],[27,12,31,14],[28,3,28,5],[28,6,28,9],[25,0,25,2],[25,3,25,5],[25,6,25,7],[25,8,25,9],[34,0,34,2],[34,3,34,5],[34,6,34,7],[34,8,34,9],[34,11,35,11],[34,12,35,14],[35,0,35,2],[35,3,35,5],[32,0,32,2],[32,3,32,5],[32,6,32,7],[32,8,32,9],[32,11,33,11],[32,12,33,14],[33,0,33,2],[33,3,33,5],[39,8,39,9],[40,3,40,5],[40,6,40,7],[36,0,37,2],[36,3,36,5],[36,6,36,7],[36,8,36,9],[36,11,37,11],[36,12,37,14],[37,3,37,5],[43,11,44,11],[43,12,44,14],[44,0,44,2],[44,3,44,5],[46,0,46,3],[46,4,46,5],[46,7,46,9],[46,11,46,14],[40,8,40,9],[41,3,41,5],[41,6,41,7],[41,8,41,9],[42,3,42,5],[43,0,43,2],[43,3,43,5],[43,6,43,7],[43,8,43,9],[38,0,42,2],[38,3,38,5],[38,6,38,7],[38,8,38,9],[38,12,42,14],[39,3,39,5],[39,6,39,7],[48,0,48,3],[48,4,48,5],[49,0,49,3],[49,4,49,5],[47,0,47,3],[47,4,47,5],[50,0,50,3],[50,4,50,5],[47,7,47,9],[48,7,48,9],[49,7,50,9]]}
[null,null,null,null,null,null,null,null,null,null,"الموسم الدراسي",null,null,{"$f":"IF(TS!$M$1=\"\",\"\",TS!$M$1)","v":"2020-2019"}]
[null,null,null,null,null,null,null,null,null,null,"الاسم و النسب",null,null,{"$f":"IF(N7=\"\",\"\",VLOOKUP(N5,base2,3,0))","v":"ياسين النسب1"}]
[{"$f":"IF(TS!$A$5=\"\",\"\",TS!$A$5)","v":"الأكاديمية الجهوية للتربية والتكوين"},null,null,null,null,null,null,null,null,null,"الرقم الوطني",null,null,{"$f":"IF(N7=\"\",\"\",VLOOKUP(N5,base2,2,0))","v":"AZ22334455"}]
[{"$f":"IF(TS!$A$6=\"\",\"\",TS!$A$6)","v":"جهة: الدارالبيضاء-سطات"},null,null,null,null,null,null,null,null,null,"رقم التسجيل",null,null,{"$f":"IF(N7=\"\",\"\",VLOOKUP(N5,base2,6,0))","v":1400}]
[{"$f":"IF(TS!$A$7=\"\",\"\",TS!$A$7)","v":"مديرية :المحمدية"},null,null,null,null,null,null,null,null,null,"رقم ت في القسم",null,null,1]
[{"$f":"IF(TS!$A$8=\"\",\"\",TS!$A$8)","v":"مؤسسة :النجاح"},null,null,null,null,null,null,null,null,null,"المستوى",null,null,{"$f":"IF(TS!$M$3=\"\",\"\",TS!$M$3)","v":"الأول"}]
[null,null,null,null,null,null,null,null,null,null,"عدد التلاميذ",null,null,{"$f":"IF(TS!$O$12=0,\"\",TS!$O$12)","v":29}]
[]
[null,"بطاقة المراقبة المستمرة"]
[]
[]
[null,null,"مدرسة",null,null,null,null,null,{"$f":"IF(TS!$M$4=\"\",\"\",TS!$M$4)","v":"المركزية"}]
[null,null,"الاسم والنسب",null,null,null,null,null,{"$f":"IF(N7=\"\",\"\",VLOOKUP(N5,base2,3,0))","v":"ياسين النسب1"}]
[]
[null,"نتائج الأسدوس الثاني"]
[]
["الوحدات",null,null,"الانشطة",null,null,"الدورة الأولى",null,null,null,null,null,"ملاحظات"]
[null,null,null,null,null,null,"النقطة1",null,"النقطة2",null,null,"المعدل"]
["اللغة العربية",null,null,"التعبيرالكتابي",null,null,{"$f":"IF(N7=\"\",\"\",VLOOKUP(N5,base2,7,0))","v":6},null,{"$f":"IF(N7=\"\",\"\",VLOOKUP(N5,base2,8,0))","v":6},null,null,{"$f":"IF(N7=\"\",\"\",VLOOKUP(N5,base2,9,0))","v":6},{"$f":"IF(L25=\"\",\"\",IF(L25>=9,\"عمل ممتاز\",IF(L25>=8,\"نتائج حسنة\",IF(L25>=7,\"عمل مستحسن\",IF(L25>=6,\"نتائج لابأس بها\",IF(L25>=5,\"عمل متوسط\",IF(L25>=4,\"عمل دون متوسط\",\"عليك بالاجتهاد أكثر\")))))))","v":"عمل متوسط"}]
[null,null,null,"القراءة",null,null,{"$f":"IF(N7=\"\",\"\",VLOOKUP(N5,base2,10,0))","v":4},null,{"$f":"IF(N7=\"\",\"\",VLOOKUP(N5,base2,11,0))","v":5},null,null,{"$f":"IF(N7=\"\",\"\",VLOOKUP(N5,base2,12,0))","v":4.5}]
[null,null,null,"الإملاء",null,null,{"$f":"IF(N7=\"\",\"\",VLOOKUP(N5,base2,13,0))","v":3},null,{"$f":"IF(N7=\"\",\"\",VLOOKUP(N5,base2,14,0))","v":8},null,null,{"$f":"IF(N7=\"\",\"\",VLOOKUP(N5,base2,15,0))","v":5.5}]
[null,null,null,"الخط",null,null,{"$f":"IF(N7=\"\",\"\",VLOOKUP(N5,base2,16,0))","v":6},null,{"$f":"IF(N7=\"\",\"\",VLOOKUP(N5,base2,17,0))","v":6.5},null,null,{"$f":"IF(N7=\"\",\"\",VLOOKUP(N5,base2,18,0))","v":6.25}]
[null,null,null,"الاستماع والتحدث",null,null,{"$f":"IF(N7=\"\",\"\",VLOOKUP(N5,base2,19,0))","v":4},null,{"$f":"IF(N7=\"\",\"\",VLOOKUP(N5,base2,20,0))","v":5.5},null,null,{"$f":"IF(N7=\"\",\"\",VLOOKUP(N5,base2,21,0))","v":4.75}]
[null,null,null,"النقل",null,null,{"$f":"IF(N7=\"\",\"\",VLOOKUP(N5,base2,22,0))","v":6.75},null,{"$f":"IF(N7=\"\",\"\",VLOOKUP(N5,base2,23,0))","v":7},null,null,{"$f":"IF(N7=\"\",\"\",VLOOKUP(N5,base2,24,0))","v":6.875}]
[null,null,null,"معدل الوحدة",null,null,null,null,null,null,null,{"$f":"IF(N7=\"\",\"\",VLOOKUP(N5,base2,25,0))","v":5.645833333333333}]
["اللغة",null,null,"الأمازيغية",null,null,{"$f":"IF(TS!$P$3=0,\"\",VLOOKUP(N5,base2,26,0))","v":""},null,{"$f":"IF(TS!$P$3=0,\"\",VLOOKUP(N5,base2,27,0))","v":""},null,null,{"$f":"IF(TS!$P$3=0,\"\",VLOOKUP(N5,base2,28,0))","v":""},{"$f":"IF(L27=\"\",\"الأمازيغية غير معممة\",IF(L27>=9,\"عمل ممتاز\",IF(L27>=8,\"نتائج حسنة\",IF(L27>=7,\"عمل مستحسن\",IF(L27>=6,\"نتائج لابأس بها\",IF(L27>=5,\"عمل متوسط\",IF(L27>=4,\"عمل دون متوسط\",\"عليك بالاجتهاد أكثر\")))))))","v":"الأمازيغية غير معممة"}]
["الأمازيغية",null,null,"معدل الوحدة"]
["التربية ",null,null,"الفرض 1",null,null,{"$f":"IF(N7=\"\",\"\",VLOOKUP(N5,base2,29,0))","v":5},null,null,null,null,{"$f":"IF(N7=\"\",\"\",VLOOKUP(N5,base2,29,0))","v":5},{"$f":"IF(L32=\"\",\"\",IF(L32>=9,\"عمل ممتاز\",IF(L32>=8,\"نتائج حسنة\",IF(L32>=7,\"عمل مستحسن\",IF(L32>=6,\"نتائج لابأس بها\",IF(L32>=5,\"عمل متوسط\",IF(L32>=4,\"عمل دون متوسط\",\"عليك بالاجتهاد أكثر\")))))))","v":"عمل دون متوسط"}]
[null,null,null,"الفرض 2",null,null,{"$f":"IF(N7=\"\",\"\",VLOOKUP(N5,base2,30,0))","v":4},null,null,null,null,{"$f":"IF(N7=\"\",\"\",VLOOKUP(N5,base2,30,0))","v":4}]
["الإسلامية",null,null,"الفرض 3",null,null,{"$f":"IF(N7=\"\",\"\",VLOOKUP(N5,base2,31,0))","v":5},null,null,null,null,{"$f":"IF(N7=\"\",\"\",VLOOKUP(N5,base2,31,0))","v":5}]
[null,null,null,"أنشطة",null,null,{"$f":"IF(N7=\"\",\"\",VLOOKUP(N5,base2,32,0))","v":4},null,null,null,null,{"$f":"IF(N7=\"\",\"\",VLOOKUP(N5,base2,32,0))","v":4}]
[null,null,null,"معدل الوحدة",null,null,null,null,null,null,null,{"$f":"IF(N7=\"\",\"\",VLOOKUP(N5,base2,33,0))","v":4.5}]
["النشاط ",null,null,"النشاط العلمي",null,null,{"$f":"IF(N7=\"\",\"\",VLOOKUP(N5,base2,34,0))","v":6.5},null,{"$f":"IF(N7=\"\",\"\",VLOOKUP(N5,base2,35,0))","v":4},null,null,{"$f":"IF(N7=\"\",\"\",VLOOKUP(N5,base2,36,0))","v":5.25},{"$f":"IF(L33=\"\",\"\",IF(L33>=9,\"عمل ممتاز\",IF(L33>=8,\"نتائج حسنة\",IF(L33>=7,\"عمل مستحسن\",IF(L33>=6,\"نتائج لابأس بها\",IF(L33>=5,\"عمل متوسط\",IF(L33>=4,\"عمل دون متوسط\",\"عليك بالاجتهاد أكثر\")))))))","v":"عمل متوسط"}]
["العلمي",null,null,"معدل الوحدة"]
["التربية",null,null,"التربية الفنية",null,null,{"$f":"IF(N7=\"\",\"\",VLOOKUP(N5,base2,37,0))","v":5},null,{"$f":"IF(N7=\"\",\"\",VLOOKUP(N5,base2,38,0))","v":7},null,null,{"$f":"IF(N7=\"\",\"\",VLOOKUP(N5,base2,39,0))","v":6},{"$f":"IF(L35=\"\",\"\",IF(L35>=9,\"عمل ممتاز\",IF(L35>=8,\"نتائج حسنة\",IF(L35>=7,\"عمل مستحسن\",IF(L35>=6,\"نتائج لابأس بها\",IF(L35>=5,\"عمل متوسط\",IF(L35>=4,\"عمل دون متوسط\",\"عليك بالاجتهاد أكثر\")))))))","v":"نتائج لابأس بها"}]
["الفنية",null,null,"معدل الوحدة"]
["الرياضيات",null,null,"الرياضيات",null,null,{"$f":"IF(N7=\"\",\"\",VLOOKUP(N5,base2,40,0))","v":3},null,{"$f":"IF(N7=\"\",\"\",VLOOKUP(N5,base2,41,0))","v":3},null,null,{"$f":"IF(N7=\"\",\"\",VLOOKUP(N5,base2,42,0))","v":3},{"$f":"IF(L37=\"\",\"\",IF(L37>=9,\"عمل ممتاز\",IF(L37>=8,\"نتائج حسنة\",IF(L37>=7,\"عمل مستحسن\",IF(L37>=6,\"نتائج لابأس بها\",IF(L37>=5,\"عمل متوسط\",IF(L37>=4,\"عمل دون متوسط\",\"عليك بالاجتهاد أكثر\")))))))","v":"عليك بالاجتهاد أكثر"}]
[null,null,null,"معدل الوحدة"]
["الفرنسية",null,null,"Comptine/chant",null,null,{"$f":"IF(N7=\"\",\"\",VLOOKUP(N5,base2,43,0))","v":4},null,{"$f":"IF(N7=\"\",\"\",VLOOKUP(N5,base2,44,0))","v":3},null,null,{"$f":"IF(N7=\"\",\"\",VLOOKUP(N5,base2,45,0))","v":3.5},{"$f":"IF(L43=\"\",\"\",IF(L43>=9,\" Excellent travail, Félicitations\",IF(L43>=8,\" Résultats encourageants, bon travail\",IF(L43>=7,\" Bon travail\",IF(L43>=6, \"Assez bien \",IF(L43>=5,\" Travail moyen\",IF(L43>=4,\" Travail insuffisant Attention\",IF(L43>=3,\"Travail faible Attention\",\"Résultats médiocres Attention\"))))))))","v":"Travail faible Attention"}]
[null,null,null,"Graphisme",null,null,{"$f":"IF(N7=\"\",\"\",VLOOKUP(N5,base2,46,0))","v":7.5},null,{"$f":"IF(N7=\"\",\"\",VLOOKUP(N5,base2,47,0))","v":6},null,null,{"$f":"IF(N7=\"\",\"\",VLOOKUP(N5,base2,48,0))","v":6.75}]
[null,null,null,"Act.orales",null,null,{"$f":"IF(N7=\"\",\"\",VLOOKUP(N5,base2,49,0))","v":3},null,{"$f":"IF(N7=\"\",\"\",VLOOKUP(N5,base2,50,0))","v":4},null,null,{"$f":"IF(N7=\"\",\"\",VLOOKUP(N5,base2,51,0))","v":3.5}]
[null,null,null,"Projet de classe",null,null,{"$f":"IF(N7=\"\",\"\",VLOOKUP(N5,base2,52,0))","v":1},null,{"$f":"IF(N7=\"\",\"\",VLOOKUP(N5,base2,53,0))","v":1},null,null,{"$f":"IF(N7=\"\",\"\",VLOOKUP(N5,base2,54,0))","v":1}]
[null,null,null,"معدل الوحدة",null,null,null,null,null,null,null,{"$f":"IF(N7=\"\",\"\",VLOOKUP(N5,base2,55,0))","v":3.6875}]
["التربية",null,null,"التربية البدنية",null,null,{"$f":"IF(N7=\"\",\"\",VLOOKUP(N5,base2,56,0))","v":7},null,{"$f":"IF(N7=\"\",\"\",VLOOKUP(N5,base2,57,0))","v":8},null,null,{"$f":"IF(N7=\"\",\"\",VLOOKUP(N5,base2,58,0))","v":7.5},{"$f":"IF(L44=\"\",\"\",IF(L44>=9,\"عمل ممتاز\",IF(L44>=8,\"نتائج حسنة\",IF(L44>=7,\"عمل مستحسن\",IF(L44>=6,\"نتائج لابأس بها\",IF(L44>=5,\"عمل متوسط\",IF(L44>=4,\"عمل دون متوسط\",\"عليك بالاجتهاد أكثر\")))))))","v":"عمل مستحسن"}]
["البدنية",null,null,"معدل الوحدة"]
[]
["مجموع معدل الوحدات",null,null,null,{"$f":"IF(N7=\"\",\"\",VLOOKUP(N5,base2,61,0))","v":35.583333333333336},null,null,"الميزة",null,null,null,"خاتم و توقيع رئيس المؤسسة"]
["معدل د2",null,null,null,{"$f":"IF(N7=\"\",\"\",VLOOKUP(N5,base2,62,0))","v":5.0833333333333339},null,null,{"$f":"IF(N7=\"\",\"\",VLOOKUP(N5,base2,67,0))","v":"متوسط"}]
["معدل د1",null,null,null,{"$f":"IF(N7=\"\",\"\",VLOOKUP(N5,base2,63,0))","v":5.0833333333333339},null,null,"القرار"]
["المعدل السنوي",null,null,null,{"$f":"IF(N7=\"\",\"\",VLOOKUP(N5,base2,64,0))","v":5.0833333333333339},null,null,{"$f":"IF(N7=\"\",\"\",VLOOKUP(N5,base2,66,0))","v":"ينتقل"}]
["الرتبة",null,null,null,{"$f":"IF(N7=\"\",\"\",VLOOKUP(N5,base2,65,0))","v":23}]