{"text_format":"1","workbook":"xlsx","n_sheets":4,"sheets":["Reservation","CHECK IN","Data","SCERCH"],"not_rendered":{"charts":0,"images":0,"macros":1,"external_links":0,"defined_names":7,"comments":0,"pivot_tables":0},"unopened":[],"bounds":{"document_bytes":16777216,"sheet_cells":100000,"rows_first":2000,"rows_last":500,"rows_between":2000,"halvings":0,"cell_chars":16384,"cell_head_chars":4096},"cells_cut":0,"cells_raw":0,"read":"whole","date_system":"1900"}

{"sheet":"Reservation","index":0,"n_rows":336,"n_cols":12,"rows_kept":336,"cut":false,"hidden":false,"merged":[[3,9,3,10],[3,7,3,8]]}
[null,null,"Reservation"]
[null,"From","2020-05-30"]
[null,"To","2020-06-25"]
[null,null,null,null,null,null,null,null,null,null,null,"Reservation"]
[null,null,null,null,null,null,null,null,null,null,null,"CHECK IN"]
["Room","Start","Days","End","Status","Full Name"]
["Room 13","2020-05-10",{"$f":"IF(OR(B7=\"\",D7=\"\"),\"\",D7-B7)","v":20},"2020-05-30","CHECK IN","Delsie Edwards",{"$f":"IF($E7=$L$5,MAX($G$6:G6)+1,\"\")","v":1}]
["Room 21","2020-05-11",20,"2020-05-31","CHECK IN","Mary Mace",{"$f":"IF($E8=$L$5,MAX($G$6:G7)+1,\"\")","v":2}]
["Room 5","2020-05-12",20,"2020-06-01","Reservation","Kent Todmanson",{"$f":"IF($E9=$L$5,MAX($G$6:G8)+1,\"\")","v":""}]
["Room 7","2020-05-13",20,"2020-06-02","Reservation","Ted Brent",{"$f":"IF($E10=$L$5,MAX($G$6:G9)+1,\"\")","v":""}]
["Room 16","2020-06-14",9,"2020-06-23","Reservation","Ted Brent",{"$f":"IF($E11=$L$5,MAX($G$6:G10)+1,\"\")","v":""}]
[null,null,"",null,null,null,{"$f":"IF($E12=$L$5,MAX($G$6:G11)+1,\"\")","v":""}]
[null,null,null,null,null,null,{"$f":"IF($E13=$L$5,MAX($G$6:G12)+1,\"\")","v":""}]
[null,null,null,null,null,null,{"$f":"IF($E14=$L$5,MAX($G$6:G13)+1,\"\")","v":""}]
[null,null,null,null,null,null,{"$f":"IF($E15=$L$5,MAX($G$6:G14)+1,\"\")","v":""}]
{"$rows_left_out":322}
{"sheet":"CHECK IN","index":1,"n_rows":20,"n_cols":6,"rows_kept":20,"cut":false,"hidden":false,"merged":[]}
[]
[]
[]
[]
[]
["Room","Start","Days","End","Status","Full Name"]
[{"$f":"IF(ROW($A1)<=MAX(Reservation!$G:$G),INDEX(Reservation!$A:$A,MATCH(ROW($A1),Reservation!$G:$G,0)),\"\")","v":"Room 13"},{"$f":"IF(ROW($A1)<=MAX(Reservation!$G:$G),INDEX(Reservation!$B:$B,MATCH(ROW($A1),Reservation!$G:$G,0)),\"\")","v":"2020-05-10"},{"$f":"IF(ROW($A1)<=MAX(Reservation!$G:$G),INDEX(Reservation!$C:$C,MATCH(ROW($A1),Reservation!$G:$G,0)),\"\")","v":20},{"$f":"IF(ROW($A1)<=MAX(Reservation!$G:$G),INDEX(Reservation!$D:$D,MATCH(ROW($A1),Reservation!$G:$G,0)),\"\")","v":"2020-05-30"},{"$f":"IF(ROW($A1)<=MAX(Reservation!$G:$G),INDEX(Reservation!$E:$E,MATCH(ROW($A1),Reservation!$G:$G,0)),\"\")","v":"CHECK IN"},{"$f":"IF(ROW($A1)<=MAX(Reservation!$G:$G),INDEX(Reservation!$F:$F,MATCH(ROW($A1),Reservation!$G:$G,0)),\"\")","v":"Delsie Edwards"}]
[{"$f":"IF(ROW($A2)<=MAX(Reservation!$G:$G),INDEX(Reservation!$A:$A,MATCH(ROW($A2),Reservation!$G:$G,0)),\"\")","v":"Room 21"},{"$f":"IF(ROW($A2)<=MAX(Reservation!$G:$G),INDEX(Reservation!$B:$B,MATCH(ROW($A2),Reservation!$G:$G,0)),\"\")","v":"2020-05-11"},{"$f":"IF(ROW($A2)<=MAX(Reservation!$G:$G),INDEX(Reservation!$C:$C,MATCH(ROW($A2),Reservation!$G:$G,0)),\"\")","v":20},{"$f":"IF(ROW($A2)<=MAX(Reservation!$G:$G),INDEX(Reservation!$D:$D,MATCH(ROW($A2),Reservation!$G:$G,0)),\"\")","v":"2020-05-31"},{"$f":"IF(ROW($A2)<=MAX(Reservation!$G:$G),INDEX(Reservation!$E:$E,MATCH(ROW($A2),Reservation!$G:$G,0)),\"\")","v":"CHECK IN"},{"$f":"IF(ROW($A2)<=MAX(Reservation!$G:$G),INDEX(Reservation!$F:$F,MATCH(ROW($A2),Reservation!$G:$G,0)),\"\")","v":"Mary Mace"}]
[{"$f":"IF(ROW($A3)<=MAX(Reservation!$G:$G),INDEX(Reservation!$A:$A,MATCH(ROW($A3),Reservation!$G:$G,0)),\"\")","v":""},{"$f":"IF(ROW($A3)<=MAX(Reservation!$G:$G),INDEX(Reservation!$B:$B,MATCH(ROW($A3),Reservation!$G:$G,0)),\"\")","v":""},{"$f":"IF(ROW($A3)<=MAX(Reservation!$G:$G),INDEX(Reservation!$C:$C,MATCH(ROW($A3),Reservation!$G:$G,0)),\"\")","v":""},{"$f":"IF(ROW($A3)<=MAX(Reservation!$G:$G),INDEX(Reservation!$D:$D,MATCH(ROW($A3),Reservation!$G:$G,0)),\"\")","v":""},{"$f":"IF(ROW($A3)<=MAX(Reservation!$G:$G),INDEX(Reservation!$E:$E,MATCH(ROW($A3),Reservation!$G:$G,0)),\"\")","v":""},{"$f":"IF(ROW($A3)<=MAX(Reservation!$G:$G),INDEX(Reservation!$F:$F,MATCH(ROW($A3),Reservation!$G:$G,0)),\"\")","v":""}]
[{"$f":"IF(ROW($A4)<=MAX(Reservation!$G:$G),INDEX(Reservation!$A:$A,MATCH(ROW($A4),Reservation!$G:$G,0)),\"\")","v":""},{"$f":"IF(ROW($A4)<=MAX(Reservation!$G:$G),INDEX(Reservation!$B:$B,MATCH(ROW($A4),Reservation!$G:$G,0)),\"\")","v":""},{"$f":"IF(ROW($A4)<=MAX(Reservation!$G:$G),INDEX(Reservation!$C:$C,MATCH(ROW($A4),Reservation!$G:$G,0)),\"\")","v":""},{"$f":"IF(ROW($A4)<=MAX(Reservation!$G:$G),INDEX(Reservation!$D:$D,MATCH(ROW($A4),Reservation!$G:$G,0)),\"\")","v":""},{"$f":"IF(ROW($A4)<=MAX(Reservation!$G:$G),INDEX(Reservation!$E:$E,MATCH(ROW($A4),Reservation!$G:$G,0)),\"\")","v":""},{"$f":"IF(ROW($A4)<=MAX(Reservation!$G:$G),INDEX(Reservation!$F:$F,MATCH(ROW($A4),Reservation!$G:$G,0)),\"\")","v":""}]
[{"$f":"IF(ROW($A5)<=MAX(Reservation!$G:$G),INDEX(Reservation!$A:$A,MATCH(ROW($A5),Reservation!$G:$G,0)),\"\")","v":""},{"$f":"IF(ROW($A5)<=MAX(Reservation!$G:$G),INDEX(Reservation!$B:$B,MATCH(ROW($A5),Reservation!$G:$G,0)),\"\")","v":""},{"$f":"IF(ROW($A5)<=MAX(Reservation!$G:$G),INDEX(Reservation!$C:$C,MATCH(ROW($A5),Reservation!$G:$G,0)),\"\")","v":""},{"$f":"IF(ROW($A5)<=MAX(Reservation!$G:$G),INDEX(Reservation!$D:$D,MATCH(ROW($A5),Reservation!$G:$G,0)),\"\")","v":""},{"$f":"IF(ROW($A5)<=MAX(Reservation!$G:$G),INDEX(Reservation!$E:$E,MATCH(ROW($A5),Reservation!$G:$G,0)),\"\")","v":""},{"$f":"IF(ROW($A5)<=MAX(Reservation!$G:$G),INDEX(Reservation!$F:$F,MATCH(ROW($A5),Reservation!$G:$G,0)),\"\")","v":""}]
[{"$f":"IF(ROW($A6)<=MAX(Reservation!$G:$G),INDEX(Reservation!$A:$A,MATCH(ROW($A6),Reservation!$G:$G,0)),\"\")","v":""},{"$f":"IF(ROW($A6)<=MAX(Reservation!$G:$G),INDEX(Reservation!$B:$B,MATCH(ROW($A6),Reservation!$G:$G,0)),\"\")","v":""},{"$f":"IF(ROW($A6)<=MAX(Reservation!$G:$G),INDEX(Reservation!$C:$C,MATCH(ROW($A6),Reservation!$G:$G,0)),\"\")","v":""},{"$f":"IF(ROW($A6)<=MAX(Reservation!$G:$G),INDEX(Reservation!$D:$D,MATCH(ROW($A6),Reservation!$G:$G,0)),\"\")","v":""},{"$f":"IF(ROW($A6)<=MAX(Reservation!$G:$G),INDEX(Reservation!$E:$E,MATCH(ROW($A6),Reservation!$G:$G,0)),\"\")","v":""},{"$f":"IF(ROW($A6)<=MAX(Reservation!$G:$G),INDEX(Reservation!$F:$F,MATCH(ROW($A6),Reservation!$G:$G,0)),\"\")","v":""}]
[{"$f":"IF(ROW($A7)<=MAX(Reservation!$G:$G),INDEX(Reservation!$A:$A,MATCH(ROW($A7),Reservation!$G:$G,0)),\"\")","v":""},{"$f":"IF(ROW($A7)<=MAX(Reservation!$G:$G),INDEX(Reservation!$B:$B,MATCH(ROW($A7),Reservation!$G:$G,0)),\"\")","v":""},{"$f":"IF(ROW($A7)<=MAX(Reservation!$G:$G),INDEX(Reservation!$C:$C,MATCH(ROW($A7),Reservation!$G:$G,0)),\"\")","v":""},{"$f":"IF(ROW($A7)<=MAX(Reservation!$G:$G),INDEX(Reservation!$D:$D,MATCH(ROW($A7),Reservation!$G:$G,0)),\"\")","v":""},{"$f":"IF(ROW($A7)<=MAX(Reservation!$G:$G),INDEX(Reservation!$E:$E,MATCH(ROW($A7),Reservation!$G:$G,0)),\"\")","v":""},{"$f":"IF(ROW($A7)<=MAX(Reservation!$G:$G),INDEX(Reservation!$F:$F,MATCH(ROW($A7),Reservation!$G:$G,0)),\"\")","v":""}]
[{"$f":"IF(ROW($A8)<=MAX(Reservation!$G:$G),INDEX(Reservation!$A:$A,MATCH(ROW($A8),Reservation!$G:$G,0)),\"\")","v":""},{"$f":"IF(ROW($A8)<=MAX(Reservation!$G:$G),INDEX(Reservation!$B:$B,MATCH(ROW($A8),Reservation!$G:$G,0)),\"\")","v":""},{"$f":"IF(ROW($A8)<=MAX(Reservation!$G:$G),INDEX(Reservation!$C:$C,MATCH(ROW($A8),Reservation!$G:$G,0)),\"\")","v":""},{"$f":"IF(ROW($A8)<=MAX(Reservation!$G:$G),INDEX(Reservation!$D:$D,MATCH(ROW($A8),Reservation!$G:$G,0)),\"\")","v":""},{"$f":"IF(ROW($A8)<=MAX(Reservation!$G:$G),INDEX(Reservation!$E:$E,MATCH(ROW($A8),Reservation!$G:$G,0)),\"\")","v":""},{"$f":"IF(ROW($A8)<=MAX(Reservation!$G:$G),INDEX(Reservation!$F:$F,MATCH(ROW($A8),Reservation!$G:$G,0)),\"\")","v":""}]
[{"$f":"IF(ROW($A9)<=MAX(Reservation!$G:$G),INDEX(Reservation!$A:$A,MATCH(ROW($A9),Reservation!$G:$G,0)),\"\")","v":""},{"$f":"IF(ROW($A9)<=MAX(Reservation!$G:$G),INDEX(Reservation!$B:$B,MATCH(ROW($A9),Reservation!$G:$G,0)),\"\")","v":""},{"$f":"IF(ROW($A9)<=MAX(Reservation!$G:$G),INDEX(Reservation!$C:$C,MATCH(ROW($A9),Reservation!$G:$G,0)),\"\")","v":""},{"$f":"IF(ROW($A9)<=MAX(Reservation!$G:$G),INDEX(Reservation!$D:$D,MATCH(ROW($A9),Reservation!$G:$G,0)),\"\")","v":""},{"$f":"IF(ROW($A9)<=MAX(Reservation!$G:$G),INDEX(Reservation!$E:$E,MATCH(ROW($A9),Reservation!$G:$G,0)),\"\")","v":""},{"$f":"IF(ROW($A9)<=MAX(Reservation!$G:$G),INDEX(Reservation!$F:$F,MATCH(ROW($A9),Reservation!$G:$G,0)),\"\")","v":""}]
{"$rows_left_out":6}
{"sheet":"Data","index":2,"n_rows":32,"n_cols":77,"rows_kept":32,"cut":false,"hidden":false,"merged":[]}
[]
[]
[]
[null,"Count"]
[null,{"$f":"MAX(B9:B500)","v":29},null,null,null,null,null,null,null,null,null,null,null,null,null,null,null,null,null,null,null,null,null,null,null,null,null,null,null,null,null,null,null,null,"Copied range for restoration if overbook",null,null,null,null,null,null,null,null,null,null,null,null,null,null,null,null,null,null,null,null,null,null,null,null,null,"Criteria",null,null,null,"Count",null,"Days overbooked"]
[null,null,null,null,null,null,null,null,null,null,null,null,null,null,null,null,null,null,null,null,null,null,null,null,null,null,null,null,null,null,null,null,null,null,null,null,null,null,null,null,null,null,null,null,null,null,null,null,null,null,null,null,null,null,null,null,null,null,null,null,"Room","Start","End",null,{"$f":"COUNTA(BM9:BM31)","v":0},null,{"$f":"IF(BN10>BN9,BN10-BN9,BO10-BN9+1)","v":1}]
[null,null,null,null,null,null,null,null,null,null,null,null,null,null,null,null,null,null,null,null,null,null,null,null,null,null,null,null,null,null,null,null,"Criteria for limiting data",null,null,null,null,null,null,null,null,null,null,null,null,null,null,null,null,null,null,null,null,null,null,null,null,null,null,null,{"$f":"\"=\" &#REF!","v":{"$error":"#REF!"}},{"$f":"\">=\" &#REF!","v":{"$error":"#REF!"}},{"$f":"\"<=\" &#REF!","v":{"$error":"#REF!"}}]
[null,"ID","Room","Start","Days","End","Status","Cost per day","Deposit","Addition  Cost","Cost","Full Name","Address","Email","Phone ","Licience /Passport","Expenses 1","Descript1","Expenses 2","Descript2","Expenses 3","Descript3","Expenses 4","Descript4","Expenses 5","Descript5",null,null,null,null,null,null,"Start","End","ID","Room","Start","Days","End","Status","Cost per day","Deposit","Addition  Cost","Cost","Full Name","Address","Email","Phone ","Licience /Passport","Expenses 1","Descript1","Expenses 2","Descript2","Expenses 3","Descript3","Expenses 4","Descript4","Expenses 5","Descript5",null,{"$f":"\"=\" &#REF!","v":{"$error":"#REF!"}},{"$f":"\"<=\" &#REF!","v":{"$error":"#REF!"}},{"$f":"\">=\" &#REF!","v":{"$error":"#REF!"}},null,"Room","Start","End","Full Name","check in",null,null,"check Out"]
[null,1,"Room 15","2020-03-31",{"$f":"IF(OR(D9=\"\",F9=\"\"),\"\",F9-D9)","v":10},"2020-04-10","arrival",200,50,null,400,"Meagan Rouch","67 Pook St","meag@mmm.com","2345 2134","rt 565788",null,null,null,null,null,null,null,null,null,null,null,null,null,null,null,{"$f":"CONCATENATE(AS9,AK9)","v":"Henry Purcible43832"},{"$f":"\">=\" &#REF! - 14","v":{"$error":"#REF!"}},{"$f":"\"<=\" &#REF! + 14","v":{"$error":"#REF!"}},3,"Room 1","2020-01-02",5,"2020-01-07","Unconfirmed",80,null,0,548,"Henry Purcible","56 Grease St","1234fred@dod.com.ad","2345 6789","1234 5678 45",23,"Drinks",null,null,null,null,null,null,45,"Towels",null,null,null,null,null,null,null,null,null,{"$f":"MONTH(AK9)","v":"1900-01-01"},{"$f":"DAY(AK9)","v":2},{"$f":"YEAR(AK9)","v":2020},{"$f":"MONTH(AM9)","v":1},{"$f":"DAY(AM9)","v":7},{"$f":"YEAR(AM9)","v":2020},"IND","B.B","01-00001"]
[null,2,"Room 25","2020-03-31",{"$f":"IF(OR(D10=\"\",F10=\"\"),\"\",F10-D10)","v":10},"2020-04-10","arrival",80,null,0,320,"Jenny Trerrfer","45 Thenden St","567red@optusnet","2347 6789","1236 5678 45",null,null,null,null,null,null,null,null,null,null,null,null,null,null,null,{"$f":"CONCATENATE(AS10,AK10)","v":"Kent Todmanson43833"},null,null,4,"Room 15","2020-01-03",11,"2020-01-14","Paid",150,null,0,1650,"Kent Todmanson","45 Thenden St","567red@optusnet","2347 6789","1236 5678 45",null,null,null,null,null,null,null,null,null,null,null,null,null,null,null,null,null,null,null,{"$f":"MONTH(AK10)","v":1},{"$f":"DAY(AK10)","v":3},{"$f":"YEAR(AK10)","v":2020},{"$f":"MONTH(AM10)","v":1},{"$f":"DAY(AM10)","v":14},{"$f":"YEAR(AM11)","v":1900},"IND","B.B","01-00002"]
[null,3,"Room 1","2020-03-31",{"$f":"IF(OR(D11=\"\",F11=\"\"),\"\",F11-D11)","v":10},"2020-04-10","arrival",80,null,0,548,"Henry Purcible","56 Grease St","1234fred@dod.com.ad","2345 6789","1234 5678 45",23,"Drinks",null,null,null,null,null,null,45,"Towels",null,null,null,null,null,{"$f":"CONCATENATE(AS11,AK11)","v":""}]
[null,4,"Room 15","2020-03-31",10,"2020-04-10","arrival",150,null,0,1650,"Kent Todmanson","45 Thenden St","567red@optusnet","2347 6789","1236 5678 45",null,null,null,null,null,null,null,null,null,null,null,null,null,null,null,""]
[null,5,"Room 5","2020-03-31",10,"2020-04-10","arrival",150,200,0,1300,"Trex Lawson","45 Thenden St","567red@optusnet","2347 6789","1236 5678 45",null,null,null,null,null,null,null,null,null,null,null,null,null,null,null,""]
[null,6,"Room 21","2020-03-31",10,"2020-04-10","arrival",80,null,0,480,"Neal Heart","56 Grease St","1234fred@dod.com.ad","2345 6789","1234 5678 45",null,null,null,null,null,null,null,null,null,null,null,null,null,null,null,""]
[null,7,"Room 3","2020-03-31",10,"2020-04-10","arrival",120,null,0,600,"Delsie Drival","32 Trash Crt","1234fred@dod.com.ad","2346 6789","1235 5678 45",null,null,null,null,null,null,null,null,null,null,null,null,null,null,null,""]
{"$rows_left_out":18}
{"sheet":"SCERCH","index":3,"n_rows":34,"n_cols":6,"rows_kept":34,"cut":false,"hidden":false,"merged":[]}
[]
[null,"ROOM NO","Room 15"]
[null,"Date","2020-03-01"]
[null,"Date","2020-06-30"]
[]
[]
["Room","Start","Days","End","Status","Full Name"]
[{"$f":"IFERROR(INDEX(Data!$C:$C,SMALL(IF(Data!$D:$D>=$C$3,IF(Data!$D:$D<=$C$4,IF(Data!$C:$C=$C$2,ROW(A$9:A$5000)-ROW(A$9)+1))),ROWS($A$8:A8))),\"\")","v":"Room 15"},{"$f":"IFERROR(INDEX(Data!$D:$D,SMALL(IF(Data!$D:$D>=$C$3,IF(Data!$D:$D<=$C$4,IF(Data!$C:$C=$C$2,ROW(B$9:B$5000)-ROW(B$9)+1))),ROWS($A$8:B8))),\"\")","v":"2020-03-31"},{"$f":"IFERROR(INDEX(Data!$E:$E,SMALL(IF(Data!$D:$D>=$C$3,IF(Data!$D:$D<=$C$4,IF(Data!$C:$C=$C$2,ROW(C$9:C$5000)-ROW(C$9)+1))),ROWS($A$8:C8))),\"\")","v":10},{"$f":"IFERROR(INDEX(Data!$F:$F,SMALL(IF(Data!$D:$D>=$C$3,IF(Data!$D:$D<=$C$4,IF(Data!$C:$C=$C$2,ROW(D$9:D$5000)-ROW(D$9)+1))),ROWS($A$8:D8))),\"\")","v":"2020-04-10"},{"$f":"IFERROR(INDEX(Data!$G:$G,SMALL(IF(Data!$D:$D>=$C$3,IF(Data!$D:$D<=$C$4,IF(Data!$C:$C=$C$2,ROW(E$9:E$5000)-ROW(E$9)+1))),ROWS($A$8:E8))),\"\")","v":"arrival"},{"$f":"IFERROR(INDEX(Data!$L:$L,SMALL(IF(Data!$D:$D>=$C$3,IF(Data!$D:$D<=$C$4,IF(Data!$C:$C=$C$2,ROW(F$9:F$5000)-ROW(F$9)+1))),ROWS($A$8:F8))),\"\")","v":"Meagan Rouch"}]
[{"$f":"IFERROR(INDEX(Data!$C:$C,SMALL(IF(Data!$D:$D>=$C$3,IF(Data!$D:$D<=$C$4,IF(Data!$C:$C=$C$2,ROW(A$9:A$5000)-ROW(A$9)+1))),ROWS($A$8:A9))),\"\")","v":"Room 15"},{"$f":"IFERROR(INDEX(Data!$D:$D,SMALL(IF(Data!$D:$D>=$C$3,IF(Data!$D:$D<=$C$4,IF(Data!$C:$C=$C$2,ROW(B$9:B$5000)-ROW(B$9)+1))),ROWS($A$8:B9))),\"\")","v":"2020-03-31"},{"$f":"IFERROR(INDEX(Data!$E:$E,SMALL(IF(Data!$D:$D>=$C$3,IF(Data!$D:$D<=$C$4,IF(Data!$C:$C=$C$2,ROW(C$9:C$5000)-ROW(C$9)+1))),ROWS($A$8:C9))),\"\")","v":10},{"$f":"IFERROR(INDEX(Data!$F:$F,SMALL(IF(Data!$D:$D>=$C$3,IF(Data!$D:$D<=$C$4,IF(Data!$C:$C=$C$2,ROW(D$9:D$5000)-ROW(D$9)+1))),ROWS($A$8:D9))),\"\")","v":"2020-04-10"},{"$f":"IFERROR(INDEX(Data!$G:$G,SMALL(IF(Data!$D:$D>=$C$3,IF(Data!$D:$D<=$C$4,IF(Data!$C:$C=$C$2,ROW(E$9:E$5000)-ROW(E$9)+1))),ROWS($A$8:E9))),\"\")","v":"arrival"},{"$f":"IFERROR(INDEX(Data!$L:$L,SMALL(IF(Data!$D:$D>=$C$3,IF(Data!$D:$D<=$C$4,IF(Data!$C:$C=$C$2,ROW(F$9:F$5000)-ROW(F$9)+1))),ROWS($A$8:F9))),\"\")","v":"Kent Todmanson"}]
[{"$f":"IFERROR(INDEX(Data!$C:$C,SMALL(IF(Data!$D:$D>=$C$3,IF(Data!$D:$D<=$C$4,IF(Data!$C:$C=$C$2,ROW(A$9:A$5000)-ROW(A$9)+1))),ROWS($A$8:A10))),\"\")","v":""},{"$f":"IFERROR(INDEX(Data!$D:$D,SMALL(IF(Data!$D:$D>=$C$3,IF(Data!$D:$D<=$C$4,IF(Data!$C:$C=$C$2,ROW(B$9:B$5000)-ROW(B$9)+1))),ROWS($A$8:B10))),\"\")","v":""},{"$f":"IFERROR(INDEX(Data!$E:$E,SMALL(IF(Data!$D:$D>=$C$3,IF(Data!$D:$D<=$C$4,IF(Data!$C:$C=$C$2,ROW(C$9:C$5000)-ROW(C$9)+1))),ROWS($A$8:C10))),\"\")","v":""},{"$f":"IFERROR(INDEX(Data!$F:$F,SMALL(IF(Data!$D:$D>=$C$3,IF(Data!$D:$D<=$C$4,IF(Data!$C:$C=$C$2,ROW(D$9:D$5000)-ROW(D$9)+1))),ROWS($A$8:D10))),\"\")","v":""},{"$f":"IFERROR(INDEX(Data!$G:$G,SMALL(IF(Data!$D:$D>=$C$3,IF(Data!$D:$D<=$C$4,IF(Data!$C:$C=$C$2,ROW(E$9:E$5000)-ROW(E$9)+1))),ROWS($A$8:E10))),\"\")","v":""},{"$f":"IFERROR(INDEX(Data!$L:$L,SMALL(IF(Data!$D:$D>=$C$3,IF(Data!$D:$D<=$C$4,IF(Data!$C:$C=$C$2,ROW(F$9:F$5000)-ROW(F$9)+1))),ROWS($A$8:F10))),\"\")","v":""}]
[{"$f":"IFERROR(INDEX(Data!$C:$C,SMALL(IF(Data!$D:$D>=$C$3,IF(Data!$D:$D<=$C$4,IF(Data!$C:$C=$C$2,ROW(A$9:A$5000)-ROW(A$9)+1))),ROWS($A$8:A11))),\"\")","v":""},{"$f":"IFERROR(INDEX(Data!$D:$D,SMALL(IF(Data!$D:$D>=$C$3,IF(Data!$D:$D<=$C$4,IF(Data!$C:$C=$C$2,ROW(B$9:B$5000)-ROW(B$9)+1))),ROWS($A$8:B11))),\"\")","v":""},{"$f":"IFERROR(INDEX(Data!$E:$E,SMALL(IF(Data!$D:$D>=$C$3,IF(Data!$D:$D<=$C$4,IF(Data!$C:$C=$C$2,ROW(C$9:C$5000)-ROW(C$9)+1))),ROWS($A$8:C11))),\"\")","v":""},{"$f":"IFERROR(INDEX(Data!$F:$F,SMALL(IF(Data!$D:$D>=$C$3,IF(Data!$D:$D<=$C$4,IF(Data!$C:$C=$C$2,ROW(D$9:D$5000)-ROW(D$9)+1))),ROWS($A$8:D11))),\"\")","v":""},{"$f":"IFERROR(INDEX(Data!$G:$G,SMALL(IF(Data!$D:$D>=$C$3,IF(Data!$D:$D<=$C$4,IF(Data!$C:$C=$C$2,ROW(E$9:E$5000)-ROW(E$9)+1))),ROWS($A$8:E11))),\"\")","v":""},{"$f":"IFERROR(INDEX(Data!$L:$L,SMALL(IF(Data!$D:$D>=$C$3,IF(Data!$D:$D<=$C$4,IF(Data!$C:$C=$C$2,ROW(F$9:F$5000)-ROW(F$9)+1))),ROWS($A$8:F11))),\"\")","v":""}]
[{"$f":"IFERROR(INDEX(Data!$C:$C,SMALL(IF(Data!$D:$D>=$C$3,IF(Data!$D:$D<=$C$4,IF(Data!$C:$C=$C$2,ROW(A$9:A$5000)-ROW(A$9)+1))),ROWS($A$8:A12))),\"\")","v":""},{"$f":"IFERROR(INDEX(Data!$D:$D,SMALL(IF(Data!$D:$D>=$C$3,IF(Data!$D:$D<=$C$4,IF(Data!$C:$C=$C$2,ROW(B$9:B$5000)-ROW(B$9)+1))),ROWS($A$8:B12))),\"\")","v":""},{"$f":"IFERROR(INDEX(Data!$E:$E,SMALL(IF(Data!$D:$D>=$C$3,IF(Data!$D:$D<=$C$4,IF(Data!$C:$C=$C$2,ROW(C$9:C$5000)-ROW(C$9)+1))),ROWS($A$8:C12))),\"\")","v":""},{"$f":"IFERROR(INDEX(Data!$F:$F,SMALL(IF(Data!$D:$D>=$C$3,IF(Data!$D:$D<=$C$4,IF(Data!$C:$C=$C$2,ROW(D$9:D$5000)-ROW(D$9)+1))),ROWS($A$8:D12))),\"\")","v":""},{"$f":"IFERROR(INDEX(Data!$G:$G,SMALL(IF(Data!$D:$D>=$C$3,IF(Data!$D:$D<=$C$4,IF(Data!$C:$C=$C$2,ROW(E$9:E$5000)-ROW(E$9)+1))),ROWS($A$8:E12))),\"\")","v":""},{"$f":"IFERROR(INDEX(Data!$L:$L,SMALL(IF(Data!$D:$D>=$C$3,IF(Data!$D:$D<=$C$4,IF(Data!$C:$C=$C$2,ROW(F$9:F$5000)-ROW(F$9)+1))),ROWS($A$8:F12))),\"\")","v":""}]
[{"$f":"IFERROR(INDEX(Data!$C:$C,SMALL(IF(Data!$D:$D>=$C$3,IF(Data!$D:$D<=$C$4,IF(Data!$C:$C=$C$2,ROW(A$9:A$5000)-ROW(A$9)+1))),ROWS($A$8:A13))),\"\")","v":""},{"$f":"IFERROR(INDEX(Data!$D:$D,SMALL(IF(Data!$D:$D>=$C$3,IF(Data!$D:$D<=$C$4,IF(Data!$C:$C=$C$2,ROW(B$9:B$5000)-ROW(B$9)+1))),ROWS($A$8:B13))),\"\")","v":""},{"$f":"IFERROR(INDEX(Data!$E:$E,SMALL(IF(Data!$D:$D>=$C$3,IF(Data!$D:$D<=$C$4,IF(Data!$C:$C=$C$2,ROW(C$9:C$5000)-ROW(C$9)+1))),ROWS($A$8:C13))),\"\")","v":""},{"$f":"IFERROR(INDEX(Data!$F:$F,SMALL(IF(Data!$D:$D>=$C$3,IF(Data!$D:$D<=$C$4,IF(Data!$C:$C=$C$2,ROW(D$9:D$5000)-ROW(D$9)+1))),ROWS($A$8:D13))),\"\")","v":""},{"$f":"IFERROR(INDEX(Data!$G:$G,SMALL(IF(Data!$D:$D>=$C$3,IF(Data!$D:$D<=$C$4,IF(Data!$C:$C=$C$2,ROW(E$9:E$5000)-ROW(E$9)+1))),ROWS($A$8:E13))),\"\")","v":""},{"$f":"IFERROR(INDEX(Data!$L:$L,SMALL(IF(Data!$D:$D>=$C$3,IF(Data!$D:$D<=$C$4,IF(Data!$C:$C=$C$2,ROW(F$9:F$5000)-ROW(F$9)+1))),ROWS($A$8:F13))),\"\")","v":""}]
[{"$f":"IFERROR(INDEX(Data!$C:$C,SMALL(IF(Data!$D:$D>=$C$3,IF(Data!$D:$D<=$C$4,IF(Data!$C:$C=$C$2,ROW(A$9:A$5000)-ROW(A$9)+1))),ROWS($A$8:A14))),\"\")","v":""},{"$f":"IFERROR(INDEX(Data!$D:$D,SMALL(IF(Data!$D:$D>=$C$3,IF(Data!$D:$D<=$C$4,IF(Data!$C:$C=$C$2,ROW(B$9:B$5000)-ROW(B$9)+1))),ROWS($A$8:B14))),\"\")","v":""},{"$f":"IFERROR(INDEX(Data!$E:$E,SMALL(IF(Data!$D:$D>=$C$3,IF(Data!$D:$D<=$C$4,IF(Data!$C:$C=$C$2,ROW(C$9:C$5000)-ROW(C$9)+1))),ROWS($A$8:C14))),\"\")","v":""},{"$f":"IFERROR(INDEX(Data!$F:$F,SMALL(IF(Data!$D:$D>=$C$3,IF(Data!$D:$D<=$C$4,IF(Data!$C:$C=$C$2,ROW(D$9:D$5000)-ROW(D$9)+1))),ROWS($A$8:D14))),\"\")","v":""},{"$f":"IFERROR(INDEX(Data!$G:$G,SMALL(IF(Data!$D:$D>=$C$3,IF(Data!$D:$D<=$C$4,IF(Data!$C:$C=$C$2,ROW(E$9:E$5000)-ROW(E$9)+1))),ROWS($A$8:E14))),\"\")","v":""},{"$f":"IFERROR(INDEX(Data!$L:$L,SMALL(IF(Data!$D:$D>=$C$3,IF(Data!$D:$D<=$C$4,IF(Data!$C:$C=$C$2,ROW(F$9:F$5000)-ROW(F$9)+1))),ROWS($A$8:F14))),\"\")","v":""}]
[{"$f":"IFERROR(INDEX(Data!$C:$C,SMALL(IF(Data!$D:$D>=$C$3,IF(Data!$D:$D<=$C$4,IF(Data!$C:$C=$C$2,ROW(A$9:A$5000)-ROW(A$9)+1))),ROWS($A$8:A15))),\"\")","v":""},{"$f":"IFERROR(INDEX(Data!$D:$D,SMALL(IF(Data!$D:$D>=$C$3,IF(Data!$D:$D<=$C$4,IF(Data!$C:$C=$C$2,ROW(B$9:B$5000)-ROW(B$9)+1))),ROWS($A$8:B15))),\"\")","v":""},{"$f":"IFERROR(INDEX(Data!$E:$E,SMALL(IF(Data!$D:$D>=$C$3,IF(Data!$D:$D<=$C$4,IF(Data!$C:$C=$C$2,ROW(C$9:C$5000)-ROW(C$9)+1))),ROWS($A$8:C15))),\"\")","v":""},{"$f":"IFERROR(INDEX(Data!$F:$F,SMALL(IF(Data!$D:$D>=$C$3,IF(Data!$D:$D<=$C$4,IF(Data!$C:$C=$C$2,ROW(D$9:D$5000)-ROW(D$9)+1))),ROWS($A$8:D15))),\"\")","v":""},{"$f":"IFERROR(INDEX(Data!$G:$G,SMALL(IF(Data!$D:$D>=$C$3,IF(Data!$D:$D<=$C$4,IF(Data!$C:$C=$C$2,ROW(E$9:E$5000)-ROW(E$9)+1))),ROWS($A$8:E15))),\"\")","v":""},{"$f":"IFERROR(INDEX(Data!$L:$L,SMALL(IF(Data!$D:$D>=$C$3,IF(Data!$D:$D<=$C$4,IF(Data!$C:$C=$C$2,ROW(F$9:F$5000)-ROW(F$9)+1))),ROWS($A$8:F15))),\"\")","v":""}]
{"$rows_left_out":19}