{"text_format":"1","workbook":"xlsx","n_sheets":16,"sheets":["الرئيسية","قائمة الموظفين","Input","Data","يناير","فبراير","مارس","ابريل","مايو","يونيو","يوليو","اغسطس","سبتمبر","اكتوبر","نوفمبر","ديسمبر"],"not_rendered":{"charts":0,"images":4,"macros":1,"external_links":0,"defined_names":1,"comments":0,"pivot_tables":0},"unopened":[],"bounds":{"document_bytes":16777216,"sheet_cells":100000,"rows_first":2000,"rows_last":500,"rows_between":2000,"halvings":0,"cell_chars":16384,"cell_head_chars":4096},"cells_cut":0,"cells_raw":0,"read":"whole","date_system":"1900"}

{"sheet":"الرئيسية","index":0,"n_rows":15,"n_cols":27,"rows_kept":15,"cut":false,"hidden":false,"merged":[]}
[]
[]
[]
[null,null,null,null,null,null,null,null,null,null,null,null,null,null,null,null,null,null,null,null,null,null,null,null,null,"يناير",1]
[null,null,null,null,null,null,null,null,null,null,null,null,null,null,null,null,null,null,null,null,null,null,null,null,null,"فبراير",2]
[null,null,null,null,null,null,null,null,null,null,null,null,null,null,null,null,null,null,null,null,null,null,null,null,null,"مارس",3]
[null,null,null,null,null,null,null,null,null,null,null,null,null,null,null,null,null,null,null,null,null,null,null,null,null,"ابريل",4]
[null,null,null,null,null,null,null,null,null,null,null,null,null,null,null,null,null,null,null,null,null,null,null,null,null,"مايو",5]
[null,null,null,null,null,null,null,null,null,null,null,null,null,null,null,null,null,null,null,null,null,null,null,null,null,"يونيو",6]
[null,null,null,null,null,null,null,null,null,null,null,null,null,null,null,null,null,null,null,null,null,null,null,null,null,"يوليو",7]
{"$rows_left_out":6}
{"sheet":"قائمة الموظفين","index":1,"n_rows":151,"n_cols":22,"rows_kept":151,"cut":false,"hidden":false,"merged":[[0,4,0,5],[0,1,1,1],[0,2,1,2],[0,3,1,3],[0,20,0,21]]}
["الكود","الاسم","الوظيفه","الاساسى","التامين",null,null,null,null,null,null,null,null,null,null,null,null,null,null,null,"رصيد الاجازات"]
[null,null,null,null,"الثابت","المتغير","اجر اليوم","اجر الساعه","اضافى 1","اضافى2","عطلات","الحافز","بدل اغتراب ","بدل مواصلات","بدل وجبه","بدل غلاء معيشه","بدل موبايل","بدل ملبس","بدل طبيعة عمل","قرض","اعتيادى 21","عارضه 6"]
[100001,"احمد امام","مدير ادارى",3000,750,750,{"$f":"SUM(D3+F3+E3)/30","v":150},{"$f":"G3/8","v":18.75},{"$f":"H3*1.5","v":28.125},{"$f":"H3*2","v":37.5},{"$f":"H3*2","v":37.5},1000,100,600,250,150,100,50,50,{"$f":"12000-Input!AB37","v":12000},{"$f":"IF(SUMPRODUCT(SUMIF(INDIRECT(\"'\"&Sheets&\"'!\"&\"AC2:AC1000\"),$B3,INDIRECT(\"'\"&Sheets&\"'!\"&\"O2:O1000\")))=0,\"\",21-SUMPRODUCT(SUMIF(INDIRECT(\"'\"&Sheets&\"'!\"&\"AC2:AC1000\"),$B3,INDIRECT(\"'\"&Sheets&\"'!\"&\"O2:O1000\"))))","v":20},{"$f":"IF(SUMPRODUCT(SUMIF(INDIRECT(\"'\"&Sheets&\"'!\"&\"AC2:AC1000\"),$B3,INDIRECT(\"'\"&Sheets&\"'!\"&\"P2:P1000\")))=0,\"\",6-SUMPRODUCT(SUMIF(INDIRECT(\"'\"&Sheets&\"'!\"&\"AC2:AC1000\"),$B3,INDIRECT(\"'\"&Sheets&\"'!\"&\"P2:P1000\"))))","v":4}]
[100002,"احمد السيد","امين مخزن ",2000,500,500,{"$f":"SUM(D4+F4+E4)/30","v":100},{"$f":"G4/8","v":12.5},{"$f":"H4*1.5","v":18.75},{"$f":"H4*2","v":25},{"$f":"H4*2","v":25},800,100,600,300,150,null,null,50,null,17,3]
[100003,"يسرى موافى","فنى ",1500,500,500,83.333333333333329,10.416666666666666,15.625,20.833333333333332,20.833333333333332,750,null,650,350,null,50,null,100,null,20,-1]
[100004,"صالح محمد ","عامل ",1800,null,null,60,7.5,11.25,15,15,1000,null,500,300,200,null,null,500,null,20,4]
[100005,"مراد الشافعى ","عامل ",1750,250,250,75,9.375,14.0625,18.75,18.75,500,100,200,100,null,50,null,100,null,"",""]
[100006,"محمد على ","مدير ادارى",1500,150,150,60,7.5,11.25,15,15,800,null,750,null,200,null,100,null,null,"",""]
[100007,"عبد الواحد السيد ","عامل ",4000,500,500,166.66666666666666,20.833333333333332,31.25,41.666666666666664,41.666666666666664,null,100,500,null,150,null,null,100,null,"",""]
[100008,"احمد فتحى ","مساعد فنى ",3000,400,400,126.66666666666667,15.833333333333334,23.75,31.666666666666668,31.666666666666668,500,200,100,100,100,50,50,50,null,"",""]
{"$rows_left_out":142}
{"sheet":"Input","index":2,"n_rows":37,"n_cols":29,"rows_kept":37,"cut":false,"hidden":false,"merged":[[0,2,1,7],[0,8,1,14],[0,0,1,1],[5,0,35,0]]}
[2020,null,"مدخلات شهر",null,null,null,null,null,"فبراير"]
[]
["الاسم",{"$f":"IFERROR(VLOOKUP(A6,'قائمة الموظفين'!A:C,2,0),\"\")","v":""}]
["الوظيفه",{"$f":"IFERROR(VLOOKUP(A6,'قائمة الموظفين'!A1:C1048575,3,0),\"\")","v":""},null,null,null,null,{"$f":"IFERROR($G37*VLOOKUP($A6,'قائمة الموظفين'!$A$3:$V$500,8,0),\"\")","v":""},null,null,{"$f":"IFERROR(IF(J37>2,-(J37-2)*VLOOKUP($A6,'قائمة الموظفين'!$A$3:$V$500,7,0),0),\"\")","v":0},{"$f":"IFERROR($K37*VLOOKUP($A6,'قائمة الموظفين'!$A$3:$V$500,8,0),\"\")","v":""},{"$f":"IFERROR($L37*VLOOKUP($A6,'قائمة الموظفين'!$A$3:$V$500,9,0),\"\")","v":""},{"$f":"IFERROR($M37*VLOOKUP($A6,'قائمة الموظفين'!$A$3:$V$500,10,0),\"\")","v":""},{"$f":"IFERROR($N37*VLOOKUP($A6,'قائمة الموظفين'!$A$3:$V$500,11,0),\"\")","v":""},{"$f":"IFERROR($O37*VLOOKUP($A6,'قائمة الموظفين'!$A$3:$V$500,7,0),\"\")","v":""},{"$f":"IFERROR($P37*VLOOKUP($A6,'قائمة الموظفين'!$A$3:$V$500,7,0),\"\")","v":""},{"$f":"IFERROR(-$Q37*VLOOKUP($A6,'قائمة الموظفين'!$A$3:$V$500,7,0),\"\")","v":""},{"$f":"IFERROR(-$R37*2*VLOOKUP($A6,'قائمة الموظفين'!$A$3:$V$500,7,0),\"\")","v":""},{"$f":"S37","v":0},0,0,0,0,0,{"$f":"Y37","v":0},{"$f":"IFERROR(Z37*VLOOKUP($A6,'قائمة الموظفين'!$A$3:$V$500,7,0),\"\")","v":""},{"$f":"IFERROR(-AA37*VLOOKUP($A6,'قائمة الموظفين'!$A$3:$V$500,7,0),\"\")","v":""},{"$f":"IFERROR(VLOOKUP($A6,'قائمة الموظفين'!$A$3:$V$500,20,0),\"\")","v":""}]
["الكود","اليوم","التــــــــــــاريخ","الحضور","الانصراف","عدد الساعات ","الفعلى","عدد الاضافى","التأخير\nساعات","عدد\nالتأخيرات","اجر الساعه","اضافى 1","اضافى2","عطلات","اعتيادى 21","عارضه 6","غياب باذن","غياب بدون اذن","بدل اغتراب ","بدل مواصلات","بدل وجبه","بدل غلاء معيشه","بدل موبايل","بدل ملبس","بدل طبيعة عمل","مكافات","جزاء","قرض"]
[null,{"$f":"C6","v":"2020-02-01"},{"$f":"IF(MONTH(DATE($A$1,VLOOKUP($I$1,الرئيسية!$Z$4:$AA$15,2,0),ROWS($A$1:A1)))>VLOOKUP($I$1,الرئيسية!$Z$4:$AA$15,2,0),\"\",DATE($A$1,VLOOKUP($I$1,الرئيسية!$Z$4:$AA$15,2,0),ROWS($A$1:A1)))","v":"2020-02-01"},null,null,{"$f":"$E6-D6","v":0},{"$f":"IF($D6=9.25,F6+0.25,E6-D6)","v":0},{"$f":"IF($G6>=8,G6-8,0)","v":0},{"$f":"IF($D6>9.25,D6-9,0)","v":0},{"$f":"IF($I6>0,1,0)","v":0},{"$f":"IF($G6>=8,0,IF(G6=0,0,G6-8))","v":0},{"$f":"IF($H6>3,3,H6)","v":0},{"$f":"IF($H6>3,H6-3,0)","v":0},null,null,null,null,null,{"$f":"IF($F6>=1,VLOOKUP($A$6,'قائمة الموظفين'!$A$3:$V$500,13,0)/30,0)","v":0},{"$f":"IF($F6>=1,VLOOKUP($A$6,'قائمة الموظفين'!$A$3:$V$500,14,0)/30,0)","v":0},{"$f":"IF($F6>=1,VLOOKUP($A$6,'قائمة الموظفين'!$A$3:$V$500,15,0)/30,0)","v":0},{"$f":"IF($F6>=1,VLOOKUP($A$6,'قائمة الموظفين'!$A$3:$V$500,16,0)/30,0)","v":0},{"$f":"IF($F6>=1,VLOOKUP($A$6,'قائمة الموظفين'!$A$3:$V$500,17,0)/30,0)","v":0},{"$f":"IF($F6>=1,VLOOKUP($A$6,'قائمة الموظفين'!$A$3:$V$500,18,0)/30,0)","v":0},{"$f":"IF($F6>=1,VLOOKUP($A$6,'قائمة الموظفين'!$A$3:$V$500,19,0)/30,0)","v":0},null,null,null,{"$f":"IF(OR($D6=\"\",$E6=\"\"),\"\",$B$3)","v":""}]
[null,{"$f":"C7","v":"2020-02-02"},{"$f":"IF(MONTH(DATE($A$1,VLOOKUP($I$1,الرئيسية!$Z$4:$AA$15,2,0),ROWS($A$1:A2)))>VLOOKUP($I$1,الرئيسية!$Z$4:$AA$15,2,0),\"\",DATE($A$1,VLOOKUP($I$1,الرئيسية!$Z$4:$AA$15,2,0),ROWS($A$1:A2)))","v":"2020-02-02"},null,null,{"$f":"$E7-D7","v":0},{"$f":"IF($D7=9.25,F7+0.25,E7-D7)","v":0},{"$f":"IF($G7>=8,G7-8,0)","v":0},{"$f":"IF($D7>9.25,D7-9,0)","v":0},{"$f":"IF($I7>0,1,0)","v":0},{"$f":"IF($G7>=8,0,IF(G7=0,0,G7-8))","v":0},{"$f":"IF($H7>3,3,H7)","v":0},{"$f":"IF($H7>3,H7-3,0)","v":0},null,null,null,null,null,{"$f":"IF($F7>=1,VLOOKUP($A$6,'قائمة الموظفين'!$A$3:$V$500,13,0)/30,0)","v":0},{"$f":"IF($F7>=1,VLOOKUP($A$6,'قائمة الموظفين'!$A$3:$V$500,14,0)/30,0)","v":0},{"$f":"IF($F7>=1,VLOOKUP($A$6,'قائمة الموظفين'!$A$3:$V$500,15,0)/30,0)","v":0},{"$f":"IF($F7>=1,VLOOKUP($A$6,'قائمة الموظفين'!$A$3:$V$500,16,0)/30,0)","v":0},{"$f":"IF($F7>=1,VLOOKUP($A$6,'قائمة الموظفين'!$A$3:$V$500,17,0)/30,0)","v":0},{"$f":"IF($F7>=1,VLOOKUP($A$6,'قائمة الموظفين'!$A$3:$V$500,18,0)/30,0)","v":0},{"$f":"IF($F7>=1,VLOOKUP($A$6,'قائمة الموظفين'!$A$3:$V$500,19,0)/30,0)","v":0},null,null,null,{"$f":"IF(OR($D7=\"\",$E7=\"\"),\"\",$B$3)","v":""}]
[null,"2020-02-03",{"$f":"IF(MONTH(DATE($A$1,VLOOKUP($I$1,الرئيسية!$Z$4:$AA$15,2,0),ROWS($A$1:A3)))>VLOOKUP($I$1,الرئيسية!$Z$4:$AA$15,2,0),\"\",DATE($A$1,VLOOKUP($I$1,الرئيسية!$Z$4:$AA$15,2,0),ROWS($A$1:A3)))","v":"2020-02-03"},null,null,0,0,0,0,0,0,0,0,null,null,null,null,null,{"$f":"IF($F8>=1,VLOOKUP($A$6,'قائمة الموظفين'!$A$3:$V$500,13,0)/30,0)","v":0},{"$f":"IF($F8>=1,VLOOKUP($A$6,'قائمة الموظفين'!$A$3:$V$500,14,0)/30,0)","v":0},{"$f":"IF($F8>=1,VLOOKUP($A$6,'قائمة الموظفين'!$A$3:$V$500,15,0)/30,0)","v":0},{"$f":"IF($F8>=1,VLOOKUP($A$6,'قائمة الموظفين'!$A$3:$V$500,16,0)/30,0)","v":0},{"$f":"IF($F8>=1,VLOOKUP($A$6,'قائمة الموظفين'!$A$3:$V$500,17,0)/30,0)","v":0},{"$f":"IF($F8>=1,VLOOKUP($A$6,'قائمة الموظفين'!$A$3:$V$500,18,0)/30,0)","v":0},{"$f":"IF($F8>=1,VLOOKUP($A$6,'قائمة الموظفين'!$A$3:$V$500,19,0)/30,0)","v":0},null,null,null,""]
[null,"2020-02-04",{"$f":"IF(MONTH(DATE($A$1,VLOOKUP($I$1,الرئيسية!$Z$4:$AA$15,2,0),ROWS($A$1:A4)))>VLOOKUP($I$1,الرئيسية!$Z$4:$AA$15,2,0),\"\",DATE($A$1,VLOOKUP($I$1,الرئيسية!$Z$4:$AA$15,2,0),ROWS($A$1:A4)))","v":"2020-02-04"},null,null,0,0,0,0,0,0,0,0,null,null,null,null,null,{"$f":"IF($F9>=1,VLOOKUP($A$6,'قائمة الموظفين'!$A$3:$V$500,13,0)/30,0)","v":0},{"$f":"IF($F9>=1,VLOOKUP($A$6,'قائمة الموظفين'!$A$3:$V$500,14,0)/30,0)","v":0},{"$f":"IF($F9>=1,VLOOKUP($A$6,'قائمة الموظفين'!$A$3:$V$500,15,0)/30,0)","v":0},{"$f":"IF($F9>=1,VLOOKUP($A$6,'قائمة الموظفين'!$A$3:$V$500,16,0)/30,0)","v":0},{"$f":"IF($F9>=1,VLOOKUP($A$6,'قائمة الموظفين'!$A$3:$V$500,17,0)/30,0)","v":0},{"$f":"IF($F9>=1,VLOOKUP($A$6,'قائمة الموظفين'!$A$3:$V$500,18,0)/30,0)","v":0},{"$f":"IF($F9>=1,VLOOKUP($A$6,'قائمة الموظفين'!$A$3:$V$500,19,0)/30,0)","v":0},null,null,null,""]
[null,"2020-02-05",{"$f":"IF(MONTH(DATE($A$1,VLOOKUP($I$1,الرئيسية!$Z$4:$AA$15,2,0),ROWS($A$1:A5)))>VLOOKUP($I$1,الرئيسية!$Z$4:$AA$15,2,0),\"\",DATE($A$1,VLOOKUP($I$1,الرئيسية!$Z$4:$AA$15,2,0),ROWS($A$1:A5)))","v":"2020-02-05"},null,null,0,0,0,0,0,0,0,0,null,null,null,null,null,{"$f":"IF($F10>=1,VLOOKUP($A$6,'قائمة الموظفين'!$A$3:$V$500,13,0)/30,0)","v":0},{"$f":"IF($F10>=1,VLOOKUP($A$6,'قائمة الموظفين'!$A$3:$V$500,14,0)/30,0)","v":0},{"$f":"IF($F10>=1,VLOOKUP($A$6,'قائمة الموظفين'!$A$3:$V$500,15,0)/30,0)","v":0},{"$f":"IF($F10>=1,VLOOKUP($A$6,'قائمة الموظفين'!$A$3:$V$500,16,0)/30,0)","v":0},{"$f":"IF($F10>=1,VLOOKUP($A$6,'قائمة الموظفين'!$A$3:$V$500,17,0)/30,0)","v":0},{"$f":"IF($F10>=1,VLOOKUP($A$6,'قائمة الموظفين'!$A$3:$V$500,18,0)/30,0)","v":0},{"$f":"IF($F10>=1,VLOOKUP($A$6,'قائمة الموظفين'!$A$3:$V$500,19,0)/30,0)","v":0},null,null,null,""]
{"$rows_left_out":28}
{"sheet":"Data","index":3,"n_rows":22,"n_cols":8,"rows_kept":22,"cut":false,"hidden":false,"merged":[]}
["م","الحافز","الوظيفه","الراتب الاساسى","البدلات","الكود","الاسم","الوظيفه"]
[1,3000,"مدير ادارى",5000,"يستحق"]
[2,2000,"رئيس قسم ",4000,"لا يستحق",100001,"احمد امام","رئيس قسم "]
[3,1500,"فنى ",3500,null,100002,"احمد السيد","امين مخزن "]
[4,1200,"مساعد فنى ",3000,null,100003,"يسرى موافى","فنى "]
[5,1000,"عامل ",2800,null,100004,"صالح محمد ","عامل "]
[6,1500,"امين مخزن ",3400,null,100005,"مراد الشافعى ","عامل "]
[7,1100,"مساعد امين مخزن ",3000,null,100006,"محمد على ","مدير ادارى"]
[8,4000,"مدير حسابات",6000,null,100007,"عبد الواحد السيد ","عامل "]
[9,2800,"محاسب",3800,null,100008,"احمد فتحى ","مساعد فنى "]
{"$rows_left_out":13}
{"sheet":"يناير","index":4,"n_rows":65,"n_cols":29,"rows_kept":65,"cut":false,"hidden":false,"merged":[]}
["الكود","اليوم","التاريخ","الحضور","الانصراف","عدد الساعات ","الفعلى","عدد الاضافى","التأخير\nساعات","عدد\nالتأخيرات","اجر الساعه","اضافى 1","اضافى2","عطلات","اعتيادى 21","عارضه 6","غياب باذن","غياب بدون اذن","بدل اغتراب ","بدل مواصلات","بدل وجبه","بدل غلاء معيشه","بدل موبايل","بدل ملبس","بدل طبيعة عمل","مكافات","جزاء","قرض"]
[100003,"2020-01-01","2020-01-01","10:20:00","18:35:00",0.34374999999999989,0.34374999999999989,0,0,0,-7.65625,0,0,null,null,7,null,null,0,0,0,0,0,0,0,null,null,null,"يسرى موافى"]
[null,"2020-01-02","2020-01-02","11:00:00","19:25:00",0.35069444444444448,0.35069444444444448,0,0,0,-7.6493055555555554,0,0,null,1,null,null,null,0,0,0,0,0,0,0,null,null,null,"يسرى موافى"]
[null,"2020-01-03","2020-01-03",null,null,0,0,0,0,0,0,0,0,null,null,null,null,null,0,0,0,0,0,0,0,null,null,null,""]
[null,"2020-01-04","2020-01-04",null,null,0,0,0,0,0,0,0,0,null,null,null,null,null,0,0,0,0,0,0,0,null,null,null,""]
[null,"2020-01-05","2020-01-05",null,null,0,0,0,0,0,0,0,0,null,null,null,null,null,0,0,0,0,0,0,0,null,null,null,""]
[null,"2020-01-06","2020-01-06",null,null,0,0,0,0,0,0,0,0,null,null,null,null,null,0,0,0,0,0,0,0,null,null,null,""]
[null,"2020-01-07","2020-01-07",null,null,0,0,0,0,0,0,0,0,null,null,null,null,null,0,0,0,0,0,0,0,null,null,null,""]
[null,"2020-01-08","2020-01-08",null,null,0,0,0,0,0,0,0,0,null,null,null,null,null,0,0,0,0,0,0,0,null,null,null,""]
[null,"2020-01-09","2020-01-09",null,null,0,0,0,0,0,0,0,0,null,null,null,null,null,0,0,0,0,0,0,0,null,null,null,""]
{"$rows_left_out":56}
{"sheet":"فبراير","index":5,"n_rows":33,"n_cols":29,"rows_kept":33,"cut":false,"hidden":false,"merged":[]}
["الكود","اليوم","التاريخ","الحضور","الانصراف","عدد الساعات ","الفعلى","عدد الاضافى","التأخير\nساعات","عدد\nالتأخيرات","اجر الساعه","اضافى 1","اضافى2","عطلات","اعتيادى 21","عارضه 6","غياب باذن","غياب بدون اذن","بدل اغتراب ","بدل مواصلات","بدل وجبه","بدل غلاء معيشه","بدل موبايل","بدل ملبس","بدل طبيعة عمل","مكافات","جزاء","قرض"]
[100002,"2020-02-01","2020-02-01","09:00:00","16:00:00",0.29166666666666663,0.29166666666666663,0,0,0,-7.708333333333333,0,0,null,null,3,null,null,0,0,0,0,0,0,0,null,null,null,"احمد السيد"]
[null,"2020-02-02","2020-02-02","11:00:00","18:00:00",0.29166666666666669,0.29166666666666669,0,0,0,-7.708333333333333,0,0,null,4,null,null,null,0,0,0,0,0,0,0,null,null,null,"احمد السيد"]
[null,"2020-02-03","2020-02-03","08:30:00","12:00:00",0.14583333333333331,0.14583333333333331,0,0,0,-7.854166666666667,0,0,null,null,null,null,null,0,0,0,0,0,0,0,null,null,null,"احمد السيد"]
[null,"2020-02-04","2020-02-04","10:20:00","19:10:00",0.36805555555555558,0.36805555555555558,0,0,0,-7.6319444444444446,0,0,null,null,null,null,null,0,0,0,0,0,0,0,null,null,null,"احمد السيد"]
[null,"2020-02-05","2020-02-05",null,null,0,0,0,0,0,0,0,0,null,null,null,null,null,0,0,0,0,0,0,0,null,null,null,""]
[null,"2020-02-06","2020-02-06",null,null,0,0,0,0,0,0,0,0,null,null,null,null,null,0,0,0,0,0,0,0,null,null,null,""]
[null,"2020-02-07","2020-02-07",null,null,0,0,0,0,0,0,0,0,null,null,null,null,null,0,0,0,0,0,0,0,null,null,null,""]
[null,"2020-02-08","2020-02-08",null,null,0,0,0,0,0,0,0,0,null,null,null,null,null,0,0,0,0,0,0,0,null,null,null,""]
[null,"2020-02-09","2020-02-09",null,null,0,0,0,0,0,0,0,0,null,null,null,null,null,0,0,0,0,0,0,0,null,null,null,""]
{"$rows_left_out":24}
{"sheet":"مارس","index":6,"n_rows":33,"n_cols":29,"rows_kept":33,"cut":false,"hidden":false,"merged":[]}
["الكود","اليوم","التاريخ","الحضور","الانصراف","عدد الساعات ","الفعلى","عدد الاضافى","التأخير\nساعات","عدد\nالتأخيرات","اجر الساعه","اضافى 1","اضافى2","عطلات","اعتيادى 21","عارضه 6","غياب باذن","غياب بدون اذن","بدل اغتراب ","بدل مواصلات","بدل وجبه","بدل غلاء معيشه","بدل موبايل","بدل ملبس","بدل طبيعة عمل","مكافات","جزاء","قرض"]
[100001,"2020-03-01","2020-03-01",9,17,8,8,0,0,0,0,0,0,null,null,2,null,null,3.3333333333333335,20,8.3333333333333339,5,3.3333333333333335,1.6666666666666667,1.6666666666666667,null,null,null,"احمد امام"]
[null,"2020-03-02","2020-03-02",9.25,17,7.75,8,0,0,0,0,0,0,null,1,null,null,null,3.3333333333333335,20,8.3333333333333339,5,3.3333333333333335,1.6666666666666667,1.6666666666666667,null,null,null,"احمد امام"]
[null,"2020-03-03","2020-03-03",9.5,17,7.5,7.5,0,0.5,1,-0.5,0,0,null,null,null,null,null,3.3333333333333335,20,8.3333333333333339,5,3.3333333333333335,1.6666666666666667,1.6666666666666667,null,null,null,"احمد امام"]
[null,"2020-03-04","2020-03-04",9,16.5,7.5,7.5,0,0,0,-0.5,0,0,null,null,null,null,null,3.3333333333333335,20,8.3333333333333339,5,3.3333333333333335,1.6666666666666667,1.6666666666666667,null,null,null,"احمد امام"]
[null,"2020-03-05","2020-03-05",9,21,12,12,4,0,0,0,3,1,null,null,null,null,null,3.3333333333333335,20,8.3333333333333339,5,3.3333333333333335,1.6666666666666667,1.6666666666666667,null,null,null,"احمد امام"]
[null,"2020-03-06","2020-03-06",9,18,9,9,1,0,0,0,1,0,null,null,null,null,null,3.3333333333333335,20,8.3333333333333339,5,3.3333333333333335,1.6666666666666667,1.6666666666666667,null,null,null,"احمد امام"]
[null,"2020-03-07","2020-03-07",9.25,18,8.75,9,1,0,0,0,1,0,null,null,null,null,null,3.3333333333333335,20,8.3333333333333339,5,3.3333333333333335,1.6666666666666667,1.6666666666666667,null,null,null,"احمد امام"]
[null,"2020-03-08","2020-03-08",9.5,18,8.5,8.5,0.5,0.5,1,0,0.5,0,null,null,null,null,null,3.3333333333333335,20,8.3333333333333339,5,3.3333333333333335,1.6666666666666667,1.6666666666666667,null,null,null,"احمد امام"]
[null,"2020-03-09","2020-03-09",null,null,0,0,0,0,0,0,0,0,null,null,null,null,null,0,0,0,0,0,0,0,null,null,null,""]
{"$rows_left_out":24}
{"sheet":"ابريل","index":7,"n_rows":1,"n_cols":28,"rows_kept":1,"cut":false,"hidden":false,"merged":[]}
["الكود","اليوم","التاريخ","الحضور","الانصراف","عدد الساعات ","الفعلى","عدد الاضافى","التأخير\nساعات","عدد\nالتأخيرات","اجر الساعه","اضافى 1","اضافى2","عطلات","اعتيادى 21","عارضه 6","غياب باذن","غياب بدون اذن","بدل اغتراب ","بدل مواصلات","بدل وجبه","بدل غلاء معيشه","بدل موبايل","بدل ملبس","بدل طبيعة عمل","مكافات","جزاء","قرض"]

{"sheet":"مايو","index":8,"n_rows":1,"n_cols":28,"rows_kept":1,"cut":false,"hidden":false,"merged":[]}
["الكود","اليوم","التاريخ","الحضور","الانصراف","عدد الساعات ","الفعلى","عدد الاضافى","التأخير\nساعات","عدد\nالتأخيرات","اجر الساعه","اضافى 1","اضافى2","عطلات","اعتيادى 21","عارضه 6","غياب باذن","غياب بدون اذن","بدل اغتراب ","بدل مواصلات","بدل وجبه","بدل غلاء معيشه","بدل موبايل","بدل ملبس","بدل طبيعة عمل","مكافات","جزاء","قرض"]

{"sheet":"يونيو","index":9,"n_rows":1,"n_cols":28,"rows_kept":1,"cut":false,"hidden":false,"merged":[]}
["الكود","اليوم","التاريخ","الحضور","الانصراف","عدد الساعات ","الفعلى","عدد الاضافى","التأخير\nساعات","عدد\nالتأخيرات","اجر الساعه","اضافى 1","اضافى2","عطلات","اعتيادى 21","عارضه 6","غياب باذن","غياب بدون اذن","بدل اغتراب ","بدل مواصلات","بدل وجبه","بدل غلاء معيشه","بدل موبايل","بدل ملبس","بدل طبيعة عمل","مكافات","جزاء","قرض"]

{"sheet":"يوليو","index":10,"n_rows":1,"n_cols":28,"rows_kept":1,"cut":false,"hidden":false,"merged":[]}
["الكود","اليوم","التاريخ","الحضور","الانصراف","عدد الساعات ","الفعلى","عدد الاضافى","التأخير\nساعات","عدد\nالتأخيرات","اجر الساعه","اضافى 1","اضافى2","عطلات","اعتيادى 21","عارضه 6","غياب باذن","غياب بدون اذن","بدل اغتراب ","بدل مواصلات","بدل وجبه","بدل غلاء معيشه","بدل موبايل","بدل ملبس","بدل طبيعة عمل","مكافات","جزاء","قرض"]

{"sheet":"اغسطس","index":11,"n_rows":1,"n_cols":28,"rows_kept":1,"cut":false,"hidden":false,"merged":[]}
["الكود","اليوم","التاريخ","الحضور","الانصراف","عدد الساعات ","الفعلى","عدد الاضافى","التأخير\nساعات","عدد\nالتأخيرات","اجر الساعه","اضافى 1","اضافى2","عطلات","اعتيادى 21","عارضه 6","غياب باذن","غياب بدون اذن","بدل اغتراب ","بدل مواصلات","بدل وجبه","بدل غلاء معيشه","بدل موبايل","بدل ملبس","بدل طبيعة عمل","مكافات","جزاء","قرض"]

{"sheet":"سبتمبر","index":12,"n_rows":1,"n_cols":28,"rows_kept":1,"cut":false,"hidden":false,"merged":[]}
["الكود","اليوم","التاريخ","الحضور","الانصراف","عدد الساعات ","الفعلى","عدد الاضافى","التأخير\nساعات","عدد\nالتأخيرات","اجر الساعه","اضافى 1","اضافى2","عطلات","اعتيادى 21","عارضه 6","غياب باذن","غياب بدون اذن","بدل اغتراب ","بدل مواصلات","بدل وجبه","بدل غلاء معيشه","بدل موبايل","بدل ملبس","بدل طبيعة عمل","مكافات","جزاء","قرض"]

{"sheet":"اكتوبر","index":13,"n_rows":1,"n_cols":28,"rows_kept":1,"cut":false,"hidden":false,"merged":[]}
["الكود","اليوم","التاريخ","الحضور","الانصراف","عدد الساعات ","الفعلى","عدد الاضافى","التأخير\nساعات","عدد\nالتأخيرات","اجر الساعه","اضافى 1","اضافى2","عطلات","اعتيادى 21","عارضه 6","غياب باذن","غياب بدون اذن","بدل اغتراب ","بدل مواصلات","بدل وجبه","بدل غلاء معيشه","بدل موبايل","بدل ملبس","بدل طبيعة عمل","مكافات","جزاء","قرض"]

{"sheet":"نوفمبر","index":14,"n_rows":1,"n_cols":28,"rows_kept":1,"cut":false,"hidden":false,"merged":[]}
["الكود","اليوم","التاريخ","الحضور","الانصراف","عدد الساعات ","الفعلى","عدد الاضافى","التأخير\nساعات","عدد\nالتأخيرات","اجر الساعه","اضافى 1","اضافى2","عطلات","اعتيادى 21","عارضه 6","غياب باذن","غياب بدون اذن","بدل اغتراب ","بدل مواصلات","بدل وجبه","بدل غلاء معيشه","بدل موبايل","بدل ملبس","بدل طبيعة عمل","مكافات","جزاء","قرض"]

{"sheet":"ديسمبر","index":15,"n_rows":1,"n_cols":28,"rows_kept":1,"cut":false,"hidden":false,"merged":[]}
["الكود","اليوم","التاريخ","الحضور","الانصراف","عدد الساعات ","الفعلى","عدد الاضافى","التأخير\nساعات","عدد\nالتأخيرات","اجر الساعه","اضافى 1","اضافى2","عطلات","اعتيادى 21","عارضه 6","غياب باذن","غياب بدون اذن","بدل اغتراب ","بدل مواصلات","بدل وجبه","بدل غلاء معيشه","بدل موبايل","بدل ملبس","بدل طبيعة عمل","مكافات","جزاء","قرض"]