{"text_format":"1","workbook":"xlsx","n_sheets":2,"sheets":["ورقة1","ورقة2"],"not_rendered":{"charts":0,"images":0,"macros":1,"external_links":0,"defined_names":2,"comments":0,"pivot_tables":0},"unopened":[],"bounds":{"document_bytes":16777216,"sheet_cells":100000,"rows_first":2000,"rows_last":500,"rows_between":2000,"halvings":0,"cell_chars":16384,"cell_head_chars":4096},"cells_cut":0,"cells_raw":0,"read":"whole","date_system":"1900"}

{"sheet":"ورقة1","index":0,"n_rows":545,"n_cols":16,"rows_kept":545,"cut":false,"hidden":false,"merged":[[1,12,1,16],[2,12,2,16],[3,13,3,16]]}
["م","كود الطالب","اسم الطالب","الصف","الرقم القومي","عربي","E","رياضة","علوم","دراسات"]
[1]
[2]
[3]
[4]
[5,null,null,null,null,null,null,null,null,null,null,{"$f":"IFERROR(VLOOKUP($L$3,#REF!,5,FALSE),\"\")","v":""},{"$f":"IFERROR(VLOOKUP($L$3,B5:J449,6,FALSE),\"\")","v":""},{"$f":"IFERROR(VLOOKUP($L$3,C5:K449,7,FALSE),\"\")","v":""},{"$f":"IFERROR(VLOOKUP($L$3,D5:L449,8,FALSE),\"\")","v":""},{"$f":"IFERROR(VLOOKUP($L$3,E5:M449,9,FALSE),\"\")","v":""}]
[6]
[7]
[8]
[9]
[10]
[11]
[12]
[13]
[14]
[15]
[16]
[17]
[18]
[19]
[20,20,"محمد","الرابع",2222222222222,"f66666","g7777","h88888","i9999","j101010"]
[21,21,"احمد","الثالث",1111111111111,"a1111","b22222","c33333","d44444","e555555"]
[22,22,"محمد","الرابع",2222222222222,"f66666","g7777","h88888","i9999","j101010"]
[23,23,"احمد","الثالث",1111111111111,"a1111","b22222","c33333","d44444","e555555"]
[24,24,"محمد","الرابع",2222222222222,"f66666","g7777","h88888","i9999","j101010"]
[25,25,"احمد","الثالث",1111111111111,"a1111","b22222","c33333","d44444","e555555"]
[26,26,"محمد","الرابع",2222222222222,"f66666","g7777","h88888","i9999","j101010"]
[27,27,"احمد","الثالث",1111111111111,"a1111","b22222","c33333","d44444","e555555"]
[28,28,"محمد","الرابع",2222222222222,"f66666","g7777","h88888","i9999","j101010"]
[29,29,"احمد","الثالث",1111111111111,"a1111","b22222","c33333","d44444","e555555"]
[30,30,"محمد","الرابع",2222222222222,"f66666","g7777","h88888","i9999","j101010"]
[31,31,"احمد","الثالث",1111111111111,"a1111","b22222","c33333","d44444","e555555"]
[32,32,"محمد","الرابع",2222222222222,"f66666","g7777","h88888","i9999","j101010"]
[33,33,"احمد","الثالث",1111111111111,"a1111","b22222","c33333","d44444","e555555"]
[34,34,"محمد","الرابع",2222222222222,"f66666","g7777","h88888","i9999","j101010"]
[35,35,"احمد","الثالث",1111111111111,"a1111","b22222","c33333","d44444","e555555"]
[36,36,"محمد","الرابع",2222222222222,"f66666","g7777","h88888","i9999","j101010"]
[37,37,"احمد","الثالث",1111111111111,"a1111","b22222","c33333","d44444","e555555"]
[38,38,"محمد","الرابع",2222222222222,"f66666","g7777","h88888","i9999","j101010"]
[39,39,"احمد","الثالث",1111111111111,"a1111","b22222","c33333","d44444","e555555"]
[40,40,"محمد","الرابع",2222222222222,"f66666","g7777","h88888","i9999","j101010"]
[41,41,"احمد","الثالث",1111111111111,"a1111","b22222","c33333","d44444","e555555"]
[42,42,"محمد","الرابع",2222222222222,"f66666","g7777","h88888","i9999","j101010"]
[43,43,"احمد","الثالث",1111111111111,"a1111","b22222","c33333","d44444","e555555"]
[44,44,"محمد","الرابع",2222222222222,"f66666","g7777","h88888","i9999","j101010"]
[45,45,"احمد","الثالث",1111111111111,"a1111","b22222","c33333","d44444","e555555"]
[46,46,"محمد","الرابع",2222222222222,"f66666","g7777","h88888","i9999","j101010"]
[47,47,"احمد","الثالث",1111111111111,"a1111","b22222","c33333","d44444","e555555"]
[48,48,"محمد","الرابع",2222222222222,"f66666","g7777","h88888","i9999","j101010"]
[49,49,"احمد","الثالث",1111111111111,"a1111","b22222","c33333","d44444","e555555"]
[50,50,"محمد","الرابع",2222222222222,"f66666","g7777","h88888","i9999","j101010"]
[51,51,"احمد","الثالث",1111111111111,"a1111","b22222","c33333","d44444","e555555"]
[52,52,"محمد","الرابع",2222222222222,"f66666","g7777","h88888","i9999","j101010"]
[53,53,"احمد","الثالث",1111111111111,"a1111","b22222","c33333","d44444","e555555"]
[54,54,"محمد","الرابع",2222222222222,"f66666","g7777","h88888","i9999","j101010"]
[55,55,"احمد","الثالث",1111111111111,"a1111","b22222","c33333","d44444","e555555"]
[56,56,"محمد","الرابع",2222222222222,"f66666","g7777","h88888","i9999","j101010"]
[57,57,"احمد","الثالث",1111111111111,"a1111","b22222","c33333","d44444","e555555"]
[58,58,"محمد","الرابع",2222222222222,"f66666","g7777","h88888","i9999","j101010"]
[59,59,"احمد","الثالث",1111111111111,"a1111","b22222","c33333","d44444","e555555"]
[60,60,"محمد","الرابع",2222222222222,"f66666","g7777","h88888","i9999","j101010"]
[61,61,"احمد","الثالث",1111111111111,"a1111","b22222","c33333","d44444","e555555"]
[62,62,"محمد","الرابع",2222222222222,"f66666","g7777","h88888","i9999","j101010"]
[63,63,"احمد","الثالث",1111111111111,"a1111","b22222","c33333","d44444","e555555"]
[64,64,"محمد","الرابع",2222222222222,"f66666","g7777","h88888","i9999","j101010"]
[65,65,"احمد","الثالث",1111111111111,"a1111","b22222","c33333","d44444","e555555"]
[66,66,"محمد","الرابع",2222222222222,"f66666","g7777","h88888","i9999","j101010"]
[67,67,"احمد","الثالث",1111111111111,"a1111","b22222","c33333","d44444","e555555"]
[68,68,"محمد","الرابع",2222222222222,"f66666","g7777","h88888","i9999","j101010"]
[69,69,"احمد","الثالث",1111111111111,"a1111","b22222","c33333","d44444","e555555"]
[70,70,"محمد","الرابع",2222222222222,"f66666","g7777","h88888","i9999","j101010"]
[71,71,"احمد","الثالث",1111111111111,"a1111","b22222","c33333","d44444","e555555"]
[72,72,"محمد","الرابع",2222222222222,"f66666","g7777","h88888","i9999","j101010"]
[73,73,"احمد","الثالث",1111111111111,"a1111","b22222","c33333","d44444","e555555"]
[74,74,"محمد","الرابع",2222222222222,"f66666","g7777","h88888","i9999","j101010"]
[75,75,"احمد","الثالث",1111111111111,"a1111","b22222","c33333","d44444","e555555"]
[76,76,"محمد","الرابع",2222222222222,"f66666","g7777","h88888","i9999","j101010"]
[77,77,"احمد","الثالث",1111111111111,"a1111","b22222","c33333","d44444","e555555"]
[78,78,"محمد","الرابع",2222222222222,"f66666","g7777","h88888","i9999","j101010"]
[79,79,"احمد","الثالث",1111111111111,"a1111","b22222","c33333","d44444","e555555"]
[80,80,"محمد","الرابع",2222222222222,"f66666","g7777","h88888","i9999","j101010"]
[81,81,"احمد","الثالث",1111111111111,"a1111","b22222","c33333","d44444","e555555"]
[82,82,"محمد","الرابع",2222222222222,"f66666","g7777","h88888","i9999","j101010"]
[83,83,"احمد","الثالث",1111111111111,"a1111","b22222","c33333","d44444","e555555"]
[84,84,"محمد","الرابع",2222222222222,"f66666","g7777","h88888","i9999","j101010"]
[85,85,"احمد","الثالث",1111111111111,"a1111","b22222","c33333","d44444","e555555"]
[86,86,"محمد","الرابع",2222222222222,"f66666","g7777","h88888","i9999","j101010"]
[87,87,"احمد","الثالث",1111111111111,"a1111","b22222","c33333","d44444","e555555"]
[88,88,"محمد","الرابع",2222222222222,"f66666","g7777","h88888","i9999","j101010"]
[89,89,"احمد","الثالث",1111111111111,"a1111","b22222","c33333","d44444","e555555"]
[90,90,"محمد","الرابع",2222222222222,"f66666","g7777","h88888","i9999","j101010"]
[91,91,"احمد","الثالث",1111111111111,"a1111","b22222","c33333","d44444","e555555"]
[92,92,"محمد","الرابع",2222222222222,"f66666","g7777","h88888","i9999","j101010"]
[93,93,"احمد","الثالث",1111111111111,"a1111","b22222","c33333","d44444","e555555"]
[94,94,"محمد","الرابع",2222222222222,"f66666","g7777","h88888","i9999","j101010"]
[95,95,"احمد","الثالث",1111111111111,"a1111","b22222","c33333","d44444","e555555"]
[96,96,"محمد","الرابع",2222222222222,"f66666","g7777","h88888","i9999","j101010"]
[97,97,"احمد","الثالث",1111111111111,"a1111","b22222","c33333","d44444","e555555"]
[98,98,"محمد","الرابع",2222222222222,"f66666","g7777","h88888","i9999","j101010"]
[99,99,"احمد","الثالث",1111111111111,"a1111","b22222","c33333","d44444","e555555"]
[100,100,"محمد","الرابع",2222222222222,"f66666","g7777","h88888","i9999","j101010"]
[101,101,"احمد","الثالث",1111111111111,"a1111","b22222","c33333","d44444","e555555"]
[102,102,"محمد","الرابع",2222222222222,"f66666","g7777","h88888","i9999","j101010"]
[103,103,"احمد","الثالث",1111111111111,"a1111","b22222","c33333","d44444","e555555"]
[104,104,"محمد","الرابع",2222222222222,"f66666","g7777","h88888","i9999","j101010"]
[105,105,"احمد","الثالث",1111111111111,"a1111","b22222","c33333","d44444","e555555"]
[106,106,"محمد","الرابع",2222222222222,"f66666","g7777","h88888","i9999","j101010"]
[107,107,"احمد","الثالث",1111111111111,"a1111","b22222","c33333","d44444","e555555"]
[108,108,"محمد","الرابع",2222222222222,"f66666","g7777","h88888","i9999","j101010"]
[109,109,"احمد","الثالث",1111111111111,"a1111","b22222","c33333","d44444","e555555"]
[110,110,"محمد","الرابع",2222222222222,"f66666","g7777","h88888","i9999","j101010"]
[111,111,"احمد","الثالث",1111111111111,"a1111","b22222","c33333","d44444","e555555"]
[112,112,"محمد","الرابع",2222222222222,"f66666","g7777","h88888","i9999","j101010"]
[113,113,"احمد","الثالث",1111111111111,"a1111","b22222","c33333","d44444","e555555"]
[114,114,"محمد","الرابع",2222222222222,"f66666","g7777","h88888","i9999","j101010"]
[115,115,"احمد","الثالث",1111111111111,"a1111","b22222","c33333","d44444","e555555"]
[116,116,"محمد","الرابع",2222222222222,"f66666","g7777","h88888","i9999","j101010"]
[117,117,"احمد","الثالث",1111111111111,"a1111","b22222","c33333","d44444","e555555"]
[118,118,"محمد","الرابع",2222222222222,"f66666","g7777","h88888","i9999","j101010"]
[119,119,"احمد","الثالث",1111111111111,"a1111","b22222","c33333","d44444","e555555"]
[120,120,"محمد","الرابع",2222222222222,"f66666","g7777","h88888","i9999","j101010"]
[121,121,"احمد","الثالث",1111111111111,"a1111","b22222","c33333","d44444","e555555"]
[122,122,"محمد","الرابع",2222222222222,"f66666","g7777","h88888","i9999","j101010"]
[123,123,"احمد","الثالث",1111111111111,"a1111","b22222","c33333","d44444","e555555"]
[124,124,"محمد","الرابع",2222222222222,"f66666","g7777","h88888","i9999","j101010"]
[125,125,"احمد","الثالث",1111111111111,"a1111","b22222","c33333","d44444","e555555"]
[126,126,"محمد","الرابع",2222222222222,"f66666","g7777","h88888","i9999","j101010"]
[127,127,"احمد","الثالث",1111111111111,"a1111","b22222","c33333","d44444","e555555"]
[128,128,"محمد","الرابع",2222222222222,"f66666","g7777","h88888","i9999","j101010"]
[129,129,"احمد","الثالث",1111111111111,"a1111","b22222","c33333","d44444","e555555"]
[130,130,"محمد","الرابع",2222222222222,"f66666","g7777","h88888","i9999","j101010"]
[131,131,"احمد","الثالث",1111111111111,"a1111","b22222","c33333","d44444","e555555"]
[132,132,"محمد","الرابع",2222222222222,"f66666","g7777","h88888","i9999","j101010"]
[133,133,"احمد","الثالث",1111111111111,"a1111","b22222","c33333","d44444","e555555"]
[134,134,"محمد","الرابع",2222222222222,"f66666","g7777","h88888","i9999","j101010"]
[135,135,"احمد","الثالث",1111111111111,"a1111","b22222","c33333","d44444","e555555"]
[136,136,"محمد","الرابع",2222222222222,"f66666","g7777","h88888","i9999","j101010"]
[137,137,"احمد","الثالث",1111111111111,"a1111","b22222","c33333","d44444","e555555"]
[138,138,"محمد","الرابع",2222222222222,"f66666","g7777","h88888","i9999","j101010"]
[139,139,"احمد","الثالث",1111111111111,"a1111","b22222","c33333","d44444","e555555"]
[140,140,"محمد","الرابع",2222222222222,"f66666","g7777","h88888","i9999","j101010"]
[141,141,"احمد","الثالث",1111111111111,"a1111","b22222","c33333","d44444","e555555"]
[142,142,"محمد","الرابع",2222222222222,"f66666","g7777","h88888","i9999","j101010"]
[143,143,"احمد","الثالث",1111111111111,"a1111","b22222","c33333","d44444","e555555"]
[144,144,"محمد","الرابع",2222222222222,"f66666","g7777","h88888","i9999","j101010"]
[145,145,"احمد","الثالث",1111111111111,"a1111","b22222","c33333","d44444","e555555"]
[146,146,"محمد","الرابع",2222222222222,"f66666","g7777","h88888","i9999","j101010"]
[147,147,"احمد","الثالث",1111111111111,"a1111","b22222","c33333","d44444","e555555"]
[148,148,"محمد","الرابع",2222222222222,"f66666","g7777","h88888","i9999","j101010"]
[149,149,"احمد","الثالث",1111111111111,"a1111","b22222","c33333","d44444","e555555"]
[150,150,"محمد","الرابع",2222222222222,"f66666","g7777","h88888","i9999","j101010"]
[151,151,"احمد","الثالث",1111111111111,"a1111","b22222","c33333","d44444","e555555"]
[152,152,"محمد","الرابع",2222222222222,"f66666","g7777","h88888","i9999","j101010"]
[153,153,"احمد","الثالث",1111111111111,"a1111","b22222","c33333","d44444","e555555"]
[154,154,"محمد","الرابع",2222222222222,"f66666","g7777","h88888","i9999","j101010"]
[155,155,"احمد","الثالث",1111111111111,"a1111","b22222","c33333","d44444","e555555"]
[156,156,"محمد","الرابع",2222222222222,"f66666","g7777","h88888","i9999","j101010"]
[157,157,"احمد","الثالث",1111111111111,"a1111","b22222","c33333","d44444","e555555"]
[158,158,"محمد","الرابع",2222222222222,"f66666","g7777","h88888","i9999","j101010"]
[159,159,"احمد","الثالث",1111111111111,"a1111","b22222","c33333","d44444","e555555"]
[160,160,"محمد","الرابع",2222222222222,"f66666","g7777","h88888","i9999","j101010"]
[161,161,"احمد","الثالث",1111111111111,"a1111","b22222","c33333","d44444","e555555"]
[162,162,"محمد","الرابع",2222222222222,"f66666","g7777","h88888","i9999","j101010"]
[163,163,"احمد","الثالث",1111111111111,"a1111","b22222","c33333","d44444","e555555"]
[164,164,"محمد","الرابع",2222222222222,"f66666","g7777","h88888","i9999","j101010"]
[165,165,"احمد","الثالث",1111111111111,"a1111","b22222","c33333","d44444","e555555"]
[166,166,"محمد","الرابع",2222222222222,"f66666","g7777","h88888","i9999","j101010"]
[167,167,"احمد","الثالث",1111111111111,"a1111","b22222","c33333","d44444","e555555"]
[168,168,"محمد","الرابع",2222222222222,"f66666","g7777","h88888","i9999","j101010"]
[169,169,"احمد","الثالث",1111111111111,"a1111","b22222","c33333","d44444","e555555"]
[170,170,"محمد","الرابع",2222222222222,"f66666","g7777","h88888","i9999","j101010"]
[171,171,"احمد","الثالث",1111111111111,"a1111","b22222","c33333","d44444","e555555"]
[172,172,"محمد","الرابع",2222222222222,"f66666","g7777","h88888","i9999","j101010"]
[173,173,"احمد","الثالث",1111111111111,"a1111","b22222","c33333","d44444","e555555"]
[174,174,"محمد","الرابع",2222222222222,"f66666","g7777","h88888","i9999","j101010"]
[175,175,"احمد","الثالث",1111111111111,"a1111","b22222","c33333","d44444","e555555"]
[176,176,"محمد","الرابع",2222222222222,"f66666","g7777","h88888","i9999","j101010"]
[177,177,"احمد","الثالث",1111111111111,"a1111","b22222","c33333","d44444","e555555"]
[178,178,"محمد","الرابع",2222222222222,"f66666","g7777","h88888","i9999","j101010"]
[179,179,"احمد","الثالث",1111111111111,"a1111","b22222","c33333","d44444","e555555"]
[180,180,"محمد","الرابع",2222222222222,"f66666","g7777","h88888","i9999","j101010"]
[181,181,"احمد","الثالث",1111111111111,"a1111","b22222","c33333","d44444","e555555"]
[182,182,"محمد","الرابع",2222222222222,"f66666","g7777","h88888","i9999","j101010"]
[183,183,"احمد","الثالث",1111111111111,"a1111","b22222","c33333","d44444","e555555"]
[184,184,"محمد","الرابع",2222222222222,"f66666","g7777","h88888","i9999","j101010"]
[185,185,"احمد","الثالث",1111111111111,"a1111","b22222","c33333","d44444","e555555"]
[186,186,"محمد","الرابع",2222222222222,"f66666","g7777","h88888","i9999","j101010"]
[187,187,"احمد","الثالث",1111111111111,"a1111","b22222","c33333","d44444","e555555"]
[188,188,"محمد","الرابع",2222222222222,"f66666","g7777","h88888","i9999","j101010"]
[189,189,"احمد","الثالث",1111111111111,"a1111","b22222","c33333","d44444","e555555"]
[190,190,"محمد","الرابع",2222222222222,"f66666","g7777","h88888","i9999","j101010"]
[191,191,"احمد","الثالث",1111111111111,"a1111","b22222","c33333","d44444","e555555"]
[192,192,"محمد","الرابع",2222222222222,"f66666","g7777","h88888","i9999","j101010"]
[193,193,"احمد","الثالث",1111111111111,"a1111","b22222","c33333","d44444","e555555"]
[194,194,"محمد","الرابع",2222222222222,"f66666","g7777","h88888","i9999","j101010"]
[195,195,"احمد","الثالث",1111111111111,"a1111","b22222","c33333","d44444","e555555"]
[196,196,"محمد","الرابع",2222222222222,"f66666","g7777","h88888","i9999","j101010"]
[197,197,"احمد","الثالث",1111111111111,"a1111","b22222","c33333","d44444","e555555"]
[198,198,"محمد","الرابع",2222222222222,"f66666","g7777","h88888","i9999","j101010"]
[199,199,"احمد","الثالث",1111111111111,"a1111","b22222","c33333","d44444","e555555"]
{"$rows_left_out":346}
{"sheet":"ورقة2","index":1,"n_rows":38,"n_cols":10,"rows_kept":38,"cut":false,"hidden":false,"merged":[[32,2,32,5],[33,2,33,5],[34,3,34,5],[35,3,35,5],[22,2,22,5],[23,2,23,5],[24,3,24,5],[25,3,25,5],[12,2,12,5],[13,2,13,5],[14,3,14,5],[15,3,15,5],[2,2,2,5],[4,3,4,5],[3,2,3,5],[5,3,5,5]]}
[null,"إدارة /",null,null,null,null,"من",1,"الى",4]
[null,"مدرسة /"]
[null,"الكود "]
[null,"الاسم",{"$f":"IFERROR(INDEX(ورقة1!C:C,MATCH($C3,ورقة1!$B:$B,0)),\"-\")","v":"-"}]
[null,"الصف",null,{"$f":"IFERROR(INDEX(ورقة1!D:D,MATCH($C3,ورقة1!$B:$B,0)),\"-\")","v":"-"}]
[null,"الرقم القومي",null,{"$f":"IFERROR(INDEX(ورقة1!E:E,MATCH($C3,ورقة1!$B:$B,0)),\"-\")","v":"-"}]
[null,"رمزعربي","Eرمز","رمزرياضة","رمزعلوم","رمز دراسات"]
[null,{"$f":"IFERROR(INDEX(ورقة1!F:F,MATCH($C3,ورقة1!$B:$B,0)),\"-\")","v":"-"},{"$f":"IFERROR(INDEX(ورقة1!G:G,MATCH($C3,ورقة1!$B:$B,0)),\"-\")","v":"-"},{"$f":"IFERROR(INDEX(ورقة1!H:H,MATCH($C3,ورقة1!$B:$B,0)),\"-\")","v":"-"},{"$f":"IFERROR(INDEX(ورقة1!I:I,MATCH($C3,ورقة1!$B:$B,0)),\"-\")","v":"-"},{"$f":"IFERROR(INDEX(ورقة1!J:J,MATCH($C3,ورقة1!$B:$B,0)),\"-\")","v":"-"}]
[]
[]
[null,"إدارة /"]
[null,"مدرسة /"]
[null,"الكود ",{"$f":"C3+1","v":1}]
[null,"الاسم",{"$f":"IFERROR(INDEX(ورقة1!C:C,MATCH($C13,ورقة1!$B:$B,0)),\"-\")","v":"-"}]
[null,"الصف",null,{"$f":"IFERROR(INDEX(ورقة1!D:D,MATCH($C13,ورقة1!$B:$B,0)),\"-\")","v":"-"}]
[null,"الرقم القومي",null,{"$f":"IFERROR(INDEX(ورقة1!E:E,MATCH($C13,ورقة1!$B:$B,0)),\"-\")","v":"-"}]
[null,"رمزعربي","Eرمز","رمزرياضة","رمزعلوم","رمز دراسات"]
[null,{"$f":"IFERROR(INDEX(ورقة1!F:F,MATCH($C13,ورقة1!$B:$B,0)),\"-\")","v":"-"},{"$f":"IFERROR(INDEX(ورقة1!G:G,MATCH($C13,ورقة1!$B:$B,0)),\"-\")","v":"-"},{"$f":"IFERROR(INDEX(ورقة1!H:H,MATCH($C13,ورقة1!$B:$B,0)),\"-\")","v":"-"},{"$f":"IFERROR(INDEX(ورقة1!I:I,MATCH($C13,ورقة1!$B:$B,0)),\"-\")","v":"-"},{"$f":"IFERROR(INDEX(ورقة1!J:J,MATCH($C13,ورقة1!$B:$B,0)),\"-\")","v":"-"}]
[]
[]
[null,"إدارة /"]
[null,"مدرسة /"]
[null,"الكود ",{"$f":"C13+1","v":2}]
[null,"الاسم",{"$f":"IFERROR(INDEX(ورقة1!C:C,MATCH($C23,ورقة1!$B:$B,0)),\"-\")","v":"-"}]
[null,"الصف",null,{"$f":"IFERROR(INDEX(ورقة1!D:D,MATCH($C23,ورقة1!$B:$B,0)),\"-\")","v":"-"}]
[null,"الرقم القومي",null,{"$f":"IFERROR(INDEX(ورقة1!E:E,MATCH($C23,ورقة1!$B:$B,0)),\"-\")","v":"-"}]
[null,"رمزعربي","Eرمز","رمزرياضة","رمزعلوم","رمز دراسات"]
[null,{"$f":"IFERROR(INDEX(ورقة1!F:F,MATCH($C23,ورقة1!$B:$B,0)),\"-\")","v":"-"},{"$f":"IFERROR(INDEX(ورقة1!G:G,MATCH($C23,ورقة1!$B:$B,0)),\"-\")","v":"-"},{"$f":"IFERROR(INDEX(ورقة1!H:H,MATCH($C23,ورقة1!$B:$B,0)),\"-\")","v":"-"},{"$f":"IFERROR(INDEX(ورقة1!I:I,MATCH($C23,ورقة1!$B:$B,0)),\"-\")","v":"-"},{"$f":"IFERROR(INDEX(ورقة1!J:J,MATCH($C23,ورقة1!$B:$B,0)),\"-\")","v":"-"}]
[]
[]
[null,"إدارة /"]
[null,"مدرسة /"]
[null,"الكود ",{"$f":"C23+1","v":3}]
[null,"الاسم",{"$f":"IFERROR(INDEX(ورقة1!C:C,MATCH($C33,ورقة1!$B:$B,0)),\"-\")","v":"-"}]
[null,"الصف",null,{"$f":"IFERROR(INDEX(ورقة1!D:D,MATCH($C33,ورقة1!$B:$B,0)),\"-\")","v":"-"}]
[null,"الرقم القومي",null,{"$f":"IFERROR(INDEX(ورقة1!E:E,MATCH($C33,ورقة1!$B:$B,0)),\"-\")","v":"-"}]
[null,"رمزعربي","Eرمز","رمزرياضة","رمزعلوم","رمز دراسات"]
[null,{"$f":"IFERROR(INDEX(ورقة1!F:F,MATCH($C33,ورقة1!$B:$B,0)),\"-\")","v":"-"},{"$f":"IFERROR(INDEX(ورقة1!G:G,MATCH($C33,ورقة1!$B:$B,0)),\"-\")","v":"-"},{"$f":"IFERROR(INDEX(ورقة1!H:H,MATCH($C33,ورقة1!$B:$B,0)),\"-\")","v":"-"},{"$f":"IFERROR(INDEX(ورقة1!I:I,MATCH($C33,ورقة1!$B:$B,0)),\"-\")","v":"-"},{"$f":"IFERROR(INDEX(ورقة1!J:J,MATCH($C33,ورقة1!$B:$B,0)),\"-\")","v":"-"}]