{"text_format":"1","workbook":"xlsx","n_sheets":2,"sheets":["ورقة1","ورقة2"],"not_rendered":{"charts":0,"images":0,"macros":1,"external_links":0,"defined_names":2,"comments":0,"pivot_tables":0},"unopened":[],"bounds":{"document_bytes":16777216,"sheet_cells":100000,"rows_first":2000,"rows_last":500,"rows_between":2000,"halvings":0,"cell_chars":16384,"cell_head_chars":4096},"cells_cut":0,"cells_raw":0,"read":"whole","date_system":"1900"}

{"sheet":"ورقة1","index":0,"n_rows":545,"n_cols":16,"rows_kept":545,"cut":false,"hidden":false,"merged":[[1,12,1,16],[2,12,2,16],[3,13,3,16]]}
["م","كود الطالب","اسم الطالب","الصف","الرقم القومي","عربي","E","رياضة","علوم","دراسات"]
[1,"code1","احمد1","الثالث1",1111111,"a1","b1","c1","d1","e1"]
[2,"code220","احمد2","الثالث2",1111112,"a2","b2","c2","d2","e2"]
[3,"code3","احمد3","الثالث3",1111113,"a3","b3","c3","d3","e3"]
[4,"code4","احمد4","الثالث4",1111114,"a4","b4","c4","d4","e4"]
[5,"code5","احمد5","الثالث5",1111115,"a5","b5","c5","d5","e5",null,{"$f":"IFERROR(VLOOKUP($L$3,#REF!,5,FALSE),\"\")","v":""},{"$f":"IFERROR(VLOOKUP($L$3,B5:J449,6,FALSE),\"\")","v":""},{"$f":"IFERROR(VLOOKUP($L$3,C5:K449,7,FALSE),\"\")","v":""},{"$f":"IFERROR(VLOOKUP($L$3,D5:L449,8,FALSE),\"\")","v":""},{"$f":"IFERROR(VLOOKUP($L$3,E5:M449,9,FALSE),\"\")","v":""}]
[6,"code65","احمد6","الثالث6",1111116,"a6","b6","c6","d6","e6"]
[7,"code7","احمد7","الثالث7",1111117,"a7","b7","c7","d7","e7"]
[8,"code8","احمد8","الثالث8",1111118,"a8","b8","c8","d8","e8"]
[9,"code9","احمد9","الثالث9",1111119,"a9","b9","c9","d9","e9"]
[10,"code10","احمد10","الثالث10",1111120,"a10","b10","c10","d10","e10"]
[11,"code2","احمد11","الثالث11",1111121,"a11","b11","c11","d11","e11"]
[12,"code12","احمد12","الثالث12",1111122,"a12","b12","c12","d12","e12"]
[13,"code13","احمد13","الثالث13",1111123,"a13","b13","c13","d13","e13"]
[14,"code14","احمد14","الثالث14",1111124,"a14","b14","c14","d14","e14"]
[15,"code15","احمد15","الثالث15",1111125,"a15","b15","c15","d15","e15"]
[16,"code16","احمد16","الثالث16",1111126,"a16","b16","c16","d16","e16"]
[17,"code17","احمد17","الثالث17",1111127,"a17","b17","c17","d17","e17"]
[18,"code18","احمد18","الثالث18",1111128,"a18","b18","c18","d18","e18"]
[19,"code19","احمد19","الثالث19",1111129,"a19","b19","c19","d19","e19"]
[20,"code20","احمد20","الثالث20",1111130,"a20","b20","c20","d20","e20"]
[21,"code21","احمد21","الثالث21",1111131,"a21","b21","c21","d21","e21"]
[22,"code22","احمد22","الثالث22",1111132,"a22","b22","c22","d22","e22"]
[23,"code23","احمد23","الثالث23",1111133,"a23","b23","c23","d23","e23"]
[24,"code24","احمد24","الثالث24",1111134,"a24","b24","c24","d24","e24"]
[25,"code25","احمد25","الثالث25",1111135,"a25","b25","c25","d25","e25"]
[26,"code26","احمد26","الثالث26",1111136,"a26","b26","c26","d26","e26"]
[27,"code27","احمد27","الثالث27",1111137,"a27","b27","c27","d27","e27"]
[28,"code28","احمد28","الثالث28",1111138,"a28","b28","c28","d28","e28"]
[29,"code29","احمد29","الثالث29",1111139,"a29","b29","c29","d29","e29"]
[30,"code30","احمد30","الثالث30",1111140,"a30","b30","c30","d30","e30"]
[31,"code31","احمد31","الثالث31",1111141,"a31","b31","c31","d31","e31"]
[32,"code32","احمد32","الثالث32",1111142,"a32","b32","c32","d32","e32"]
[33,"code33","احمد33","الثالث33",1111143,"a33","b33","c33","d33","e33"]
[34,"code34","احمد34","الثالث34",1111144,"a34","b34","c34","d34","e34"]
[35,"code35","احمد35","الثالث35",1111145,"a35","b35","c35","d35","e35"]
[36,"code36","احمد36","الثالث36",1111146,"a36","b36","c36","d36","e36"]
[37,"code37","احمد37","الثالث37",1111147,"a37","b37","c37","d37","e37"]
[38,"code38","احمد38","الثالث38",1111148,"a38","b38","c38","d38","e38"]
[39,"code39","احمد39","الثالث39",1111149,"a39","b39","c39","d39","e39"]
[40,"code40","احمد40","الثالث40",1111150,"a40","b40","c40","d40","e40"]
[41,"code41","احمد41","الثالث41",1111151,"a41","b41","c41","d41","e41"]
[42,"code42","احمد42","الثالث42",1111152,"a42","b42","c42","d42","e42"]
[43,"code43","احمد43","الثالث43",1111153,"a43","b43","c43","d43","e43"]
[44,"code44","احمد44","الثالث44",1111154,"a44","b44","c44","d44","e44"]
[45,"code45","احمد45","الثالث45",1111155,"a45","b45","c45","d45","e45"]
[46,"code46","احمد46","الثالث46",1111156,"a46","b46","c46","d46","e46"]
[47,"code47","احمد47","الثالث47",1111157,"a47","b47","c47","d47","e47"]
[48,"code48","احمد48","الثالث48",1111158,"a48","b48","c48","d48","e48"]
[49,"code49","احمد49","الثالث49",1111159,"a49","b49","c49","d49","e49"]
[50,"code50","احمد50","الثالث50",1111160,"a50","b50","c50","d50","e50"]
[51,"code51","احمد51","الثالث51",1111161,"a51","b51","c51","d51","e51"]
[52,"code52","احمد52","الثالث52",1111162,"a52","b52","c52","d52","e52"]
[53,"code53","احمد53","الثالث53",1111163,"a53","b53","c53","d53","e53"]
[54,"code54","احمد54","الثالث54",1111164,"a54","b54","c54","d54","e54"]
[55,"code55","احمد55","الثالث55",1111165,"a55","b55","c55","d55","e55"]
[56,"code56","احمد56","الثالث56",1111166,"a56","b56","c56","d56","e56"]
[57,"code57","احمد57","الثالث57",1111167,"a57","b57","c57","d57","e57"]
[58,"code58","احمد58","الثالث58",1111168,"a58","b58","c58","d58","e58"]
[59,"code59","احمد59","الثالث59",1111169,"a59","b59","c59","d59","e59"]
[60,"code60","احمد60","الثالث60",1111170,"a60","b60","c60","d60","e60"]
[61,"code61","احمد61","الثالث61",1111171,"a61","b61","c61","d61","e61"]
[62,"code62","احمد62","الثالث62",1111172,"a62","b62","c62","d62","e62"]
[63,"code63","احمد63","الثالث63",1111173,"a63","b63","c63","d63","e63"]
[64,"code64","احمد64","الثالث64",1111174,"a64","b64","c64","d64","e64"]
[65,"code65","احمد65","الثالث65",1111175,"a65","b65","c65","d65","e65"]
[66,"code66","احمد66","الثالث66",1111176,"a66","b66","c66","d66","e66"]
[67,"code67","احمد67","الثالث67",1111177,"a67","b67","c67","d67","e67"]
[68,"code68","احمد68","الثالث68",1111178,"a68","b68","c68","d68","e68"]
[69,"code69","احمد69","الثالث69",1111179,"a69","b69","c69","d69","e69"]
[70,"code70","احمد70","الثالث70",1111180,"a70","b70","c70","d70","e70"]
[71,"code71","احمد71","الثالث71",1111181,"a71","b71","c71","d71","e71"]
[72,"code72","احمد72","الثالث72",1111182,"a72","b72","c72","d72","e72"]
[73,"code73","احمد73","الثالث73",1111183,"a73","b73","c73","d73","e73"]
[74,"code74","احمد74","الثالث74",1111184,"a74","b74","c74","d74","e74"]
[75,"code75","احمد75","الثالث75",1111185,"a75","b75","c75","d75","e75"]
[76,"code76","احمد76","الثالث76",1111186,"a76","b76","c76","d76","e76"]
[77,"code77","احمد77","الثالث77",1111187,"a77","b77","c77","d77","e77"]
[78,"code78","احمد78","الثالث78",1111188,"a78","b78","c78","d78","e78"]
[79,"code79","احمد79","الثالث79",1111189,"a79","b79","c79","d79","e79"]
[80,"code80","احمد80","الثالث80",1111190,"a80","b80","c80","d80","e80"]
[81,"code81","احمد81","الثالث81",1111191,"a81","b81","c81","d81","e81"]
[82,"code82","احمد82","الثالث82",1111192,"a82","b82","c82","d82","e82"]
[83,"code83","احمد83","الثالث83",1111193,"a83","b83","c83","d83","e83"]
[84,"code84","احمد84","الثالث84",1111194,"a84","b84","c84","d84","e84"]
[85,"code85","احمد85","الثالث85",1111195,"a85","b85","c85","d85","e85"]
[86,"code86","احمد86","الثالث86",1111196,"a86","b86","c86","d86","e86"]
[87,"code87","احمد87","الثالث87",1111197,"a87","b87","c87","d87","e87"]
[88,"code88","احمد88","الثالث88",1111198,"a88","b88","c88","d88","e88"]
[89,"code89","احمد89","الثالث89",1111199,"a89","b89","c89","d89","e89"]
[90,"code90","احمد90","الثالث90",1111200,"a90","b90","c90","d90","e90"]
[91,"code91","احمد91","الثالث91",1111201,"a91","b91","c91","d91","e91"]
[92,"code92","احمد92","الثالث92",1111202,"a92","b92","c92","d92","e92"]
[93,"code93","احمد93","الثالث93",1111203,"a93","b93","c93","d93","e93"]
[94,"code94","احمد94","الثالث94",1111204,"a94","b94","c94","d94","e94"]
[95,"code95","احمد95","الثالث95",1111205,"a95","b95","c95","d95","e95"]
[96,"code96","احمد96","الثالث96",1111206,"a96","b96","c96","d96","e96"]
[97,"code97","احمد97","الثالث97",1111207,"a97","b97","c97","d97","e97"]
[98,"code98","احمد98","الثالث98",1111208,"a98","b98","c98","d98","e98"]
[99,"code99","احمد99","الثالث99",1111209,"a99","b99","c99","d99","e99"]
[100,"code100","احمد100","الثالث100",1111210,"a100","b100","c100","d100","e100"]
[101,"code101","احمد101","الثالث101",1111211,"a101","b101","c101","d101","e101"]
[102,"code102","احمد102","الثالث102",1111212,"a102","b102","c102","d102","e102"]
[103,"code103","احمد103","الثالث103",1111213,"a103","b103","c103","d103","e103"]
[104,"code104","احمد104","الثالث104",1111214,"a104","b104","c104","d104","e104"]
[105,"code105","احمد105","الثالث105",1111215,"a105","b105","c105","d105","e105"]
[106,"code106","احمد106","الثالث106",1111216,"a106","b106","c106","d106","e106"]
[107,"code107","احمد107","الثالث107",1111217,"a107","b107","c107","d107","e107"]
[108,"code108","احمد108","الثالث108",1111218,"a108","b108","c108","d108","e108"]
[109,"code109","احمد109","الثالث109",1111219,"a109","b109","c109","d109","e109"]
[110,"code110","احمد110","الثالث110",1111220,"a110","b110","c110","d110","e110"]
[111,"code111","احمد111","الثالث111",1111221,"a111","b111","c111","d111","e111"]
[112,"code112","احمد112","الثالث112",1111222,"a112","b112","c112","d112","e112"]
[113,"code113","احمد113","الثالث113",1111223,"a113","b113","c113","d113","e113"]
[114,"code114","احمد114","الثالث114",1111224,"a114","b114","c114","d114","e114"]
[115,"code115","احمد115","الثالث115",1111225,"a115","b115","c115","d115","e115"]
[116,"code116","احمد116","الثالث116",1111226,"a116","b116","c116","d116","e116"]
[117,"code117","احمد117","الثالث117",1111227,"a117","b117","c117","d117","e117"]
[118,"code118","احمد118","الثالث118",1111228,"a118","b118","c118","d118","e118"]
[119,"code119","احمد119","الثالث119",1111229,"a119","b119","c119","d119","e119"]
[120,"code120","احمد120","الثالث120",1111230,"a120","b120","c120","d120","e120"]
[121,"code121","احمد121","الثالث121",1111231,"a121","b121","c121","d121","e121"]
[122,"code122","احمد122","الثالث122",1111232,"a122","b122","c122","d122","e122"]
[123,"code123","احمد123","الثالث123",1111233,"a123","b123","c123","d123","e123"]
[124,"code124","احمد124","الثالث124",1111234,"a124","b124","c124","d124","e124"]
[125,"code125","احمد125","الثالث125",1111235,"a125","b125","c125","d125","e125"]
[126,"code126","احمد126","الثالث126",1111236,"a126","b126","c126","d126","e126"]
[127,"code127","احمد127","الثالث127",1111237,"a127","b127","c127","d127","e127"]
[128,"code128","احمد128","الثالث128",1111238,"a128","b128","c128","d128","e128"]
[129,"code129","احمد129","الثالث129",1111239,"a129","b129","c129","d129","e129"]
[130,"code130","احمد130","الثالث130",1111240,"a130","b130","c130","d130","e130"]
[131,"code131","احمد131","الثالث131",1111241,"a131","b131","c131","d131","e131"]
[132,"code132","احمد132","الثالث132",1111242,"a132","b132","c132","d132","e132"]
[133,"code133","احمد133","الثالث133",1111243,"a133","b133","c133","d133","e133"]
[134,"code134","احمد134","الثالث134",1111244,"a134","b134","c134","d134","e134"]
[135,"code135","احمد135","الثالث135",1111245,"a135","b135","c135","d135","e135"]
[136,"code136","احمد136","الثالث136",1111246,"a136","b136","c136","d136","e136"]
[137,"code137","احمد137","الثالث137",1111247,"a137","b137","c137","d137","e137"]
[138,"code138","احمد138","الثالث138",1111248,"a138","b138","c138","d138","e138"]
[139,"code139","احمد139","الثالث139",1111249,"a139","b139","c139","d139","e139"]
[140,"code140","احمد140","الثالث140",1111250,"a140","b140","c140","d140","e140"]
[141,"code141","احمد141","الثالث141",1111251,"a141","b141","c141","d141","e141"]
[142,"code142","احمد142","الثالث142",1111252,"a142","b142","c142","d142","e142"]
[143,"code143","احمد143","الثالث143",1111253,"a143","b143","c143","d143","e143"]
[144,"code144","احمد144","الثالث144",1111254,"a144","b144","c144","d144","e144"]
[145,"code145","احمد145","الثالث145",1111255,"a145","b145","c145","d145","e145"]
[146,"code146","احمد146","الثالث146",1111256,"a146","b146","c146","d146","e146"]
[147,"code147","احمد147","الثالث147",1111257,"a147","b147","c147","d147","e147"]
[148,"code148","احمد148","الثالث148",1111258,"a148","b148","c148","d148","e148"]
[149,"code149","احمد149","الثالث149",1111259,"a149","b149","c149","d149","e149"]
[150,"code150","احمد150","الثالث150",1111260,"a150","b150","c150","d150","e150"]
[151,"code151","احمد151","الثالث151",1111261,"a151","b151","c151","d151","e151"]
[152,"code152","احمد152","الثالث152",1111262,"a152","b152","c152","d152","e152"]
[153,"code153","احمد153","الثالث153",1111263,"a153","b153","c153","d153","e153"]
[154,"code154","احمد154","الثالث154",1111264,"a154","b154","c154","d154","e154"]
[155,"code155","احمد155","الثالث155",1111265,"a155","b155","c155","d155","e155"]
[156,"code156","احمد156","الثالث156",1111266,"a156","b156","c156","d156","e156"]
[157,"code157","احمد157","الثالث157",1111267,"a157","b157","c157","d157","e157"]
[158,"code158","احمد158","الثالث158",1111268,"a158","b158","c158","d158","e158"]
[159,"code159","احمد159","الثالث159",1111269,"a159","b159","c159","d159","e159"]
[160,"code160","احمد160","الثالث160",1111270,"a160","b160","c160","d160","e160"]
[161,"code161","احمد161","الثالث161",1111271,"a161","b161","c161","d161","e161"]
[162,"code162","احمد162","الثالث162",1111272,"a162","b162","c162","d162","e162"]
[163,"code163","احمد163","الثالث163",1111273,"a163","b163","c163","d163","e163"]
[164,"code164","احمد164","الثالث164",1111274,"a164","b164","c164","d164","e164"]
[165,"code165","احمد165","الثالث165",1111275,"a165","b165","c165","d165","e165"]
[166,"code166","احمد166","الثالث166",1111276,"a166","b166","c166","d166","e166"]
[167,"code167","احمد167","الثالث167",1111277,"a167","b167","c167","d167","e167"]
[168,"code168","احمد168","الثالث168",1111278,"a168","b168","c168","d168","e168"]
[169,"code169","احمد169","الثالث169",1111279,"a169","b169","c169","d169","e169"]
[170,"code170","احمد170","الثالث170",1111280,"a170","b170","c170","d170","e170"]
[171,"code171","احمد171","الثالث171",1111281,"a171","b171","c171","d171","e171"]
[172,"code172","احمد172","الثالث172",1111282,"a172","b172","c172","d172","e172"]
[173,"code173","احمد173","الثالث173",1111283,"a173","b173","c173","d173","e173"]
[174,"code174","احمد174","الثالث174",1111284,"a174","b174","c174","d174","e174"]
[175,"code175","احمد175","الثالث175",1111285,"a175","b175","c175","d175","e175"]
[176,"code176","احمد176","الثالث176",1111286,"a176","b176","c176","d176","e176"]
[177,"code177","احمد177","الثالث177",1111287,"a177","b177","c177","d177","e177"]
[178,"code178","احمد178","الثالث178",1111288,"a178","b178","c178","d178","e178"]
[179,"code179","احمد179","الثالث179",1111289,"a179","b179","c179","d179","e179"]
[180,"code180","احمد180","الثالث180",1111290,"a180","b180","c180","d180","e180"]
[181,"code181","احمد181","الثالث181",1111291,"a181","b181","c181","d181","e181"]
[182,"code182","احمد182","الثالث182",1111292,"a182","b182","c182","d182","e182"]
[183,"code183","احمد183","الثالث183",1111293,"a183","b183","c183","d183","e183"]
[184,"code184","احمد184","الثالث184",1111294,"a184","b184","c184","d184","e184"]
[185,"code185","احمد185","الثالث185",1111295,"a185","b185","c185","d185","e185"]
[186,"code186","احمد186","الثالث186",1111296,"a186","b186","c186","d186","e186"]
[187,"code187","احمد187","الثالث187",1111297,"a187","b187","c187","d187","e187"]
[188,"code188","احمد188","الثالث188",1111298,"a188","b188","c188","d188","e188"]
[189,"code189","احمد189","الثالث189",1111299,"a189","b189","c189","d189","e189"]
[190,"code190","احمد190","الثالث190",1111300,"a190","b190","c190","d190","e190"]
[191,"code191","احمد191","الثالث191",1111301,"a191","b191","c191","d191","e191"]
[192,"code192","احمد192","الثالث192",1111302,"a192","b192","c192","d192","e192"]
[193,"code193","احمد193","الثالث193",1111303,"a193","b193","c193","d193","e193"]
[194,"code194","احمد194","الثالث194",1111304,"a194","b194","c194","d194","e194"]
[195,"code195","احمد195","الثالث195",1111305,"a195","b195","c195","d195","e195"]
[196,"code196","احمد196","الثالث196",1111306,"a196","b196","c196","d196","e196"]
[197,"code197","احمد197","الثالث197",1111307,"a197","b197","c197","d197","e197"]
[198,"code198","احمد198","الثالث198",1111308,"a198","b198","c198","d198","e198"]
[199,"code199","احمد199","الثالث199",1111309,"a199","b199","c199","d199","e199"]
{"$rows_left_out":346}
{"sheet":"ورقة2","index":1,"n_rows":38,"n_cols":12,"rows_kept":38,"cut":false,"hidden":false,"merged":[[12,2,12,5],[13,2,13,5],[14,3,14,5],[15,3,15,5],[2,2,2,5],[4,3,4,5],[3,2,3,5],[5,3,5,5],[32,2,32,5],[33,2,33,5],[34,3,34,5],[35,3,35,5],[22,2,22,5],[23,2,23,5],[24,3,24,5],[25,3,25,5]]}
[null,"إدارة /",null,null,null,null,"من",1,"الى",544,null,9]
[null,"مدرسة /",null,null,"م"]
[null,"الكود ",{"$f":"IFERROR(INDEX(ورقة1!B:B,MATCH($L$1,ورقة1!$A:$A,0)),\"-\")","v":"code9"}]
[null,"الاسم",{"$f":"IFERROR(INDEX(ورقة1!C:C,MATCH($L$1,ورقة1!$A:$A,0)),\"-\")","v":"احمد9"}]
[null,"الصف",null,{"$f":"IFERROR(INDEX(ورقة1!D:D,MATCH($L$1,ورقة1!$A:$A,0)),\"-\")","v":"الثالث9"}]
[null,"الرقم القومي",null,{"$f":"IFERROR(INDEX(ورقة1!E:E,MATCH($L$1,ورقة1!$A:$A,0)),\"-\")","v":1111119}]
[null,"رمزعربي","Eرمز","رمزرياضة","رمزعلوم","رمز دراسات"]
[null,{"$f":"IFERROR(INDEX(ورقة1!F:F,MATCH($L$1,ورقة1!$A:$A,0)),\"-\")","v":"a9"},{"$f":"IFERROR(INDEX(ورقة1!G:G,MATCH($L$1,ورقة1!$A:$A,0)),\"-\")","v":"b9"},{"$f":"IFERROR(INDEX(ورقة1!H:H,MATCH($L$1,ورقة1!$A:$A,0)),\"-\")","v":"c9"},{"$f":"IFERROR(INDEX(ورقة1!I:I,MATCH($L$1,ورقة1!$A:$A,0)),\"-\")","v":"d9"},{"$f":"IFERROR(INDEX(ورقة1!J:J,MATCH($L$1,ورقة1!$A:$A,0)),\"-\")","v":"e9"}]
[]
[]
[null,"إدارة /"]
[null,"مدرسة /"]
[null,"الكود ",{"$f":"IFERROR(INDEX(ورقة1!B:B,MATCH($L$1+1,ورقة1!$A:$A,0)),\"-\")","v":"code10"}]
[null,"الاسم",{"$f":"IFERROR(INDEX(ورقة1!C:C,MATCH($L$1+1,ورقة1!$A:$A,0)),\"-\")","v":"احمد10"}]
[null,"الصف",null,{"$f":"IFERROR(INDEX(ورقة1!D:D,MATCH($L$1+1,ورقة1!$A:$A,0)),\"-\")","v":"الثالث10"}]
[null,"الرقم القومي",null,{"$f":"IFERROR(INDEX(ورقة1!E:E,MATCH($L$1+1,ورقة1!$A:$A,0)),\"-\")","v":1111120}]
[null,"رمزعربي","Eرمز","رمزرياضة","رمزعلوم","رمز دراسات"]
[null,{"$f":"IFERROR(INDEX(ورقة1!F:F,MATCH($L$1+1,ورقة1!$A:$A,0)),\"-\")","v":"a10"},{"$f":"IFERROR(INDEX(ورقة1!G:G,MATCH($L$1+1,ورقة1!$A:$A,0)),\"-\")","v":"b10"},{"$f":"IFERROR(INDEX(ورقة1!H:H,MATCH($L$1+1,ورقة1!$A:$A,0)),\"-\")","v":"c10"},{"$f":"IFERROR(INDEX(ورقة1!I:I,MATCH($L$1+1,ورقة1!$A:$A,0)),\"-\")","v":"d10"},{"$f":"IFERROR(INDEX(ورقة1!J:J,MATCH($L$1+1,ورقة1!$A:$A,0)),\"-\")","v":"e10"}]
[]
[]
[null,"إدارة /"]
[null,"مدرسة /"]
[null,"الكود ",{"$f":"IFERROR(INDEX(ورقة1!B:B,MATCH($L$1+2,ورقة1!$A:$A,0)),\"-\")","v":"code2"}]
[null,"الاسم",{"$f":"IFERROR(INDEX(ورقة1!C:C,MATCH($L$1+2,ورقة1!$A:$A,0)),\"-\")","v":"احمد11"}]
[null,"الصف",null,{"$f":"IFERROR(INDEX(ورقة1!D:D,MATCH($L$1+2,ورقة1!$A:$A,0)),\"-\")","v":"الثالث11"}]
[null,"الرقم القومي",null,{"$f":"IFERROR(INDEX(ورقة1!E:E,MATCH($L$1+2,ورقة1!$A:$A,0)),\"-\")","v":1111121}]
[null,"رمزعربي","Eرمز","رمزرياضة","رمزعلوم","رمز دراسات"]
[null,{"$f":"IFERROR(INDEX(ورقة1!F:F,MATCH($L$1+2,ورقة1!$A:$A,0)),\"-\")","v":"a11"},{"$f":"IFERROR(INDEX(ورقة1!G:G,MATCH($L$1+2,ورقة1!$A:$A,0)),\"-\")","v":"b11"},{"$f":"IFERROR(INDEX(ورقة1!H:H,MATCH($L$1+2,ورقة1!$A:$A,0)),\"-\")","v":"c11"},{"$f":"IFERROR(INDEX(ورقة1!I:I,MATCH($L$1+2,ورقة1!$A:$A,0)),\"-\")","v":"d11"},{"$f":"IFERROR(INDEX(ورقة1!J:J,MATCH($L$1+2,ورقة1!$A:$A,0)),\"-\")","v":"e11"}]
[]
[]
[null,"إدارة /"]
[null,"مدرسة /"]
[null,"الكود ",{"$f":"IFERROR(INDEX(ورقة1!B:B,MATCH($L$1+3,ورقة1!$A:$A,0)),\"-\")","v":"code12"}]
[null,"الاسم",{"$f":"IFERROR(INDEX(ورقة1!C:C,MATCH($L$1+3,ورقة1!$A:$A,0)),\"-\")","v":"احمد12"}]
[null,"الصف",null,{"$f":"IFERROR(INDEX(ورقة1!D:D,MATCH($L$1+3,ورقة1!$A:$A,0)),\"-\")","v":"الثالث12"}]
[null,"الرقم القومي",null,{"$f":"IFERROR(INDEX(ورقة1!E:E,MATCH($L$1+3,ورقة1!$A:$A,0)),\"-\")","v":1111122}]
[null,"رمزعربي","Eرمز","رمزرياضة","رمزعلوم","رمز دراسات"]
[null,{"$f":"IFERROR(INDEX(ورقة1!F:F,MATCH($L$1+3,ورقة1!$A:$A,0)),\"-\")","v":"a12"},{"$f":"IFERROR(INDEX(ورقة1!G:G,MATCH($L$1+3,ورقة1!$A:$A,0)),\"-\")","v":"b12"},{"$f":"IFERROR(INDEX(ورقة1!H:H,MATCH($L$1+3,ورقة1!$A:$A,0)),\"-\")","v":"c12"},{"$f":"IFERROR(INDEX(ورقة1!I:I,MATCH($L$1+3,ورقة1!$A:$A,0)),\"-\")","v":"d12"},{"$f":"IFERROR(INDEX(ورقة1!J:J,MATCH($L$1+3,ورقة1!$A:$A,0)),\"-\")","v":"e12"}]