{"text_format":"1","workbook":"xlsx","n_sheets":4,"sheets":["البيان","مخزن 111","مخزن 138","مخزن 139"],"not_rendered":{"charts":0,"images":0,"macros":1,"external_links":0,"defined_names":0,"comments":0,"pivot_tables":0},"unopened":[],"bounds":{"document_bytes":16777216,"sheet_cells":100000,"rows_first":2000,"rows_last":500,"rows_between":2000,"halvings":0,"cell_chars":16384,"cell_head_chars":4096},"cells_cut":0,"cells_raw":0,"read":"whole","date_system":"1900"}

{"sheet":"البيان","index":0,"n_rows":7,"n_cols":9,"rows_kept":7,"cut":false,"hidden":false,"merged":[]}
[]
[]
[]
[]
[]
[]
[null,"م","رقم الصنف ","الصنف ","المجموعه ","الوحده","كميه مخزن القاهره","كميه مخزن شرم الشيخ ","كميه مخزن الغردقه"]

{"sheet":"مخزن 111","index":1,"n_rows":249,"n_cols":9,"rows_kept":249,"cut":false,"hidden":false,"merged":[]}
[]
[null,null,null,null,"مخزن 111"]
[]
[]
[]
[null,null,"م","رقم الصنف","الصنف","المجموعه","المجموعه 2","الوحده","الكميه "]
[null,null,1,111104101,"Abc","SOUP                ","شوربه","EA.",8988]
[null,null,2,111104102,"خضروات","SOUP                ","شوربه","EA.",8988]
[null,null,3,111104103,"طماطم","SOUP                ","شوربه","EA.",10416]
[null,null,4,111104104,"كريمةطماطم","SOUP                ","شوربه","EA.",10080]
[null,null,5,111104105,"طماطم توسك","SOUP                ","شوربه","EA.",10500]
[null,null,6,111105301,"اكل يهودي","KOSHER MEAL         ","اكل يهودى","EA.",79]
[null,null,7,111105302,"غ و ع ساخن","KOSHER MEAL         ","اكل يهودى","EA.",206]
[null,null,8,111105304,"T ECON","KOSHER MEAL         ","اكل يهودى","EA.",140]
[null,null,9,120102115,"ريش ضانى","LAMB                ","ضانى","KGM",127.12]
[null,null,10,120110010,"كبيبةمينى","VEAL                ","لحوم مصنعه سندوتشات","KGM",16]
[null,null,11,120202206,"وراك مخلية","CHICKENS            ","فراخ","KGM",492.71899999999999]
[null,null,12,120202238,"ص/م200:165","CHICKENS            ","فراخ","KGM",6103.1379999999999]
[null,null,13,120205101,"بيض ابيض","EGGS                ","بيض","EA.",230]
[null,null,14,120301208,"قشربياض في","FISH                ","سمك فيليةمحلى ومستور","KGM",132]
[null,null,15,120301215,"سمك سالمون","FISH                ","سمك فيليةمحلى ومستور","KGM",86.4]
[null,null,16,120302110,"ج/زيل20:16","SHRIMPS             ","جمبرى","KGM",77]
[null,null,17,120302213,"ج/ص/88-115","SHRIMPS             ","جمبرى","KGM",220]
[null,null,18,120304310,"تونة1700جم","TUNA                ","تونةعلب","TIN",228]
[null,null,19,120309303,"سيمون","SMOKED FISH         ","اسماك مدخنة","KGM",89]
[null,null,20,120310202,"كا/صـوابع","CABORIA             ","كابوريا","KGM",50]
[null,null,21,120311138,"جيريزون10ج","SMOKMEAT            ","لحوم مدخنة","KGM",30]
[null,null,22,120401307,"بسله بجزر","GREEN PEAS          ","بسلة خضراء","KGM",1850]
[null,null,23,120403202,"مجمدة كجم","GREEN BEANS         ","فاصوليا خضراء","KGM",280]
[null,null,24,120405110,"بطا/روندال","POTATOES            ","بطاطس","KGM",42]
{"$rows_left_out":220}
{"sheet":"مخزن 138","index":2,"n_rows":110,"n_cols":13,"rows_kept":110,"cut":false,"hidden":false,"merged":[]}
[null,null,null,"مخزن 138"]
[]
[]
[null,null,"رقم الصنف","الصنف","المجموعه","الوحده","الكميه","يوم","شهر","سنة","تاريخ الانتاج","تاريخ الانتهاء","الوقت المتبقى من تاريخ الجرد"]
[null,null,120109106,"سوسيس بقري","لحوم","كيلو جرام ",45,null,3,null,"2020-01-13",{"$f":"IF(K5=\"\",\"\",K5+DATE(J5,I5+1,H5))","v":"2020-04-13"},{"$f":"IF(L5=\"\",\"\",L5-TODAY())","v":3}]
[null,null,120311101,"رومي مدخن ","لحوم مدخن","كيلو جرام ",12,null,3,null,"2020-01-15","2020-04-15",5]
[null,null,120205101,"بيض","مأكولات ومشروبات","عدد",600,21,null,null,"2020-03-25","2020-04-15",5]
[null,null,120311100,"بيف بقري مدخن ","لحوم مدخن","كيلو جرام ",45,null,3,null,"2020-01-16","2020-04-16",6]
[null,null,121707331,"جيلي ساخن ","مأكولات ومشروبات","كيلو جرام ",4.5,null,null,1,"2019-05-05","2020-05-05",25]
[null,null,121401419,"بسكويت بالذبدة 5.6قطع","مأكولات ومشروبات","باكت ",3498,null,9,null,"2019-08-06","2020-05-06",26]
[null,null,120301306,"سمك بلطي ","اسماك","كيلو جرام ",9,null,6,null,"2019-11-18","2020-05-18",38]
[null,null,120309303,"سيمون مدخن ","اسماك","كيلو جرام ",17,null,5,null,"2020-01-21","2020-06-21",72]
[null,null,320203603,"زبدة 10جم ","البان وجبن","عدد",2200,null,null,1,"2019-06-22","2020-06-22",73]
[null,null,121401462,"تونكيز كيك","مأكولات ومشروبات","باكت ",900,null,5,null,"2020-01-28","2020-06-28",79]
[null,null,120405306,"بطاطس بودرة ","مأكولات ومشروبات","كيلو جرام ",4,null,6,null,"2019-12-30","2020-06-29",80]
[null,null,120807304,"جبنة مثلثات ","البان وجبن","عدد",10368,null,6,null,"2019-12-30","2020-06-29",80]
[null,null,120903332,"لبن كامل الدسم 1 لتر ","البان وجبن","لتر ",377,null,6,null,"2020-01-01","2020-07-01",82]
[null,null,320102385,"كولا كانز250ملي","مشروبات غازيه","عدد",62,null,9,null,"2019-10-01","2020-07-01",82]
[null,null,320105007,"كولا دايت 970مللي ","مشروبات غازيه","زجاجة ",63,null,6,null,"2020-01-11","2020-07-11",92]
[null,null,320102376,"ميرندا برتقال كانز250م","مشروبات غازيه","عدد",16,null,9,null,"2019-10-15","2020-07-15",96]
[null,null,320106002,"تونك 250مللي ","مشروبات غازيه","زجاجة ",47,null,null,1,"2019-07-15","2020-07-15",96]
[null,null,320105009,"سفن دايت 970مللي","مشروبات غازيه","زجاجة ",54,null,6,null,"2020-01-17","2020-07-17",98]
[null,null,320105008,"سفن 970ملي ","مشروبات غازيه","زجاجة ",368,null,6,null,"2020-01-24","2020-07-24",105]
[null,null,120805103,"جبنة جودة ","البان وجبن","كيلو جرام ",108,null,9,null,"2019-10-28","2020-07-28",109]
[null,null,120103214,"لحم وش فخدة ","لحوم","كيلو جرام ",204,null,null,1,"2019-07-30","2020-07-30",111]
[null,null,120710301,"كركم ","مأكولات ومشروبات","جرام ",250,null,null,1,"2019-07-30","2020-07-30",111]
[null,null,320204601,"درسنج 10جم ","مأكولات ومشروبات","باكو ",9000,null,6,null,"2020-01-30","2020-07-30",111]
[null,null,120903318,"لبن خالي الدسم 1 لتر ","البان وجبن","لتر ",35,null,6,null,"2020-02-02","2020-08-02",114]
[null,null,120805107,"جبنة شيدر احمر ","البان وجبن","كيلو جرام ",3,null,6,null,"2020-02-03","2020-08-03",115]
[null,null,320105010,"ميرندا برتقال 970 ملي","مشروبات غازيه","زجاجة ",290,null,6,null,"2020-02-04","2020-08-04",116]
{"$rows_left_out":81}
{"sheet":"مخزن 139","index":3,"n_rows":162,"n_cols":10,"rows_kept":162,"cut":false,"hidden":false,"merged":[]}
[]
[null,null,null,"مخزن 139"]
[]
[]
[]
[null,null,null,"م","رقم الصنف","الصنف","المجموعه","المجموعه 2","الوحده","الكميه "]
[null,null,null,{"$f":"IF($F7=\"\",\"\",MAX($D$6:D6)+1)","v":1},111104101,{"$f":"IF(COUNTIF('مخزن 111'!$D$7:$D$249,$E7)=0,\"\",VLOOKUP($E7,'مخزن 111'!$D$7:$I$249,MATCH(F$6,'مخزن 111'!$D$6:$I$6,0),0))","v":"Abc"},{"$f":"IF(COUNTIF('مخزن 111'!$D$7:$D$249,$E7)=0,\"\",VLOOKUP($E7,'مخزن 111'!$D$7:$I$249,MATCH(G$6,'مخزن 111'!$D$6:$I$6,0),0))","v":"SOUP                "},{"$f":"IF(COUNTIF('مخزن 111'!$D$7:$D$249,$E7)=0,\"\",VLOOKUP($E7,'مخزن 111'!$D$7:$I$249,MATCH(H$6,'مخزن 111'!$D$6:$I$6,0),0))","v":"شوربه"},{"$f":"IF(COUNTIF('مخزن 111'!$D$7:$D$249,$E7)=0,\"\",VLOOKUP($E7,'مخزن 111'!$D$7:$I$249,MATCH(I$6,'مخزن 111'!$D$6:$I$6,0),0))","v":"EA."},{"$f":"IF(COUNTIF('مخزن 111'!$D$7:$D$249,$E7)=0,\"\",VLOOKUP($E7,'مخزن 111'!$D$7:$I$249,MATCH(J$6,'مخزن 111'!$D$6:$I$6,0),0))","v":8988}]
[null,null,null,{"$f":"IF($F8=\"\",\"\",MAX($D$6:D7)+1)","v":""},120103214,{"$f":"IF(COUNTIF('مخزن 111'!$D$7:$D$249,$E8)=0,\"\",VLOOKUP($E8,'مخزن 111'!$D$7:$I$249,MATCH(F$6,'مخزن 111'!$D$6:$I$6,0),0))","v":""},{"$f":"IF(COUNTIF('مخزن 111'!$D$7:$D$249,$E8)=0,\"\",VLOOKUP($E8,'مخزن 111'!$D$7:$I$249,MATCH(G$6,'مخزن 111'!$D$6:$I$6,0),0))","v":""},{"$f":"IF(COUNTIF('مخزن 111'!$D$7:$D$249,$E8)=0,\"\",VLOOKUP($E8,'مخزن 111'!$D$7:$I$249,MATCH(H$6,'مخزن 111'!$D$6:$I$6,0),0))","v":""},{"$f":"IF(COUNTIF('مخزن 111'!$D$7:$D$249,$E8)=0,\"\",VLOOKUP($E8,'مخزن 111'!$D$7:$I$249,MATCH(I$6,'مخزن 111'!$D$6:$I$6,0),0))","v":""},{"$f":"IF(COUNTIF('مخزن 111'!$D$7:$D$249,$E8)=0,\"\",VLOOKUP($E8,'مخزن 111'!$D$7:$I$249,MATCH(J$6,'مخزن 111'!$D$6:$I$6,0),0))","v":""}]
[null,null,null,{"$f":"IF($F9=\"\",\"\",MAX($D$6:D8)+1)","v":2},120202238,{"$f":"IF(COUNTIF('مخزن 111'!$D$7:$D$249,$E9)=0,\"\",VLOOKUP($E9,'مخزن 111'!$D$7:$I$249,MATCH(F$6,'مخزن 111'!$D$6:$I$6,0),0))","v":"ص/م200:165"},{"$f":"IF(COUNTIF('مخزن 111'!$D$7:$D$249,$E9)=0,\"\",VLOOKUP($E9,'مخزن 111'!$D$7:$I$249,MATCH(G$6,'مخزن 111'!$D$6:$I$6,0),0))","v":"CHICKENS            "},{"$f":"IF(COUNTIF('مخزن 111'!$D$7:$D$249,$E9)=0,\"\",VLOOKUP($E9,'مخزن 111'!$D$7:$I$249,MATCH(H$6,'مخزن 111'!$D$6:$I$6,0),0))","v":"فراخ"},{"$f":"IF(COUNTIF('مخزن 111'!$D$7:$D$249,$E9)=0,\"\",VLOOKUP($E9,'مخزن 111'!$D$7:$I$249,MATCH(I$6,'مخزن 111'!$D$6:$I$6,0),0))","v":"KGM"},{"$f":"IF(COUNTIF('مخزن 111'!$D$7:$D$249,$E9)=0,\"\",VLOOKUP($E9,'مخزن 111'!$D$7:$I$249,MATCH(J$6,'مخزن 111'!$D$6:$I$6,0),0))","v":6103.1379999999999}]
[null,null,null,{"$f":"IF($F10=\"\",\"\",MAX($D$6:D9)+1)","v":""},120103203,{"$f":"IF(COUNTIF('مخزن 111'!$D$7:$D$249,$E10)=0,\"\",VLOOKUP($E10,'مخزن 111'!$D$7:$I$249,MATCH(F$6,'مخزن 111'!$D$6:$I$6,0),0))","v":""},{"$f":"IF(COUNTIF('مخزن 111'!$D$7:$D$249,$E10)=0,\"\",VLOOKUP($E10,'مخزن 111'!$D$7:$I$249,MATCH(G$6,'مخزن 111'!$D$6:$I$6,0),0))","v":""},{"$f":"IF(COUNTIF('مخزن 111'!$D$7:$D$249,$E10)=0,\"\",VLOOKUP($E10,'مخزن 111'!$D$7:$I$249,MATCH(H$6,'مخزن 111'!$D$6:$I$6,0),0))","v":""},{"$f":"IF(COUNTIF('مخزن 111'!$D$7:$D$249,$E10)=0,\"\",VLOOKUP($E10,'مخزن 111'!$D$7:$I$249,MATCH(I$6,'مخزن 111'!$D$6:$I$6,0),0))","v":""},{"$f":"IF(COUNTIF('مخزن 111'!$D$7:$D$249,$E10)=0,\"\",VLOOKUP($E10,'مخزن 111'!$D$7:$I$249,MATCH(J$6,'مخزن 111'!$D$6:$I$6,0),0))","v":""}]
[null,null,null,{"$f":"IF($F11=\"\",\"\",MAX($D$6:D10)+1)","v":""},120304319,{"$f":"IF(COUNTIF('مخزن 111'!$D$7:$D$249,$E11)=0,\"\",VLOOKUP($E11,'مخزن 111'!$D$7:$I$249,MATCH(F$6,'مخزن 111'!$D$6:$I$6,0),0))","v":""},{"$f":"IF(COUNTIF('مخزن 111'!$D$7:$D$249,$E11)=0,\"\",VLOOKUP($E11,'مخزن 111'!$D$7:$I$249,MATCH(G$6,'مخزن 111'!$D$6:$I$6,0),0))","v":""},{"$f":"IF(COUNTIF('مخزن 111'!$D$7:$D$249,$E11)=0,\"\",VLOOKUP($E11,'مخزن 111'!$D$7:$I$249,MATCH(H$6,'مخزن 111'!$D$6:$I$6,0),0))","v":""},{"$f":"IF(COUNTIF('مخزن 111'!$D$7:$D$249,$E11)=0,\"\",VLOOKUP($E11,'مخزن 111'!$D$7:$I$249,MATCH(I$6,'مخزن 111'!$D$6:$I$6,0),0))","v":""},{"$f":"IF(COUNTIF('مخزن 111'!$D$7:$D$249,$E11)=0,\"\",VLOOKUP($E11,'مخزن 111'!$D$7:$I$249,MATCH(J$6,'مخزن 111'!$D$6:$I$6,0),0))","v":""}]
[null,null,null,{"$f":"IF($F12=\"\",\"\",MAX($D$6:D11)+1)","v":3},120309303,{"$f":"IF(COUNTIF('مخزن 111'!$D$7:$D$249,$E12)=0,\"\",VLOOKUP($E12,'مخزن 111'!$D$7:$I$249,MATCH(F$6,'مخزن 111'!$D$6:$I$6,0),0))","v":"سيمون"},{"$f":"IF(COUNTIF('مخزن 111'!$D$7:$D$249,$E12)=0,\"\",VLOOKUP($E12,'مخزن 111'!$D$7:$I$249,MATCH(G$6,'مخزن 111'!$D$6:$I$6,0),0))","v":"SMOKED FISH         "},{"$f":"IF(COUNTIF('مخزن 111'!$D$7:$D$249,$E12)=0,\"\",VLOOKUP($E12,'مخزن 111'!$D$7:$I$249,MATCH(H$6,'مخزن 111'!$D$6:$I$6,0),0))","v":"اسماك مدخنة"},{"$f":"IF(COUNTIF('مخزن 111'!$D$7:$D$249,$E12)=0,\"\",VLOOKUP($E12,'مخزن 111'!$D$7:$I$249,MATCH(I$6,'مخزن 111'!$D$6:$I$6,0),0))","v":"KGM"},{"$f":"IF(COUNTIF('مخزن 111'!$D$7:$D$249,$E12)=0,\"\",VLOOKUP($E12,'مخزن 111'!$D$7:$I$249,MATCH(J$6,'مخزن 111'!$D$6:$I$6,0),0))","v":89}]
[null,null,null,{"$f":"IF($F13=\"\",\"\",MAX($D$6:D12)+1)","v":""},120311100,{"$f":"IF(COUNTIF('مخزن 111'!$D$7:$D$249,$E13)=0,\"\",VLOOKUP($E13,'مخزن 111'!$D$7:$I$249,MATCH(F$6,'مخزن 111'!$D$6:$I$6,0),0))","v":""},{"$f":"IF(COUNTIF('مخزن 111'!$D$7:$D$249,$E13)=0,\"\",VLOOKUP($E13,'مخزن 111'!$D$7:$I$249,MATCH(G$6,'مخزن 111'!$D$6:$I$6,0),0))","v":""},{"$f":"IF(COUNTIF('مخزن 111'!$D$7:$D$249,$E13)=0,\"\",VLOOKUP($E13,'مخزن 111'!$D$7:$I$249,MATCH(H$6,'مخزن 111'!$D$6:$I$6,0),0))","v":""},{"$f":"IF(COUNTIF('مخزن 111'!$D$7:$D$249,$E13)=0,\"\",VLOOKUP($E13,'مخزن 111'!$D$7:$I$249,MATCH(I$6,'مخزن 111'!$D$6:$I$6,0),0))","v":""},{"$f":"IF(COUNTIF('مخزن 111'!$D$7:$D$249,$E13)=0,\"\",VLOOKUP($E13,'مخزن 111'!$D$7:$I$249,MATCH(J$6,'مخزن 111'!$D$6:$I$6,0),0))","v":""}]
[null,null,null,{"$f":"IF($F14=\"\",\"\",MAX($D$6:D13)+1)","v":""},120311101,{"$f":"IF(COUNTIF('مخزن 111'!$D$7:$D$249,$E14)=0,\"\",VLOOKUP($E14,'مخزن 111'!$D$7:$I$249,MATCH(F$6,'مخزن 111'!$D$6:$I$6,0),0))","v":""},{"$f":"IF(COUNTIF('مخزن 111'!$D$7:$D$249,$E14)=0,\"\",VLOOKUP($E14,'مخزن 111'!$D$7:$I$249,MATCH(G$6,'مخزن 111'!$D$6:$I$6,0),0))","v":""},{"$f":"IF(COUNTIF('مخزن 111'!$D$7:$D$249,$E14)=0,\"\",VLOOKUP($E14,'مخزن 111'!$D$7:$I$249,MATCH(H$6,'مخزن 111'!$D$6:$I$6,0),0))","v":""},{"$f":"IF(COUNTIF('مخزن 111'!$D$7:$D$249,$E14)=0,\"\",VLOOKUP($E14,'مخزن 111'!$D$7:$I$249,MATCH(I$6,'مخزن 111'!$D$6:$I$6,0),0))","v":""},{"$f":"IF(COUNTIF('مخزن 111'!$D$7:$D$249,$E14)=0,\"\",VLOOKUP($E14,'مخزن 111'!$D$7:$I$249,MATCH(J$6,'مخزن 111'!$D$6:$I$6,0),0))","v":""}]
[null,null,null,{"$f":"IF($F15=\"\",\"\",MAX($D$6:D14)+1)","v":4},120401307,{"$f":"IF(COUNTIF('مخزن 111'!$D$7:$D$249,$E15)=0,\"\",VLOOKUP($E15,'مخزن 111'!$D$7:$I$249,MATCH(F$6,'مخزن 111'!$D$6:$I$6,0),0))","v":"بسله بجزر"},{"$f":"IF(COUNTIF('مخزن 111'!$D$7:$D$249,$E15)=0,\"\",VLOOKUP($E15,'مخزن 111'!$D$7:$I$249,MATCH(G$6,'مخزن 111'!$D$6:$I$6,0),0))","v":"GREEN PEAS          "},{"$f":"IF(COUNTIF('مخزن 111'!$D$7:$D$249,$E15)=0,\"\",VLOOKUP($E15,'مخزن 111'!$D$7:$I$249,MATCH(H$6,'مخزن 111'!$D$6:$I$6,0),0))","v":"بسلة خضراء"},{"$f":"IF(COUNTIF('مخزن 111'!$D$7:$D$249,$E15)=0,\"\",VLOOKUP($E15,'مخزن 111'!$D$7:$I$249,MATCH(I$6,'مخزن 111'!$D$6:$I$6,0),0))","v":"KGM"},{"$f":"IF(COUNTIF('مخزن 111'!$D$7:$D$249,$E15)=0,\"\",VLOOKUP($E15,'مخزن 111'!$D$7:$I$249,MATCH(J$6,'مخزن 111'!$D$6:$I$6,0),0))","v":1850}]
[null,null,null,{"$f":"IF($F16=\"\",\"\",MAX($D$6:D15)+1)","v":5},120403202,{"$f":"IF(COUNTIF('مخزن 111'!$D$7:$D$249,$E16)=0,\"\",VLOOKUP($E16,'مخزن 111'!$D$7:$I$249,MATCH(F$6,'مخزن 111'!$D$6:$I$6,0),0))","v":"مجمدة كجم"},{"$f":"IF(COUNTIF('مخزن 111'!$D$7:$D$249,$E16)=0,\"\",VLOOKUP($E16,'مخزن 111'!$D$7:$I$249,MATCH(G$6,'مخزن 111'!$D$6:$I$6,0),0))","v":"GREEN BEANS         "},{"$f":"IF(COUNTIF('مخزن 111'!$D$7:$D$249,$E16)=0,\"\",VLOOKUP($E16,'مخزن 111'!$D$7:$I$249,MATCH(H$6,'مخزن 111'!$D$6:$I$6,0),0))","v":"فاصوليا خضراء"},{"$f":"IF(COUNTIF('مخزن 111'!$D$7:$D$249,$E16)=0,\"\",VLOOKUP($E16,'مخزن 111'!$D$7:$I$249,MATCH(I$6,'مخزن 111'!$D$6:$I$6,0),0))","v":"KGM"},{"$f":"IF(COUNTIF('مخزن 111'!$D$7:$D$249,$E16)=0,\"\",VLOOKUP($E16,'مخزن 111'!$D$7:$I$249,MATCH(J$6,'مخزن 111'!$D$6:$I$6,0),0))","v":280}]
[null,null,null,{"$f":"IF($F17=\"\",\"\",MAX($D$6:D16)+1)","v":""},120405102,{"$f":"IF(COUNTIF('مخزن 111'!$D$7:$D$249,$E17)=0,\"\",VLOOKUP($E17,'مخزن 111'!$D$7:$I$249,MATCH(F$6,'مخزن 111'!$D$6:$I$6,0),0))","v":""},{"$f":"IF(COUNTIF('مخزن 111'!$D$7:$D$249,$E17)=0,\"\",VLOOKUP($E17,'مخزن 111'!$D$7:$I$249,MATCH(G$6,'مخزن 111'!$D$6:$I$6,0),0))","v":""},{"$f":"IF(COUNTIF('مخزن 111'!$D$7:$D$249,$E17)=0,\"\",VLOOKUP($E17,'مخزن 111'!$D$7:$I$249,MATCH(H$6,'مخزن 111'!$D$6:$I$6,0),0))","v":""},{"$f":"IF(COUNTIF('مخزن 111'!$D$7:$D$249,$E17)=0,\"\",VLOOKUP($E17,'مخزن 111'!$D$7:$I$249,MATCH(I$6,'مخزن 111'!$D$6:$I$6,0),0))","v":""},{"$f":"IF(COUNTIF('مخزن 111'!$D$7:$D$249,$E17)=0,\"\",VLOOKUP($E17,'مخزن 111'!$D$7:$I$249,MATCH(J$6,'مخزن 111'!$D$6:$I$6,0),0))","v":""}]
[null,null,null,{"$f":"IF($F18=\"\",\"\",MAX($D$6:D17)+1)","v":6},120405306,{"$f":"IF(COUNTIF('مخزن 111'!$D$7:$D$249,$E18)=0,\"\",VLOOKUP($E18,'مخزن 111'!$D$7:$I$249,MATCH(F$6,'مخزن 111'!$D$6:$I$6,0),0))","v":"بطاطس بودر"},{"$f":"IF(COUNTIF('مخزن 111'!$D$7:$D$249,$E18)=0,\"\",VLOOKUP($E18,'مخزن 111'!$D$7:$I$249,MATCH(G$6,'مخزن 111'!$D$6:$I$6,0),0))","v":"POTATOES            "},{"$f":"IF(COUNTIF('مخزن 111'!$D$7:$D$249,$E18)=0,\"\",VLOOKUP($E18,'مخزن 111'!$D$7:$I$249,MATCH(H$6,'مخزن 111'!$D$6:$I$6,0),0))","v":"بطاطس"},{"$f":"IF(COUNTIF('مخزن 111'!$D$7:$D$249,$E18)=0,\"\",VLOOKUP($E18,'مخزن 111'!$D$7:$I$249,MATCH(I$6,'مخزن 111'!$D$6:$I$6,0),0))","v":"KGM"},{"$f":"IF(COUNTIF('مخزن 111'!$D$7:$D$249,$E18)=0,\"\",VLOOKUP($E18,'مخزن 111'!$D$7:$I$249,MATCH(J$6,'مخزن 111'!$D$6:$I$6,0),0))","v":2}]
[null,null,null,{"$f":"IF($F19=\"\",\"\",MAX($D$6:D18)+1)","v":7},120407308,{"$f":"IF(COUNTIF('مخزن 111'!$D$7:$D$249,$E19)=0,\"\",VLOOKUP($E19,'مخزن 111'!$D$7:$I$249,MATCH(F$6,'مخزن 111'!$D$6:$I$6,0),0))","v":"صلصة3كيلو"},{"$f":"IF(COUNTIF('مخزن 111'!$D$7:$D$249,$E19)=0,\"\",VLOOKUP($E19,'مخزن 111'!$D$7:$I$249,MATCH(G$6,'مخزن 111'!$D$6:$I$6,0),0))","v":"TOMATOES            "},{"$f":"IF(COUNTIF('مخزن 111'!$D$7:$D$249,$E19)=0,\"\",VLOOKUP($E19,'مخزن 111'!$D$7:$I$249,MATCH(H$6,'مخزن 111'!$D$6:$I$6,0),0))","v":"طماطم"},{"$f":"IF(COUNTIF('مخزن 111'!$D$7:$D$249,$E19)=0,\"\",VLOOKUP($E19,'مخزن 111'!$D$7:$I$249,MATCH(I$6,'مخزن 111'!$D$6:$I$6,0),0))","v":"TIN"},{"$f":"IF(COUNTIF('مخزن 111'!$D$7:$D$249,$E19)=0,\"\",VLOOKUP($E19,'مخزن 111'!$D$7:$I$249,MATCH(J$6,'مخزن 111'!$D$6:$I$6,0),0))","v":76}]
[null,null,null,{"$f":"IF($F20=\"\",\"\",MAX($D$6:D19)+1)","v":""},120416318,{"$f":"IF(COUNTIF('مخزن 111'!$D$7:$D$249,$E20)=0,\"\",VLOOKUP($E20,'مخزن 111'!$D$7:$I$249,MATCH(F$6,'مخزن 111'!$D$6:$I$6,0),0))","v":""},{"$f":"IF(COUNTIF('مخزن 111'!$D$7:$D$249,$E20)=0,\"\",VLOOKUP($E20,'مخزن 111'!$D$7:$I$249,MATCH(G$6,'مخزن 111'!$D$6:$I$6,0),0))","v":""},{"$f":"IF(COUNTIF('مخزن 111'!$D$7:$D$249,$E20)=0,\"\",VLOOKUP($E20,'مخزن 111'!$D$7:$I$249,MATCH(H$6,'مخزن 111'!$D$6:$I$6,0),0))","v":""},{"$f":"IF(COUNTIF('مخزن 111'!$D$7:$D$249,$E20)=0,\"\",VLOOKUP($E20,'مخزن 111'!$D$7:$I$249,MATCH(I$6,'مخزن 111'!$D$6:$I$6,0),0))","v":""},{"$f":"IF(COUNTIF('مخزن 111'!$D$7:$D$249,$E20)=0,\"\",VLOOKUP($E20,'مخزن 111'!$D$7:$I$249,MATCH(J$6,'مخزن 111'!$D$6:$I$6,0),0))","v":""}]
[null,null,null,{"$f":"IF($F21=\"\",\"\",MAX($D$6:D20)+1)","v":8},120502306,{"$f":"IF(COUNTIF('مخزن 111'!$D$7:$D$249,$E21)=0,\"\",VLOOKUP($E21,'مخزن 111'!$D$7:$I$249,MATCH(F$6,'مخزن 111'!$D$6:$I$6,0),0))","v":"كمبوت820جم"},{"$f":"IF(COUNTIF('مخزن 111'!$D$7:$D$249,$E21)=0,\"\",VLOOKUP($E21,'مخزن 111'!$D$7:$I$249,MATCH(G$6,'مخزن 111'!$D$6:$I$6,0),0))","v":"PEACHES             "},{"$f":"IF(COUNTIF('مخزن 111'!$D$7:$D$249,$E21)=0,\"\",VLOOKUP($E21,'مخزن 111'!$D$7:$I$249,MATCH(H$6,'مخزن 111'!$D$6:$I$6,0),0))","v":"خوخ"},{"$f":"IF(COUNTIF('مخزن 111'!$D$7:$D$249,$E21)=0,\"\",VLOOKUP($E21,'مخزن 111'!$D$7:$I$249,MATCH(I$6,'مخزن 111'!$D$6:$I$6,0),0))","v":"TIN"},{"$f":"IF(COUNTIF('مخزن 111'!$D$7:$D$249,$E21)=0,\"\",VLOOKUP($E21,'مخزن 111'!$D$7:$I$249,MATCH(J$6,'مخزن 111'!$D$6:$I$6,0),0))","v":12}]
[null,null,null,{"$f":"IF($F22=\"\",\"\",MAX($D$6:D21)+1)","v":9},120504302,{"$f":"IF(COUNTIF('مخزن 111'!$D$7:$D$249,$E22)=0,\"\",VLOOKUP($E22,'مخزن 111'!$D$7:$I$249,MATCH(F$6,'مخزن 111'!$D$6:$I$6,0),0))","v":"كمبوت850جم"},{"$f":"IF(COUNTIF('مخزن 111'!$D$7:$D$249,$E22)=0,\"\",VLOOKUP($E22,'مخزن 111'!$D$7:$I$249,MATCH(G$6,'مخزن 111'!$D$6:$I$6,0),0))","v":"PINEAPPLE           "},{"$f":"IF(COUNTIF('مخزن 111'!$D$7:$D$249,$E22)=0,\"\",VLOOKUP($E22,'مخزن 111'!$D$7:$I$249,MATCH(H$6,'مخزن 111'!$D$6:$I$6,0),0))","v":"كمبوت اناناس"},{"$f":"IF(COUNTIF('مخزن 111'!$D$7:$D$249,$E22)=0,\"\",VLOOKUP($E22,'مخزن 111'!$D$7:$I$249,MATCH(I$6,'مخزن 111'!$D$6:$I$6,0),0))","v":"TIN"},{"$f":"IF(COUNTIF('مخزن 111'!$D$7:$D$249,$E22)=0,\"\",VLOOKUP($E22,'مخزن 111'!$D$7:$I$249,MATCH(J$6,'مخزن 111'!$D$6:$I$6,0),0))","v":672}]
[null,null,null,{"$f":"IF($F23=\"\",\"\",MAX($D$6:D22)+1)","v":10},120506305,{"$f":"IF(COUNTIF('مخزن 111'!$D$7:$D$249,$E23)=0,\"\",VLOOKUP($E23,'مخزن 111'!$D$7:$I$249,MATCH(F$6,'مخزن 111'!$D$6:$I$6,0),0))","v":"كريز كيلو"},{"$f":"IF(COUNTIF('مخزن 111'!$D$7:$D$249,$E23)=0,\"\",VLOOKUP($E23,'مخزن 111'!$D$7:$I$249,MATCH(G$6,'مخزن 111'!$D$6:$I$6,0),0))","v":"CHERRY              "},{"$f":"IF(COUNTIF('مخزن 111'!$D$7:$D$249,$E23)=0,\"\",VLOOKUP($E23,'مخزن 111'!$D$7:$I$249,MATCH(H$6,'مخزن 111'!$D$6:$I$6,0),0))","v":"كريز"},{"$f":"IF(COUNTIF('مخزن 111'!$D$7:$D$249,$E23)=0,\"\",VLOOKUP($E23,'مخزن 111'!$D$7:$I$249,MATCH(I$6,'مخزن 111'!$D$6:$I$6,0),0))","v":"KGM"},{"$f":"IF(COUNTIF('مخزن 111'!$D$7:$D$249,$E23)=0,\"\",VLOOKUP($E23,'مخزن 111'!$D$7:$I$249,MATCH(J$6,'مخزن 111'!$D$6:$I$6,0),0))","v":4.5}]
[null,null,null,{"$f":"IF($F24=\"\",\"\",MAX($D$6:D23)+1)","v":11},120601104,{"$f":"IF(COUNTIF('مخزن 111'!$D$7:$D$249,$E24)=0,\"\",VLOOKUP($E24,'مخزن 111'!$D$7:$I$249,MATCH(F$6,'مخزن 111'!$D$6:$I$6,0),0))","v":"شريط  كجم"},{"$f":"IF(COUNTIF('مخزن 111'!$D$7:$D$249,$E24)=0,\"\",VLOOKUP($E24,'مخزن 111'!$D$7:$I$249,MATCH(G$6,'مخزن 111'!$D$6:$I$6,0),0))","v":"MACARONI            "},{"$f":"IF(COUNTIF('مخزن 111'!$D$7:$D$249,$E24)=0,\"\",VLOOKUP($E24,'مخزن 111'!$D$7:$I$249,MATCH(H$6,'مخزن 111'!$D$6:$I$6,0),0))","v":"مكرونةوسمبوسه"},{"$f":"IF(COUNTIF('مخزن 111'!$D$7:$D$249,$E24)=0,\"\",VLOOKUP($E24,'مخزن 111'!$D$7:$I$249,MATCH(I$6,'مخزن 111'!$D$6:$I$6,0),0))","v":"KGM"},{"$f":"IF(COUNTIF('مخزن 111'!$D$7:$D$249,$E24)=0,\"\",VLOOKUP($E24,'مخزن 111'!$D$7:$I$249,MATCH(J$6,'مخزن 111'!$D$6:$I$6,0),0))","v":160}]
[null,null,null,{"$f":"IF($F25=\"\",\"\",MAX($D$6:D24)+1)","v":12},120601106,{"$f":"IF(COUNTIF('مخزن 111'!$D$7:$D$249,$E25)=0,\"\",VLOOKUP($E25,'مخزن 111'!$D$7:$I$249,MATCH(F$6,'مخزن 111'!$D$6:$I$6,0),0))","v":"بنة كجم"},{"$f":"IF(COUNTIF('مخزن 111'!$D$7:$D$249,$E25)=0,\"\",VLOOKUP($E25,'مخزن 111'!$D$7:$I$249,MATCH(G$6,'مخزن 111'!$D$6:$I$6,0),0))","v":"MACARONI            "},{"$f":"IF(COUNTIF('مخزن 111'!$D$7:$D$249,$E25)=0,\"\",VLOOKUP($E25,'مخزن 111'!$D$7:$I$249,MATCH(H$6,'مخزن 111'!$D$6:$I$6,0),0))","v":"مكرونةوسمبوسه"},{"$f":"IF(COUNTIF('مخزن 111'!$D$7:$D$249,$E25)=0,\"\",VLOOKUP($E25,'مخزن 111'!$D$7:$I$249,MATCH(I$6,'مخزن 111'!$D$6:$I$6,0),0))","v":"KGM"},{"$f":"IF(COUNTIF('مخزن 111'!$D$7:$D$249,$E25)=0,\"\",VLOOKUP($E25,'مخزن 111'!$D$7:$I$249,MATCH(J$6,'مخزن 111'!$D$6:$I$6,0),0))","v":1260}]
[null,null,null,{"$f":"IF($F26=\"\",\"\",MAX($D$6:D25)+1)","v":13},120603106,{"$f":"IF(COUNTIF('مخزن 111'!$D$7:$D$249,$E26)=0,\"\",VLOOKUP($E26,'مخزن 111'!$D$7:$I$249,MATCH(F$6,'مخزن 111'!$D$6:$I$6,0),0))","v":"محلى 50كجم"},{"$f":"IF(COUNTIF('مخزن 111'!$D$7:$D$249,$E26)=0,\"\",VLOOKUP($E26,'مخزن 111'!$D$7:$I$249,MATCH(G$6,'مخزن 111'!$D$6:$I$6,0),0))","v":"FLOWER              "},{"$f":"IF(COUNTIF('مخزن 111'!$D$7:$D$249,$E26)=0,\"\",VLOOKUP($E26,'مخزن 111'!$D$7:$I$249,MATCH(H$6,'مخزن 111'!$D$6:$I$6,0),0))","v":"دقيق بانواعه"},{"$f":"IF(COUNTIF('مخزن 111'!$D$7:$D$249,$E26)=0,\"\",VLOOKUP($E26,'مخزن 111'!$D$7:$I$249,MATCH(I$6,'مخزن 111'!$D$6:$I$6,0),0))","v":"KGM"},{"$f":"IF(COUNTIF('مخزن 111'!$D$7:$D$249,$E26)=0,\"\",VLOOKUP($E26,'مخزن 111'!$D$7:$I$249,MATCH(J$6,'مخزن 111'!$D$6:$I$6,0),0))","v":2893.04}]
[null,null,null,{"$f":"IF($F27=\"\",\"\",MAX($D$6:D26)+1)","v":""},120603169,{"$f":"IF(COUNTIF('مخزن 111'!$D$7:$D$249,$E27)=0,\"\",VLOOKUP($E27,'مخزن 111'!$D$7:$I$249,MATCH(F$6,'مخزن 111'!$D$6:$I$6,0),0))","v":""},{"$f":"IF(COUNTIF('مخزن 111'!$D$7:$D$249,$E27)=0,\"\",VLOOKUP($E27,'مخزن 111'!$D$7:$I$249,MATCH(G$6,'مخزن 111'!$D$6:$I$6,0),0))","v":""},{"$f":"IF(COUNTIF('مخزن 111'!$D$7:$D$249,$E27)=0,\"\",VLOOKUP($E27,'مخزن 111'!$D$7:$I$249,MATCH(H$6,'مخزن 111'!$D$6:$I$6,0),0))","v":""},{"$f":"IF(COUNTIF('مخزن 111'!$D$7:$D$249,$E27)=0,\"\",VLOOKUP($E27,'مخزن 111'!$D$7:$I$249,MATCH(I$6,'مخزن 111'!$D$6:$I$6,0),0))","v":""},{"$f":"IF(COUNTIF('مخزن 111'!$D$7:$D$249,$E27)=0,\"\",VLOOKUP($E27,'مخزن 111'!$D$7:$I$249,MATCH(J$6,'مخزن 111'!$D$6:$I$6,0),0))","v":""}]
[null,null,null,{"$f":"IF($F28=\"\",\"\",MAX($D$6:D27)+1)","v":14},120605101,{"$f":"IF(COUNTIF('مخزن 111'!$D$7:$D$249,$E28)=0,\"\",VLOOKUP($E28,'مخزن 111'!$D$7:$I$249,MATCH(F$6,'مخزن 111'!$D$6:$I$6,0),0))","v":"بالكيلو"},{"$f":"IF(COUNTIF('مخزن 111'!$D$7:$D$249,$E28)=0,\"\",VLOOKUP($E28,'مخزن 111'!$D$7:$I$249,MATCH(G$6,'مخزن 111'!$D$6:$I$6,0),0))","v":"RICE                "},{"$f":"IF(COUNTIF('مخزن 111'!$D$7:$D$249,$E28)=0,\"\",VLOOKUP($E28,'مخزن 111'!$D$7:$I$249,MATCH(H$6,'مخزن 111'!$D$6:$I$6,0),0))","v":"ارز سياحى"},{"$f":"IF(COUNTIF('مخزن 111'!$D$7:$D$249,$E28)=0,\"\",VLOOKUP($E28,'مخزن 111'!$D$7:$I$249,MATCH(I$6,'مخزن 111'!$D$6:$I$6,0),0))","v":"KGM"},{"$f":"IF(COUNTIF('مخزن 111'!$D$7:$D$249,$E28)=0,\"\",VLOOKUP($E28,'مخزن 111'!$D$7:$I$249,MATCH(J$6,'مخزن 111'!$D$6:$I$6,0),0))","v":950}]
[null,null,null,{"$f":"IF($F29=\"\",\"\",MAX($D$6:D28)+1)","v":15},120605105,{"$f":"IF(COUNTIF('مخزن 111'!$D$7:$D$249,$E29)=0,\"\",VLOOKUP($E29,'مخزن 111'!$D$7:$I$249,MATCH(F$6,'مخزن 111'!$D$6:$I$6,0),0))","v":"بسمتى مغلى"},{"$f":"IF(COUNTIF('مخزن 111'!$D$7:$D$249,$E29)=0,\"\",VLOOKUP($E29,'مخزن 111'!$D$7:$I$249,MATCH(G$6,'مخزن 111'!$D$6:$I$6,0),0))","v":"RICE                "},{"$f":"IF(COUNTIF('مخزن 111'!$D$7:$D$249,$E29)=0,\"\",VLOOKUP($E29,'مخزن 111'!$D$7:$I$249,MATCH(H$6,'مخزن 111'!$D$6:$I$6,0),0))","v":"ارز سياحى"},{"$f":"IF(COUNTIF('مخزن 111'!$D$7:$D$249,$E29)=0,\"\",VLOOKUP($E29,'مخزن 111'!$D$7:$I$249,MATCH(I$6,'مخزن 111'!$D$6:$I$6,0),0))","v":"KGM"},{"$f":"IF(COUNTIF('مخزن 111'!$D$7:$D$249,$E29)=0,\"\",VLOOKUP($E29,'مخزن 111'!$D$7:$I$249,MATCH(J$6,'مخزن 111'!$D$6:$I$6,0),0))","v":2840}]
[null,null,null,{"$f":"IF($F30=\"\",\"\",MAX($D$6:D29)+1)","v":16},120609303,{"$f":"IF(COUNTIF('مخزن 111'!$D$7:$D$249,$E30)=0,\"\",VLOOKUP($E30,'مخزن 111'!$D$7:$I$249,MATCH(F$6,'مخزن 111'!$D$6:$I$6,0),0))","v":"ناعم"},{"$f":"IF(COUNTIF('مخزن 111'!$D$7:$D$249,$E30)=0,\"\",VLOOKUP($E30,'مخزن 111'!$D$7:$I$249,MATCH(G$6,'مخزن 111'!$D$6:$I$6,0),0))","v":"SUGAR               "},{"$f":"IF(COUNTIF('مخزن 111'!$D$7:$D$249,$E30)=0,\"\",VLOOKUP($E30,'مخزن 111'!$D$7:$I$249,MATCH(H$6,'مخزن 111'!$D$6:$I$6,0),0))","v":"سكر"},{"$f":"IF(COUNTIF('مخزن 111'!$D$7:$D$249,$E30)=0,\"\",VLOOKUP($E30,'مخزن 111'!$D$7:$I$249,MATCH(I$6,'مخزن 111'!$D$6:$I$6,0),0))","v":"KGM"},{"$f":"IF(COUNTIF('مخزن 111'!$D$7:$D$249,$E30)=0,\"\",VLOOKUP($E30,'مخزن 111'!$D$7:$I$249,MATCH(J$6,'مخزن 111'!$D$6:$I$6,0),0))","v":1550}]
{"$rows_left_out":132}