{"text_format":"1","workbook":"xlsx","n_sheets":4,"sheets":["البيان","مخزن 111","مخزن 138","مخزن 139"],"not_rendered":{"charts":0,"images":0,"macros":1,"external_links":0,"defined_names":0,"comments":0,"pivot_tables":0},"unopened":[],"bounds":{"document_bytes":16777216,"sheet_cells":100000,"rows_first":2000,"rows_last":500,"rows_between":2000,"halvings":0,"cell_chars":16384,"cell_head_chars":4096},"cells_cut":0,"cells_raw":0,"read":"whole","date_system":"1900"}

{"sheet":"البيان","index":0,"n_rows":7,"n_cols":9,"rows_kept":7,"cut":false,"hidden":false,"merged":[]}
[]
[]
[]
[]
[]
[]
[null,"م","رقم الصنف ","الصنف ","المجموعه ","الوحده","كميه مخزن القاهره","كميه مخزن شرم الشيخ ","كميه مخزن الغردقه"]

{"sheet":"مخزن 111","index":1,"n_rows":249,"n_cols":9,"rows_kept":249,"cut":false,"hidden":false,"merged":[]}
[]
[null,null,null,null,"مخزن 111"]
[]
[]
[]
[null,null,"م","رقم الصنف","الصنف","المجموعه","المجموعه 2","الوحده","الكميه "]
[null,null,1,111104101,"Abc","SOUP                ","شوربه","EA.",8988]
[null,null,2,111104102,"خضروات","SOUP                ","شوربه","EA.",8988]
[null,null,3,111104103,"طماطم","SOUP                ","شوربه","EA.",10416]
[null,null,4,111104104,"كريمةطماطم","SOUP                ","شوربه","EA.",10080]
[null,null,5,111104105,"طماطم توسك","SOUP                ","شوربه","EA.",10500]
[null,null,6,111105301,"اكل يهودي","KOSHER MEAL         ","اكل يهودى","EA.",79]
[null,null,7,111105302,"غ و ع ساخن","KOSHER MEAL         ","اكل يهودى","EA.",206]
[null,null,8,111105304,"T ECON","KOSHER MEAL         ","اكل يهودى","EA.",140]
[null,null,9,120102115,"ريش ضانى","LAMB                ","ضانى","KGM",127.12]
[null,null,10,120110010,"كبيبةمينى","VEAL                ","لحوم مصنعه سندوتشات","KGM",16]
[null,null,11,120202206,"وراك مخلية","CHICKENS            ","فراخ","KGM",492.71899999999999]
[null,null,12,120202238,"ص/م200:165","CHICKENS            ","فراخ","KGM",6103.1379999999999]
[null,null,13,120205101,"بيض ابيض","EGGS                ","بيض","EA.",230]
[null,null,14,120301208,"قشربياض في","FISH                ","سمك فيليةمحلى ومستور","KGM",132]
[null,null,15,120301215,"سمك سالمون","FISH                ","سمك فيليةمحلى ومستور","KGM",86.4]
[null,null,16,120302110,"ج/زيل20:16","SHRIMPS             ","جمبرى","KGM",77]
[null,null,17,120302213,"ج/ص/88-115","SHRIMPS             ","جمبرى","KGM",220]
[null,null,18,120304310,"تونة1700جم","TUNA                ","تونةعلب","TIN",228]
[null,null,19,120309303,"سيمون","SMOKED FISH         ","اسماك مدخنة","KGM",89]
[null,null,20,120310202,"كا/صـوابع","CABORIA             ","كابوريا","KGM",50]
[null,null,21,120311138,"جيريزون10ج","SMOKMEAT            ","لحوم مدخنة","KGM",30]
[null,null,22,120401307,"بسله بجزر","GREEN PEAS          ","بسلة خضراء","KGM",1850]
[null,null,23,120403202,"مجمدة كجم","GREEN BEANS         ","فاصوليا خضراء","KGM",280]
[null,null,24,120405110,"بطا/روندال","POTATOES            ","بطاطس","KGM",42]
[null,null,25,120405306,"بطاطس بودر","POTATOES            ","بطاطس","KGM",2]
[null,null,26,120405307,"كروكيت","POTATOES            ","بطاطس","KGM",28]
[null,null,27,120406103,"بودرةكجم","GARLIC              ","ثوم","KGM",4]
[null,null,28,120407308,"صلصة3كيلو","TOMATOES            ","طماطم","TIN",76]
[null,null,29,120407326,"ط/مجفف280","TOMATOES            ","طماطم","JAR",372]
[null,null,30,120409202,"مجمدة كجم","SPINACH             ","سبانخ","KGM",48]
[null,null,31,120416328,"800ص/425م","MUSHROOM            ","مشروم","TIN",804]
[null,null,32,120416331,"م/ش 800صاف","MUSHROOM            ","مشروم","TIN",672]
[null,null,33,120427102,"بروكلىمجمد","BROKLY              ","بروكلى","KGM",258]
[null,null,34,120502103,"كم/خوخ810","PEACHES             ","خوخ","TIN",300]
[null,null,35,120502306,"كمبوت820جم","PEACHES             ","خوخ","TIN",12]
[null,null,36,120504302,"كمبوت850جم","PINEAPPLE           ","كمبوت اناناس","TIN",672]
[null,null,37,120506305,"كريز كيلو","CHERRY              ","كريز","KGM",4.5]
[null,null,38,120601103,"شعرية كجم","MACARONI            ","مكرونةوسمبوسه","KGM",160]
[null,null,39,120601104,"شريط  كجم","MACARONI            ","مكرونةوسمبوسه","KGM",160]
[null,null,40,120601106,"بنة كجم","MACARONI            ","مكرونةوسمبوسه","KGM",1260]
[null,null,41,120601125,"سمبوسةجبنة","MACARONI            ","مكرونةوسمبوسه","KGM",15]
[null,null,42,120603103,"دقيق سميد","FLOWER              ","دقيق بانواعه","KGM",99.72]
[null,null,43,120603106,"محلى 50كجم","FLOWER              ","دقيق بانواعه","KGM",2893.04]
[null,null,44,120603137,"برونيز ميك","FLOWER              ","دقيق بانواعه","KGM",90]
[null,null,45,120603173,"ترت سكر5ر3","FLOWER              ","دقيق بانواعه","EA.",8640]
[null,null,46,120603174,"ترت سكر7سم","FLOWER              ","دقيق بانواعه","EA.",9360]
[null,null,47,120603177,"فوتين كرسب","FLOWER              ","دقيق بانواعه","KGM",4]
[null,null,48,120603178,"ت/ملح مربع","FLOWER              ","دقيق بانواعه","EA.",2304]
[null,null,49,120603385,"كينوا","FLOWER              ","دقيق بانواعه","KGM",7]
[null,null,50,120604405,"كورن فليكس","CORN FLACKES        ","كورن فليكس","BOX",288]
[null,null,51,120605101,"بالكيلو","RICE                ","ارز سياحى","KGM",950]
[null,null,52,120605105,"بسمتى مغلى","RICE                ","ارز سياحى","KGM",2840]
[null,null,53,120606315,"نشا ذرة","STARCH              ","نشا","KGM",225]
[null,null,54,120609303,"ناعم","SUGAR               ","سكر","KGM",1550]
[null,null,55,120609401,"بودره","SUGAR               ","سكر","KGM",360]
[null,null,56,120701301,"اسود حصى","PEPPER              ","فلفل","KGM",1]
[null,null,57,120701302,"ابيض كجم","PEPPER              ","فلفل","KGM",2.5]
[null,null,58,120701308,"فلفل اسود","PEPPER              ","فلفل","KGM",15]
[null,null,59,120702301,"فلفل احمرك","PAPRICA             ","فلفل احمر","KGM",20]
[null,null,60,120703301,"ناعمة كجم","CHILI               ","شطة","KGM",0.5]
[null,null,61,120704301,"ناعمة كجم","CORIANDER           ","كسبرة","KGM",16]
[null,null,62,120705101,"حصى كم","CUMIN               ","كمون","KGM",9]
[null,null,63,120705301,"بلدى كجم","CUMIN               ","كمون","KGM",6]
[null,null,64,120706101,"حبهان مطحن","ETARA-HPAHAN        ","عطارة-حبهان","KGM",1.9]
[null,null,65,120707102,"مسحوق","BOWDER    ","جوزة الطيب","KGM",1]
[null,null,66,120709309,"كارى بودرة","KARE                ","كارى","KGM",8.4]
[null,null,67,120710301,"ناعم كجم","CURCUMA             ","كركم","KGM",1]
[null,null,68,120711302,"بصل بودرة","SEASONING           ","خلطة بهارات","KGM",5]
[null,null,69,120711303,"كبة صينى","SEASONING           ","خلطة بهارات","KGM",19]
[null,null,70,120713301,"ناعمة كجم","CINNAMON            ","قرفة","KGM",8]
[null,null,71,120717302,"سايب  كجم","GINGER              ","جنزبيل","KGM",12.5]
[null,null,72,120718312,"ملح300جم","SALT                ","ملح","PKT",1440]
[null,null,73,120719112,"توبل شو900","SPICES              ","توابل","TIN",18]
[null,null,74,120719114,"توابل800شر","SPICES              ","توابل","TIN",6]
[null,null,75,120722301,"بالكيلو","BLACK SEED          ","حبة البركه","KGM",14.5]
[null,null,76,120737103,"نعناع5.2:1","MINT                ","النعناع","BOX",1152]
[null,null,77,120740102,"قرفة5.2:1ج","SACHETTES           ","عبوات","TIN",864]
[null,null,78,120740109,"كركدية2جم","SACHETTES           ","عبوات","TIN",432]
[null,null,79,120740111,"كاموميل5ز1","SACHETTES           ","عبوات","PKT",3456]
[null,null,80,120740114,"تليو5.2:1ج","SACHETTES           ","عبوات","TIN",576]
[null,null,81,120740115,"ينسون5.2:1","SACHETTES           ","عبوات","TIN",576]
[null,null,82,120801107,"ملح خفيف","WHITE CHEESE        ","جبنة بيضاء","KGM",72]
[null,null,83,120801111,"فيتايونانى","WHITE CHEESE        ","جبنة بيضاء","KGM",38.35]
[null,null,84,120802101,"صحيح   كجم","BALKAN CHEESE       ","جبنة رومى","KGM",12.15]
[null,null,85,120803306,"ريكفورد مح","غ","جبن روكفور","KGM",27.6]
[null,null,86,120803307,"ريكفورد25ج","DANISH BLUE         ","جبن روكفور","EA.",672]
[null,null,87,120804109,"ج/شيدركمون","SHEDER CHEESE       ","جبنة شيدر","KGM",223.88]
[null,null,88,120805101,"ايدام","CHEESE              ","جبن مطبوخ","KGM",22.457000000000001]
[null,null,89,120805103,"جودة","CHEESE              ","جبن مطبوخ","KGM",1853.01]
[null,null,90,120805111,"ج موتزاريلا","CHEESE              ","جبن مطبوخ","KGM",144]
[null,null,91,120805125,"ج/برفلونى","CHEESE              ","جبن مطبوخ","KGM",17.5]
[null,null,92,120807304,"ج/مطبوخةمث","TRIANGLE CHEESE     ","جبنة مطبوخة","EA.",100800]
[null,null,93,120807307,"ج/بقشطة20ج","TRIANGLE CHEESE     ","جبنة مطبوخة","EA.",6900]
[null,null,94,120903106,"لبن شكولاته","L/L FRESH MILK      ","لبن طويل العمر","PKT",4]
[null,null,95,120903317,"لبن 200ملى","L/L FRESH MILK      ","لبن طويل العمر","TIN",81]
[null,null,96,120903318,"لبن0منزوع0","L/L FRESH MILK      ","لبن طويل العمر","PKT",276]
[null,null,97,120903332,"كامل الدسم","L/L FRESH MILK      ","لبن طويل العمر","LTR",2568]
[null,null,98,120903333,"نصف دسم","L/L FRESH MILK      ","لبن طويل العمر","LTR",2172]
[null,null,99,120903335,"لبن بودر-ك","L/L FRESH MILK      ","لبن طويل العمر","KGM",108]
[null,null,100,120904322,"زبادى105جم","YOUGHURT            ","زبادى","EA.",1392]
[null,null,101,120904324,"زدايت105جم","YOUGHURT            ","زبادى","EA.",96]
[null,null,102,120905304,"شانتييه","CREAM               ","كريمه","KGM",675]
[null,null,103,120905306,"باتيسيرى ك","CREAM               ","كريمه","KGM",70]
[null,null,104,120905324,"كريمةنباتى","CREAM               ","كريمه","LTR",396]
[null,null,105,120905365,"ك/تشيزبودر","CREAM               ","كريمه","KGM",160]
[null,null,106,121001306,"طبيعى","BUTTER              ","مسلى طبيعى","KGM",15]
[null,null,107,121001308,"زبدة 25كجم","BUTTER              ","مسلى طبيعى","KGM",6000]
[null,null,108,121003313,"زيت1لترزرة","CORN OIL            ","زيت ذرة","TIN",1272]
[null,null,109,121004318,"ز/من8ألى1","VARIED OIL          ","زيوت متنوعة","BOT",36]
[null,null,110,121007107,"زيت قلى لت","PLANT OIL           ","زيت نباتى للتحمير","LTR",1060]
[null,null,111,121101306,"خضار120جم","BABY FOOD           ","اكل طفل","JAR",1308]
[null,null,112,121101307,"فاكهه125جم","BABY FOOD           ","اكل طفل","JAR",2580]
[null,null,113,121104310,"مرقةدج1100","SOUP                ","شوربه","TIN",108]
[null,null,114,121204309,"فول م3كيلو","BROWN BEANS         ","فول مدمس","TIN",452]
[null,null,115,121205102,"أبيض كم","SESAME              ","سمسم","KGM",40]
[null,null,116,121206306,"425ص","CORN                ","(ذرة(بيبى كورن","TIN",576]
[null,null,117,121207309,"حمص مسل400","HOMMOS              ","حمص","TIN",480]
[null,null,118,121301310,"طبيعىمحلى","OLIVES              ","زيتون","KGM",250]
[null,null,119,121301315,"ز/م1450م/س","OLIVES              ","زيتون","TIN",36]
[null,null,120,121301316,"ز/م/خ1450م","OLIVES              ","زيتون","TIN",167]
[null,null,121,121302307,"مشكل كيلو","PICKLES             ","مخلل","KGM",200]
[null,null,122,121302314,"خيارقشةمخل","PICKLES             ","مخلل","KGM",50]
[null,null,123,121303311,"حبوب كاري","CAPRY","كاري بالخل","JAR",18]
[null,null,124,121304001,"كتشب ح28ج","KETCHUP             ","كاتشب","EA.",1890]
[null,null,125,121304002,"ك/حار ح28ج","KETCHUP             ","كاتشب","EA.",1530]
[null,null,126,121304506,"كاتشب200جم","KETCHUP             ","كاتشب","JAR",936]
[null,null,127,121304511,"كتشب ظرف7ج","KETCHUP             ","كاتشب","PKT",8000]
[null,null,128,121305003,"ص/درسنج20ج","SAUCE               ","صوص","EA.",500]
[null,null,129,121305347,"هوت صوص165","SAUCE               ","صوص","BOT",984]
[null,null,130,121306001,"ميونيز ح28","MUSTARD             ","مستردةومايونيز","EA.",1620]
[null,null,131,121306002,"مسترد ح28ج","MUSTARD             ","مستردةومايونيز","EA.",1170]
[null,null,132,121306003,"مستردة235ج","MUSTARD             ","مستردةومايونيز","BOT",72]
[null,null,133,121306323,"م /السحرى","MUSTARD             ","مستردةومايونيز","JRK",49]
[null,null,134,121306332,"مسترده محل","MUSTARD             ","مستردةومايونيز","TIN",8]
[null,null,135,121307101,"سايبه  كجم","SESAME PASTE        ","طحينة","KGM",90]
[null,null,136,121401419,"50جم6قطع","VARIED BISCUIT      ","بسكويت انواع","PKT",30500]
[null,null,137,121402105,"ش/ شيبس","CHOCOLATE           ","شيكولاتة","KGM",10]
[null,null,138,121402106,"ريترسبورتج","CHOCOLATE           ","شيكولاتة","EA.",80740]
[null,null,139,121402325,"ش/مبشورةسا","CHOCOLATE           ","شيكولاتة","KGM",25]
[null,null,140,121402330,"كفرتور2500","CHOCOLATE           ","شيكولاتة","PKT",48]
[null,null,141,121402341,"ش/كفر2500ج","CHOCOLATE           ","شيكولاتة","PKT",24]
[null,null,142,121402433,"شكولاتةفلتس","CHOCOLATE           ","شيكولاتة","PKT",1404]
[null,null,143,121402455,"ش.برلز بني","CHOCOLATE           ","شيكولاتة","KGM",20]
[null,null,144,121402472,"ش/بيل سادة","CHOCOLATE           ","شيكولاتة","KGM",20]
[null,null,145,121402473,"ش/بيل حليب","CHOCOLATE           ","شيكولاتة","KGM",20]
[null,null,146,121403303,"ب0أاخرى","COCOA               ","كاكاو","KGM",25]
[null,null,147,121501324,"مشمش  ك","JAM                 ","مربى","KGM",270]
[null,null,148,121601301,"مشمشية1كج","DEHYDRATED FRUITS   ","فواكه جافة/مسكرة","KGM",100]
[null,null,149,121601303,"زبيب مستور","DEHYDRATED FRUITS   ","فواكه جافة/مسكرة","KGM",230]
[null,null,150,121601305,"قراصيا كج","DEHYDRATED FRUITS   ","فواكه جافة/مسكرة","KGM",110]
[null,null,151,121601307,"قشرةمسكرة","DEHYDRATED FRUITS   ","فواكه جافة/مسكرة","KGM",144]
[null,null,152,121603301,"مبشور   كج","COCONUTS            ","جوز هند","KGM",25]
[null,null,153,121604303,"فستق مقشرك","SHELLED NUTS        ","مكسرات","KGM",10]
[null,null,154,121604307,"لوزشرائح","SHELLED NUTS        ","مكسرات","KGM",25]
[null,null,155,121604315,"لوز بودرة","SHELLED NUTS        ","مكسرات","KGM",5]
[null,null,156,121604316,"ف/مجفف35جم","SHELLED NUTS        ","مكسرات","PKT",38300]
[null,null,157,121604317,"مكسرات30جم","SHELLED NUTS        ","مكسرات","PKT",31100]
[null,null,158,121702102,"أسانس 1كجم","ESSANCES            ","ايسانس","KGM",2]
[null,null,159,121702106,"اسانس موز","ESSANCES            ","ايسانس","KGM",1]
[null,null,160,121702108,"اسنس أنانس","ESSANCES            ","ايسانس","KGM",1]
[null,null,161,121706310,"خل1لترأبيض","VENIGAR             ","خل","BOT",132]
[null,null,162,121707321,"جيلاتينا","GILATTIN            ","جيلاتينا","KGM",10]
[null,null,163,121707326,"بابنج كرمل","GILATTIN            ","جيلاتينا","KGM",13.5]
[null,null,164,121707331,"جيلى ساخن","GILATTIN            ","جيلاتينا","KGM",36]
[null,null,165,121707333,"ببينج شيكو","GILATTIN            ","جيلاتينا","KGM",157.5]
[null,null,166,121707334,"جيل ع بارد","GILATTIN            ","جيلاتينا","KGM",243]
[null,null,167,121708101,"بالكيلو","VANILIA             ","فانيليا","KGM",2.5]
[null,null,168,121710102,"لون اصفر","COLOUR              ","لون","KGM",10]
[null,null,169,121710103,"لون أخضر","COLOUR              ","لون","KGM",1]
[null,null,170,121711307,"مسحوق خبيز","YEAST/BAKING POWDER ","مسحوق خبيز;خميرة/بيكينجبودر","KGM",100]
[null,null,171,121711311,"خ.محلى450ج","YEAST/BAKING POWDER ","خ.محلى450ج;خميرة/بيكينجبودر","PKT",300]
[null,null,172,121712104,"كيك اسفنجى","ADDITIVES           ","كيك اسفنجى;محسنات خبزوكيك","KGM",2060]
[null,null,173,121712110,"بلاك فورست","ADDITIVES           ","بلاك فورست;محسنات خبزوكيك","KGM",1360]
[null,null,174,121712112,"عجينةبندق","ADDITIVES           ","عجينةبندق ;محسنات خبزوكيك","KGM",48]
[null,null,175,121712114,"موس فانيلي","ADDITIVES           ","موس فانيلي;محسنات خبزوكيك","KGM",130]
[null,null,176,121712115,"موس شكولاته","ADDITIVES           ","موس شكولاته;محسنات خبزوكيك","KGM",30]
[null,null,177,121712120,"شكو تيرامي","ADDITIVES           ","شكو تيرامي;محسنات خبزوكيك","KGM",280]
[null,null,178,121805319,"حشوتفاح4كي","PIE FILLING         ","حشوتفاح4كي;حشو تورتة","JRK",1]
[null,null,179,121805329,"حشوكريز4ك","PIE FILLING         ","حشوكريز4ك ;حشو تورتة","TIN",10]
[null,null,180,320102332,"كولالايت330م","SOFT DRINK BIG      ","كولالايت330م;مياه غازيه كبيره","TIN",624]
[null,null,181,320102340,"ل/دايت330م","SOFT DRINK BIG      ","ل/دايت330م;مياه غازيه كبيره","CRT",50]
[null,null,182,320102376,"برتقال250م","SOFT DRINK BIG      ","برتقال250م;مياه غازيه كبيره","TIN",3192]
[null,null,183,320102378,"ليمون250مل","SOFT DRINK BIG      ","ليمون250مل;مياه غازيه كبيره","TIN",3600]
[null,null,184,320102385,"كولا250مللى","SOFT DRINK BIG      ","كولا250مللى;مياه غازيه كبيره","TIN",4416]
[null,null,185,320104306,"اناناس 330",".ON ALCOH. BEER     ","اناناس 330;مشروب شعير بدون كحول","TIN",1968]
[null,null,186,320104314,"خوخ330ملى",".ON ALCOH. BEER     ","خوخ330ملى ;مشروب شعير بدون كحول","TIN",1296]
[null,null,187,320105006,"كولا970مم","SOFT DRINKS 1 LITER ","كولا970مم ;مشروبات غازية حوالى1","BOT",2550]
[null,null,188,320105007,"كولالايت970م","SOFT DRINKS 1 LITER ","كولالايت970م;مشروبات غازية حوالى1","BOT",594]
[null,null,189,320105008,"ليمون970مم","SOFT DRINKS 1 LITER ","مشروبات غازية حوالى1","BOT",3510]
[null,null,190,320105009,"ل/لايت970مم","SOFT DRINKS 1 LITER ","مشروبات غازية حوالى1","BOT",1800]
[null,null,191,320105010,"برتقال970م","SOFT DRINKS 1 LITER ","مشروبات غازية حوالى1","BOT",1200]
[null,null,192,320106001,"صوداوتر250","WATR COLL           ","مياة غازية عبوات","BOT",2232]
[null,null,193,320106002,"تونيك250مم","WATR COLL           ","مياة غازية عبوات","BOT",1752]
[null,null,194,320201328,"ش/أخ/نع5را","TEA                 ","شاى","PKT",12160]
[null,null,195,320201329,"ش/نكهات2جم","TEA                 ","شاى","PKT",22560]
[null,null,196,320201616,"ش ايرلى جر","TEA                 ","شاى","PKT",4560]
[null,null,197,320201633,"أحمر2جم ظر","TEA                 ","شاى","PKT",101440]
[null,null,198,320201634,"ش احمر2بدو","TEA                 ","شاى","PKT",153360]
[null,null,199,320202001,"ظ/جولد8ر1","COFFEE              ","بن","PKT",39900]
[null,null,200,320202002,"ن/جولد100ب","COFFEE              ","بن","JAR",228]
[null,null,201,320202003,"قهومفلتر70","COFFEE              ","بن","EA.",5000]
[null,null,202,320202609,"نستله كلاسك","COFFEE              ","بن","JAR",10080]
[null,null,203,320202630,"اسبرسو7جم","COFFEE              ","بن","EA.",6600]
[null,null,204,320202633,"لاتية18جم","COFFEE              ","بن","PKT",1920]
[null,null,205,320202635,"بنجور/شيكو","COFFEE              ","بن","EA.",3456]
[null,null,206,320202636,"ك/بندق14جم","COFFEE              ","بن","PKT",4032]
[null,null,207,320202637,"ن/جولد50جم","COFFEE              ","بن","JAR",336]
[null,null,208,320203603,"بلاستك10جم","BUTTER PATS         ","زبدة بالقطعة","THN",80.400000000000006]
[null,null,209,320204001,"ص/باربيكيو","SALAD DRESSING      ","سلاطةدريسنج","KGM",5]
[null,null,210,320204004,"ش/صوص750جم","SALAD DRESSING      ","سلاطةدريسنج","EA.",36]
[null,null,211,320204601,"باكو10ج","SALAD DRESSING      ","سلاطةدريسنج","THN",116]
[null,null,212,320204636,"ديمىجلاس750","SALAD DRESSING      ","سلاطةدريسنج","TIN",114]
[null,null,213,320205607,"ملح1جم مم","PKT SALT/PEPPER     ","عبوات ملح /فلفل","THN",135]
[null,null,214,320205608,"فلفل5رجم م","PKT SALT/PEPPER     ","عبوات ملح /فلفل","THN",160]
[null,null,215,320206603,"كريمر م/م","DRY MILK            ","لبن جاف باكو","THN",12]
[null,null,216,320206605,"كريمرش م/م","DRY MILK            ","لبن جاف باكو","THN",111]
[null,null,217,320207603,"سكرمنخفض","SUGAR               ","سكر ناعم","THN",28]
[null,null,218,320207617,"سكرمغلف بد","SUGAR               ","سكر ناعم","THN",116]
[null,null,219,320207623,"سكر5ج شعار","SUGAR               ","سكر ناعم","THN",204]
[null,null,220,320208617,"مربى اصناف","JAM PORTION         ","مربى","EA.",4176]
[null,null,221,320208624,"م/ب/ف20جم","JAM PORTION         ","مربى","EA.",31360]
[null,null,222,320209612,"ع/نح/ب/20ج","HONEY PORTION       ","عسل نحل","EA.",2240]
[null,null,223,320209613,"ع/زجاج3ر28","HONEY PORTION       ","عسل نحل","EA.",2880]
[null,null,224,320304301,"برتقال"," UICE CARTON 1 LTR  ","عصير علب كرتون 1لتر","CRT",675]
[null,null,225,320304302,"تفاح"," UICE CARTON 1 LTR  ","عصير علب كرتون 1لتر","CRT",365]
[null,null,226,320304303,"مانجو"," UICE CARTON 1 LTR  ","عصير علب كرتون 1لتر","CRT",450]
[null,null,227,320304305,"جوافة1لتر"," UICE CARTON 1 LTR  ","عصير علب كرتون 1لتر","CRT",450]
[null,null,228,320304306,"تفاح/غ/م"," UICE CARTON 1 LTR  ","عصير علب كرتون 1لتر","CRT",435]
[null,null,229,320304317,"اناناس غ م"," UICE CARTON 1 LTR  ","عصير علب كرتون 1لتر","LTR",2700]
[null,null,230,320304322,"ع/طمطم غير"," UICE CARTON 1 LTR  ","عصير علب كرتون 1لتر","CRT",75]
[null,null,231,320305427,"تفاح/م235م","VARIED JUICE        ","عصير انواع","TIN",25515]
[null,null,232,320305428,"ع/جوافة235","VARIED JUICE        ","عصير انواع","TIN",14580]
[null,null,233,320305429,"ع/مانجو235","VARIED JUICE        ","عصير انواع","TIN",18090]
[null,null,234,320305430,"ع/برتقل235","VARIED JUICE        ","عصير انواع","TIN",36450]
[null,null,235,320305431,"أناناس235م","VARIED JUICE        ","عصير انواع","TIN",4509]
[null,null,236,320305432,"كوكتيل235م","VARIED JUICE        ","عصير انواع","TIN",4590]
[null,null,237,320305434,"تفاح235بيو","VARIED JUICE        ","عصير انواع","TIN",135]
[null,null,238,320401327,"كوب م110مم","MINERAL WATER       ","مياه معدنية","BOT",75840]
[null,null,239,320401502,"عبوه1,5لتر","MINERAL WATER       ","مياه معدنية","BOX",330]
[null,null,240,320401509,"مياه600ملى","MINERAL WATER       ","مياه معدنية","CRT",316]
[null,null,241,320401523,"ميا330طبعى","MINERAL WATER       ","مياه معدنية","BOT",3120]
[null,null,242,320401526,"م فواره240","MINERAL WATER       ","مياه معدنية","BOT",96]
[null,null,243,40521,"احمد عزم"]

{"sheet":"مخزن 138","index":2,"n_rows":110,"n_cols":13,"rows_kept":110,"cut":false,"hidden":false,"merged":[]}
[null,null,null,"مخزن 138"]
[]
[]
[null,null,"رقم الصنف","الصنف","المجموعه","الوحده","الكميه","يوم","شهر","سنة","تاريخ الانتاج","تاريخ الانتهاء","الوقت المتبقى من تاريخ الجرد"]
[null,null,120109106,"سوسيس بقري","لحوم","كيلو جرام ",45,null,3,null,"2020-01-13",{"$f":"IF(K5=\"\",\"\",K5+DATE(J5,I5+1,H5))","v":"2020-04-13"},{"$f":"IF(L5=\"\",\"\",L5-TODAY())","v":3}]
[null,null,120311101,"رومي مدخن ","لحوم مدخن","كيلو جرام ",12,null,3,null,"2020-01-15","2020-04-15",5]
[null,null,120205101,"بيض","مأكولات ومشروبات","عدد",600,21,null,null,"2020-03-25","2020-04-15",5]
[null,null,120311100,"بيف بقري مدخن ","لحوم مدخن","كيلو جرام ",45,null,3,null,"2020-01-16","2020-04-16",6]
[null,null,121707331,"جيلي ساخن ","مأكولات ومشروبات","كيلو جرام ",4.5,null,null,1,"2019-05-05","2020-05-05",25]
[null,null,121401419,"بسكويت بالذبدة 5.6قطع","مأكولات ومشروبات","باكت ",3498,null,9,null,"2019-08-06","2020-05-06",26]
[null,null,120301306,"سمك بلطي ","اسماك","كيلو جرام ",9,null,6,null,"2019-11-18","2020-05-18",38]
[null,null,120309303,"سيمون مدخن ","اسماك","كيلو جرام ",17,null,5,null,"2020-01-21","2020-06-21",72]
[null,null,320203603,"زبدة 10جم ","البان وجبن","عدد",2200,null,null,1,"2019-06-22","2020-06-22",73]
[null,null,121401462,"تونكيز كيك","مأكولات ومشروبات","باكت ",900,null,5,null,"2020-01-28","2020-06-28",79]
[null,null,120405306,"بطاطس بودرة ","مأكولات ومشروبات","كيلو جرام ",4,null,6,null,"2019-12-30","2020-06-29",80]
[null,null,120807304,"جبنة مثلثات ","البان وجبن","عدد",10368,null,6,null,"2019-12-30","2020-06-29",80]
[null,null,120903332,"لبن كامل الدسم 1 لتر ","البان وجبن","لتر ",377,null,6,null,"2020-01-01","2020-07-01",82]
[null,null,320102385,"كولا كانز250ملي","مشروبات غازيه","عدد",62,null,9,null,"2019-10-01","2020-07-01",82]
[null,null,320105007,"كولا دايت 970مللي ","مشروبات غازيه","زجاجة ",63,null,6,null,"2020-01-11","2020-07-11",92]
[null,null,320102376,"ميرندا برتقال كانز250م","مشروبات غازيه","عدد",16,null,9,null,"2019-10-15","2020-07-15",96]
[null,null,320106002,"تونك 250مللي ","مشروبات غازيه","زجاجة ",47,null,null,1,"2019-07-15","2020-07-15",96]
[null,null,320105009,"سفن دايت 970مللي","مشروبات غازيه","زجاجة ",54,null,6,null,"2020-01-17","2020-07-17",98]
[null,null,320105008,"سفن 970ملي ","مشروبات غازيه","زجاجة ",368,null,6,null,"2020-01-24","2020-07-24",105]
[null,null,120805103,"جبنة جودة ","البان وجبن","كيلو جرام ",108,null,9,null,"2019-10-28","2020-07-28",109]
[null,null,120103214,"لحم وش فخدة ","لحوم","كيلو جرام ",204,null,null,1,"2019-07-30","2020-07-30",111]
[null,null,120710301,"كركم ","مأكولات ومشروبات","جرام ",250,null,null,1,"2019-07-30","2020-07-30",111]
[null,null,320204601,"درسنج 10جم ","مأكولات ومشروبات","باكو ",9000,null,6,null,"2020-01-30","2020-07-30",111]
[null,null,120903318,"لبن خالي الدسم 1 لتر ","البان وجبن","لتر ",35,null,6,null,"2020-02-02","2020-08-02",114]
[null,null,120805107,"جبنة شيدر احمر ","البان وجبن","كيلو جرام ",3,null,6,null,"2020-02-03","2020-08-03",115]
[null,null,320105010,"ميرندا برتقال 970 ملي","مشروبات غازيه","زجاجة ",290,null,6,null,"2020-02-04","2020-08-04",116]
[null,null,121101306,"اكل طفل خضار ","مأكولات ومشروبات","برطمان ",26,null,null,1,"2019-08-08","2020-08-08",120]
[null,null,320105006,"كولا 970مللي ","مشروبات غازيه","زجاجة ",418,null,6,null,"2020-02-16","2020-08-16",128]
[null,null,320304317,"عصير اناناس بيور 1 لتر ","عصائر","لتر ",96,null,10,null,"2019-10-29","2020-08-29",141]
[null,null,120407308,"صلصة طماطم ","مأكولات ومشروبات","علبة ",2,null,null,1,"2019-08-30","2020-08-30",142]
[null,null,120416318,"مشروم شراءح 850جم ","مأكولات ومشروبات","علبة ",268,null,null,2,"2018-08-30","2020-08-30",142]
[null,null,120502306,"كمبوت خوخ 820جم","مأكولات ومشروبات","علبه",108,null,null,1,"2019-08-30","2020-08-30",142]
[null,null,121402458,"توفي جامي ","مأكولات ومشروبات","كيلو جرام ",11,null,null,1,"2019-08-30","2020-08-30",142]
[null,null,121712114,"موس فانيلي","مأكولات ومشروبات","كيلو جرام ",100,null,null,1,"2019-08-30","2020-08-30",142]
[null,null,320304306,"عصير تفاح بيور 1 لتر ","عصائر","لتر ",88,null,10,null,"2019-11-24","2020-09-24",167]
[null,null,320206603,"كريمر ","مأكولات ومشروبات","عدد",14300,null,null,1,"2019-09-25","2020-09-25",168]
[null,null,520508119,"كوفير9*1 بدون شعار","بلاستيكات","عدد",25000,null,null,1,"2019-10-13","2020-10-13",186]
[null,null,121402341,"شيكولاتة  كفرتورة بيضاء ","مأكولات ومشروبات","باكت ",8,null,null,1,"2019-10-14","2020-10-14",187]
[null,null,520508112,"كوفير 1 * 11 بالشعار","بلاستيكات","عدد",450,null,null,1,"2019-10-18","2020-10-18",191]
[null,null,120603106,"دقيق ","مأكولات ومشروبات","كيلو جرام ",250,null,9,null,"2020-01-22","2020-10-22",195]
[null,null,320104306,"اناناس كانز 330ملي","مشروبات غازيه","عدد",15,null,null,1,"2019-10-24","2020-10-24",197]
[null,null,320104314,"خوخ كانز 330ملي ","مشروبات غازيه","عدد",25,null,null,1,"2019-10-24","2020-10-24",197]
[null,null,320106001,"صودا 250مللي","مشروبات غازيه","زجاجة ",36,null,null,1,"2019-10-25","2020-10-25",198]
[null,null,120310202,"صوابع كابوريا","اسماك","كيلو جرام ",3.5,null,18,null,"2019-04-30","2020-10-28",201]
[null,null,121206305,"ذرة حب 2950جم","مأكولات ومشروبات","علبة ",12,null,null,2,"2018-11-01","2020-11-01",205]
[null,null,320204636,"ديمي جلاس 750جم","مأكولات ومشروبات","علبة ",41,null,null,1,"2019-11-01","2020-11-01",205]
[null,null,121001308,"زبدة بلوك ","البان وجبن","كيلو جرام ",25,null,null,1,"2019-11-06","2020-11-06",210]
[null,null,120601106,"مكرونة بنة ","مأكولات ومشروبات","كيلو جرام ",180,null,null,1,"2019-11-11","2020-11-11",215]
[null,null,121101307,"اكل طفل فاكهة ","مأكولات ومشروبات","برطمان ",24,null,null,1,"2019-11-13","2020-11-13",217]
[null,null,320208624,"مربي بورشين 20جم","مأكولات ومشروبات","عدد",5376,null,null,1,"2019-11-14","2020-11-14",218]
[null,null,121306322,"مستردة محلي ","مأكولات ومشروبات","جركن ",3,null,null,1,"2019-11-18","2020-11-18",222]
[null,null,320305430,"عصير برتقال 235مللي","عصائر","عدد",3269,null,null,1,"2019-11-20","2020-11-20",224]
[null,null,120601104,"مكرونة شريط ","مأكولات ومشروبات","كيلو جرام ",5,null,null,1,"2019-11-28","2020-11-28",232]
[null,null,120103203,"لحم فلتوا مستورد ","لحوم","كيلو جرام ",43,null,null,1,"2019-11-30","2020-11-30",234]
[null,null,120403202,"فاصوليا خضراء ","خضروات مجمده","كيلو جرام ",30,null,null,1,"2019-11-30","2020-11-30",234]
[null,null,121207309,"حمص 400جم ","مأكولات ومشروبات","علبة ",72,null,null,1,"2019-11-30","2020-11-30",234]
[null,null,120801113,"جبنة فيتا 125 جم ","البان وجبن","علبه",130,null,null,1,"2019-12-01","2020-12-01",235]
[null,null,320304303,"عصير ملنجو 1 لتر ","عصائر","لتر ",413,null,null,1,"2019-12-01","2020-12-01",235]
[null,null,121304511,"كاتشب ظرف 7جم ","مأكولات ومشروبات","باكت ",2000,null,null,1,"2019-12-02","2020-12-02",236]
[null,null,320304301,"عصير برتقال 1 لتر ","عصائر","لتر ",717,null,null,1,"2019-12-03","2020-12-03",237]
[null,null,320305428,"عصير جوافة 235مللي","عصائر","عدد",1555,null,null,1,"2019-12-03","2020-12-03",237]
[null,null,320401502,"مياة 1.5 لتر ","مياه معدنيه","زجاجة ",3465,null,null,1,"2019-12-05","2020-12-05",239]
[null,null,320305427,"عصير تفاح 235ملي","عصائر","عدد",3240,null,null,1,"2019-12-10","2020-12-10",244]
[null,null,121707326,"بابينج كرمل ","مأكولات ومشروبات","كيلو جرام ",13.5,null,null,1,"2019-12-12","2020-12-12",246]
[null,null,320304322,"عصير طماطم 1 لتر ","عصائر","لتر ",33,null,null,1,"2019-12-12",{"$f":"IF(K69=\"\",\"\",K69+DATE(J69,I69+1,H69))","v":"2020-12-12"},{"$f":"IF(L69=\"\",\"\",L69-TODAY())","v":246}]
[null,null,121402330,"شيكولاتة كفرتورة بني","مأكولات ومشروبات","باكت ",5,null,null,1,"2019-12-16","2020-12-16",250]
[null,null,320305429,"عصير مانجو 235مللي ","عصائر","عدد",1382,null,null,1,"2019-12-18","2020-12-18",252]
[null,null,320304302,"عصير تفاح 1 لتر ","عصائر","لتر ",370,null,null,1,"2019-12-22","2020-12-22",256]
[null,null,320304305,"عصير جوافة 1لتر ","عصائر","لتر ",368,null,null,1,"2019-12-23","2020-12-23",257]
[null,null,120202238,"صدور فراخ مجمدة ","فراخ","كيلو جرام ",262,null,null,1,"2019-12-30","2020-12-30",264]
[null,null,120401307,"بسلة بالجزر ","خضروات مجمده","كيلو جرام ",10,null,null,1,"2020-01-01","2021-01-01",266]
[null,null,121707333,"باببنج شيكولاتة ","مأكولات ومشروبات","كيلو جرام ",9,null,null,1,"2020-01-01","2021-01-01",266]
[null,null,121708101,"فانليا ","مأكولات ومشروبات","كيلو جرام ",0.5,null,null,2,"2019-01-01","2021-01-01",266]
[null,null,121712110,"بلاك فورست ","مأكولات ومشروبات","كيلو جرام ",20,null,null,1,"2020-01-01","2021-01-01",266]
[null,null,121706310,"خل ابيض","مأكولات ومشروبات","زجاجة ",44,null,null,1,"2020-01-03","2021-01-03",268]
[null,null,121301315,"زيتون اسود مخلي 1450جم","مأكولات ومشروبات","علبة ",16,null,18,null,"2019-07-07","2021-01-04",269]
[null,null,121304506,"كاشب 200جم ","مأكولات ومشروبات","زجاجة ",1,null,18,null,"2019-07-07","2021-01-04",269]
[null,null,121104310,"مرقة دجاج ","مأكولات ومشروبات","علبة ",12,null,null,1,"2020-01-20","2021-01-20",285]
[null,null,320201634,"شاي احمر 2جم بدون ظرف","مأكولات ومشروبات","باكت ",1440,null,null,2,"2019-01-29","2021-01-29",294]
[null,null,121007107,"زيت للقلي ","مأكولات ومشروبات","لتر ",40,null,null,1,"2020-01-30","2021-01-30",295]
[null,null,121712104,"اسبونج ابيض","مأكولات ومشروبات","كيلو جرام ",120,null,null,1,"2020-02-01","2021-02-01",297]
[null,null,120740115,"يانسون 1.5جم","مأكولات ومشروبات","علبه ",6,null,null,2,"2019-02-02","2021-02-02",298]
[null,null,320401509,"مياة 600مللي","مياه معدنيه","زجاجة ",1932,null,null,1,"2020-02-22","2021-02-22",318]
[null,null,121603301,"جوز هند مبشور ","مأكولات ومشروبات","كيلو جرام ",25,null,null,2,"2019-03-30","2021-03-30",354]
[null,null,320202637,"نسكافية جولد 50جم","مأكولات ومشروبات","برطمان ",98,null,null,2,"2019-03-30","2021-03-30",354]
[null,null,320201633,"شاي احمر 2جم ","مأكولات ومشروبات","باكت ",3800,null,null,2,"2019-04-23","2021-04-23",378]
[null,null,320201616,"شاي ايرلي ","مأكولات ومشروبات","باكت ",160,null,null,2,"2019-04-24","2021-04-24",379]
[null,null,120504302,"كمبوت اناناس 850جم","مأكولات ومشروبات","علبة ",181,null,null,2,"2019-05-21","2021-05-21",406]
[null,null,120304319,"تونة قطع 185جم","مأكولات ومشروبات","عدد",179,null,null,2,"2019-05-30","2021-05-30",415]
[null,null,320207603,"سكر دايت ","مأكولات ومشروبات","عدد",475,null,null,2,"2019-05-30","2021-05-30",415]
[null,null,320202609,"نسكافية كلاسك ","مأكولات ومشروبات","برطمان ",78,null,null,2,"2019-06-01","2021-06-01",417]
[null,null,121304316,"زيتون اخضر مخلي 1450جم","مأكولات ومشروبات","علبة ",17,null,18,null,"2020-01-01","2021-07-01",447]
[null,null,121004318,"زيت زيتون 1لتر ","مأكولات ومشروبات","زجاجة ",1,null,null,2,"2019-07-07","2021-07-07",453]
[null,null,320201328,"شاي اخضر ","مأكولات ومشروبات","باكت ",340,null,null,2,"2019-07-30","2021-07-30",476]
[null,null,120605105,"ارز بسمتي ","مأكولات ومشروبات","كيلو جرام ",65,null,null,3,"2018-08-18","2021-08-18",495]
[null,null,120718312,"ملح 300جم","مأكولات ومشروبات","باكت ",60,null,null,2,"2019-08-30","2021-08-30",507]
[null,null,320209612,"عسل بورشين 20جم","مأكولات ومشروبات","عدد",448,null,null,2,"2019-09-02","2021-09-02",510]
[null,null,320207617,"سكر مغلف ","مأكولات ومشروبات","عدد",17300,null,null,2,"2019-09-28","2021-09-28",536]
[null,null,120427102,"بروكلي ","خضروات مجمده","كيلو جرام ",13,null,null,2,"2019-09-30","2021-09-30",538]
[null,null,121204309,"فول مدمس 3كجم ","مأكولات ومشروبات","علبة ",17,null,null,2,"2019-09-30","2021-09-30",538]
[null,null,120605101,"ارز سياحي ","مأكولات ومشروبات","كيلو جرام ",75,null,null,2,"2019-10-30","2021-10-30",568]
[null,null,121003313,"زيت ذرى 1 لتر ","مأكولات ومشروبات","زجاجة ",192,null,null,2,"2019-11-19","2021-11-19",588]
[null,null,121711310,"خميرة باكت 450جم","مأكولات ومشروبات","باكت ",60,null,null,2,"2020-01-01","2022-01-01",631]
[null,null,121501324,"مربي مشمش 5كجم ","مأكولات ومشروبات","كيلو جرام ",40,null,null,2,"2020-01-03","2022-01-03",633]
[null,null,120609401,"سكر بودرة ","مأكولات ومشروبات","كيلو جرام ",14,null,null,3,"2019-02-25","2022-02-25",686]
[null,null,120609303,"سكر ناعم ","مأكولات ومشروبات","كيلو جرام ",100,null,null,3,"2019-05-03","2022-05-03",753]

{"sheet":"مخزن 139","index":3,"n_rows":162,"n_cols":10,"rows_kept":162,"cut":false,"hidden":false,"merged":[]}
[]
[null,null,null,"مخزن 139"]
[]
[]
[]
[null,null,null,"م","رقم الصنف","الصنف","المجموعه","المجموعه 2","الوحده","الكميه "]
[null,null,null,{"$f":"IF($F7=\"\",\"\",MAX($D$6:D6)+1)","v":1},111104101,{"$f":"IF(COUNTIF('مخزن 111'!$D$7:$D$249,$E7)=0,\"\",VLOOKUP($E7,'مخزن 111'!$D$7:$I$249,MATCH(F$6,'مخزن 111'!$D$6:$I$6,0),0))","v":"Abc"},{"$f":"IF(COUNTIF('مخزن 111'!$D$7:$D$249,$E7)=0,\"\",VLOOKUP($E7,'مخزن 111'!$D$7:$I$249,MATCH(G$6,'مخزن 111'!$D$6:$I$6,0),0))","v":"SOUP                "},{"$f":"IF(COUNTIF('مخزن 111'!$D$7:$D$249,$E7)=0,\"\",VLOOKUP($E7,'مخزن 111'!$D$7:$I$249,MATCH(H$6,'مخزن 111'!$D$6:$I$6,0),0))","v":"شوربه"},{"$f":"IF(COUNTIF('مخزن 111'!$D$7:$D$249,$E7)=0,\"\",VLOOKUP($E7,'مخزن 111'!$D$7:$I$249,MATCH(I$6,'مخزن 111'!$D$6:$I$6,0),0))","v":"EA."},{"$f":"IF(COUNTIF('مخزن 111'!$D$7:$D$249,$E7)=0,\"\",VLOOKUP($E7,'مخزن 111'!$D$7:$I$249,MATCH(J$6,'مخزن 111'!$D$6:$I$6,0),0))","v":8988}]
[null,null,null,{"$f":"IF($F8=\"\",\"\",MAX($D$6:D7)+1)","v":""},120103214,{"$f":"IF(COUNTIF('مخزن 111'!$D$7:$D$249,$E8)=0,\"\",VLOOKUP($E8,'مخزن 111'!$D$7:$I$249,MATCH(F$6,'مخزن 111'!$D$6:$I$6,0),0))","v":""},{"$f":"IF(COUNTIF('مخزن 111'!$D$7:$D$249,$E8)=0,\"\",VLOOKUP($E8,'مخزن 111'!$D$7:$I$249,MATCH(G$6,'مخزن 111'!$D$6:$I$6,0),0))","v":""},{"$f":"IF(COUNTIF('مخزن 111'!$D$7:$D$249,$E8)=0,\"\",VLOOKUP($E8,'مخزن 111'!$D$7:$I$249,MATCH(H$6,'مخزن 111'!$D$6:$I$6,0),0))","v":""},{"$f":"IF(COUNTIF('مخزن 111'!$D$7:$D$249,$E8)=0,\"\",VLOOKUP($E8,'مخزن 111'!$D$7:$I$249,MATCH(I$6,'مخزن 111'!$D$6:$I$6,0),0))","v":""},{"$f":"IF(COUNTIF('مخزن 111'!$D$7:$D$249,$E8)=0,\"\",VLOOKUP($E8,'مخزن 111'!$D$7:$I$249,MATCH(J$6,'مخزن 111'!$D$6:$I$6,0),0))","v":""}]
[null,null,null,{"$f":"IF($F9=\"\",\"\",MAX($D$6:D8)+1)","v":2},120202238,{"$f":"IF(COUNTIF('مخزن 111'!$D$7:$D$249,$E9)=0,\"\",VLOOKUP($E9,'مخزن 111'!$D$7:$I$249,MATCH(F$6,'مخزن 111'!$D$6:$I$6,0),0))","v":"ص/م200:165"},{"$f":"IF(COUNTIF('مخزن 111'!$D$7:$D$249,$E9)=0,\"\",VLOOKUP($E9,'مخزن 111'!$D$7:$I$249,MATCH(G$6,'مخزن 111'!$D$6:$I$6,0),0))","v":"CHICKENS            "},{"$f":"IF(COUNTIF('مخزن 111'!$D$7:$D$249,$E9)=0,\"\",VLOOKUP($E9,'مخزن 111'!$D$7:$I$249,MATCH(H$6,'مخزن 111'!$D$6:$I$6,0),0))","v":"فراخ"},{"$f":"IF(COUNTIF('مخزن 111'!$D$7:$D$249,$E9)=0,\"\",VLOOKUP($E9,'مخزن 111'!$D$7:$I$249,MATCH(I$6,'مخزن 111'!$D$6:$I$6,0),0))","v":"KGM"},{"$f":"IF(COUNTIF('مخزن 111'!$D$7:$D$249,$E9)=0,\"\",VLOOKUP($E9,'مخزن 111'!$D$7:$I$249,MATCH(J$6,'مخزن 111'!$D$6:$I$6,0),0))","v":6103.1379999999999}]
[null,null,null,{"$f":"IF($F10=\"\",\"\",MAX($D$6:D9)+1)","v":""},120103203,{"$f":"IF(COUNTIF('مخزن 111'!$D$7:$D$249,$E10)=0,\"\",VLOOKUP($E10,'مخزن 111'!$D$7:$I$249,MATCH(F$6,'مخزن 111'!$D$6:$I$6,0),0))","v":""},{"$f":"IF(COUNTIF('مخزن 111'!$D$7:$D$249,$E10)=0,\"\",VLOOKUP($E10,'مخزن 111'!$D$7:$I$249,MATCH(G$6,'مخزن 111'!$D$6:$I$6,0),0))","v":""},{"$f":"IF(COUNTIF('مخزن 111'!$D$7:$D$249,$E10)=0,\"\",VLOOKUP($E10,'مخزن 111'!$D$7:$I$249,MATCH(H$6,'مخزن 111'!$D$6:$I$6,0),0))","v":""},{"$f":"IF(COUNTIF('مخزن 111'!$D$7:$D$249,$E10)=0,\"\",VLOOKUP($E10,'مخزن 111'!$D$7:$I$249,MATCH(I$6,'مخزن 111'!$D$6:$I$6,0),0))","v":""},{"$f":"IF(COUNTIF('مخزن 111'!$D$7:$D$249,$E10)=0,\"\",VLOOKUP($E10,'مخزن 111'!$D$7:$I$249,MATCH(J$6,'مخزن 111'!$D$6:$I$6,0),0))","v":""}]
[null,null,null,{"$f":"IF($F11=\"\",\"\",MAX($D$6:D10)+1)","v":""},120304319,{"$f":"IF(COUNTIF('مخزن 111'!$D$7:$D$249,$E11)=0,\"\",VLOOKUP($E11,'مخزن 111'!$D$7:$I$249,MATCH(F$6,'مخزن 111'!$D$6:$I$6,0),0))","v":""},{"$f":"IF(COUNTIF('مخزن 111'!$D$7:$D$249,$E11)=0,\"\",VLOOKUP($E11,'مخزن 111'!$D$7:$I$249,MATCH(G$6,'مخزن 111'!$D$6:$I$6,0),0))","v":""},{"$f":"IF(COUNTIF('مخزن 111'!$D$7:$D$249,$E11)=0,\"\",VLOOKUP($E11,'مخزن 111'!$D$7:$I$249,MATCH(H$6,'مخزن 111'!$D$6:$I$6,0),0))","v":""},{"$f":"IF(COUNTIF('مخزن 111'!$D$7:$D$249,$E11)=0,\"\",VLOOKUP($E11,'مخزن 111'!$D$7:$I$249,MATCH(I$6,'مخزن 111'!$D$6:$I$6,0),0))","v":""},{"$f":"IF(COUNTIF('مخزن 111'!$D$7:$D$249,$E11)=0,\"\",VLOOKUP($E11,'مخزن 111'!$D$7:$I$249,MATCH(J$6,'مخزن 111'!$D$6:$I$6,0),0))","v":""}]
[null,null,null,{"$f":"IF($F12=\"\",\"\",MAX($D$6:D11)+1)","v":3},120309303,{"$f":"IF(COUNTIF('مخزن 111'!$D$7:$D$249,$E12)=0,\"\",VLOOKUP($E12,'مخزن 111'!$D$7:$I$249,MATCH(F$6,'مخزن 111'!$D$6:$I$6,0),0))","v":"سيمون"},{"$f":"IF(COUNTIF('مخزن 111'!$D$7:$D$249,$E12)=0,\"\",VLOOKUP($E12,'مخزن 111'!$D$7:$I$249,MATCH(G$6,'مخزن 111'!$D$6:$I$6,0),0))","v":"SMOKED FISH         "},{"$f":"IF(COUNTIF('مخزن 111'!$D$7:$D$249,$E12)=0,\"\",VLOOKUP($E12,'مخزن 111'!$D$7:$I$249,MATCH(H$6,'مخزن 111'!$D$6:$I$6,0),0))","v":"اسماك مدخنة"},{"$f":"IF(COUNTIF('مخزن 111'!$D$7:$D$249,$E12)=0,\"\",VLOOKUP($E12,'مخزن 111'!$D$7:$I$249,MATCH(I$6,'مخزن 111'!$D$6:$I$6,0),0))","v":"KGM"},{"$f":"IF(COUNTIF('مخزن 111'!$D$7:$D$249,$E12)=0,\"\",VLOOKUP($E12,'مخزن 111'!$D$7:$I$249,MATCH(J$6,'مخزن 111'!$D$6:$I$6,0),0))","v":89}]
[null,null,null,{"$f":"IF($F13=\"\",\"\",MAX($D$6:D12)+1)","v":""},120311100,{"$f":"IF(COUNTIF('مخزن 111'!$D$7:$D$249,$E13)=0,\"\",VLOOKUP($E13,'مخزن 111'!$D$7:$I$249,MATCH(F$6,'مخزن 111'!$D$6:$I$6,0),0))","v":""},{"$f":"IF(COUNTIF('مخزن 111'!$D$7:$D$249,$E13)=0,\"\",VLOOKUP($E13,'مخزن 111'!$D$7:$I$249,MATCH(G$6,'مخزن 111'!$D$6:$I$6,0),0))","v":""},{"$f":"IF(COUNTIF('مخزن 111'!$D$7:$D$249,$E13)=0,\"\",VLOOKUP($E13,'مخزن 111'!$D$7:$I$249,MATCH(H$6,'مخزن 111'!$D$6:$I$6,0),0))","v":""},{"$f":"IF(COUNTIF('مخزن 111'!$D$7:$D$249,$E13)=0,\"\",VLOOKUP($E13,'مخزن 111'!$D$7:$I$249,MATCH(I$6,'مخزن 111'!$D$6:$I$6,0),0))","v":""},{"$f":"IF(COUNTIF('مخزن 111'!$D$7:$D$249,$E13)=0,\"\",VLOOKUP($E13,'مخزن 111'!$D$7:$I$249,MATCH(J$6,'مخزن 111'!$D$6:$I$6,0),0))","v":""}]
[null,null,null,{"$f":"IF($F14=\"\",\"\",MAX($D$6:D13)+1)","v":""},120311101,{"$f":"IF(COUNTIF('مخزن 111'!$D$7:$D$249,$E14)=0,\"\",VLOOKUP($E14,'مخزن 111'!$D$7:$I$249,MATCH(F$6,'مخزن 111'!$D$6:$I$6,0),0))","v":""},{"$f":"IF(COUNTIF('مخزن 111'!$D$7:$D$249,$E14)=0,\"\",VLOOKUP($E14,'مخزن 111'!$D$7:$I$249,MATCH(G$6,'مخزن 111'!$D$6:$I$6,0),0))","v":""},{"$f":"IF(COUNTIF('مخزن 111'!$D$7:$D$249,$E14)=0,\"\",VLOOKUP($E14,'مخزن 111'!$D$7:$I$249,MATCH(H$6,'مخزن 111'!$D$6:$I$6,0),0))","v":""},{"$f":"IF(COUNTIF('مخزن 111'!$D$7:$D$249,$E14)=0,\"\",VLOOKUP($E14,'مخزن 111'!$D$7:$I$249,MATCH(I$6,'مخزن 111'!$D$6:$I$6,0),0))","v":""},{"$f":"IF(COUNTIF('مخزن 111'!$D$7:$D$249,$E14)=0,\"\",VLOOKUP($E14,'مخزن 111'!$D$7:$I$249,MATCH(J$6,'مخزن 111'!$D$6:$I$6,0),0))","v":""}]
[null,null,null,{"$f":"IF($F15=\"\",\"\",MAX($D$6:D14)+1)","v":4},120401307,{"$f":"IF(COUNTIF('مخزن 111'!$D$7:$D$249,$E15)=0,\"\",VLOOKUP($E15,'مخزن 111'!$D$7:$I$249,MATCH(F$6,'مخزن 111'!$D$6:$I$6,0),0))","v":"بسله بجزر"},{"$f":"IF(COUNTIF('مخزن 111'!$D$7:$D$249,$E15)=0,\"\",VLOOKUP($E15,'مخزن 111'!$D$7:$I$249,MATCH(G$6,'مخزن 111'!$D$6:$I$6,0),0))","v":"GREEN PEAS          "},{"$f":"IF(COUNTIF('مخزن 111'!$D$7:$D$249,$E15)=0,\"\",VLOOKUP($E15,'مخزن 111'!$D$7:$I$249,MATCH(H$6,'مخزن 111'!$D$6:$I$6,0),0))","v":"بسلة خضراء"},{"$f":"IF(COUNTIF('مخزن 111'!$D$7:$D$249,$E15)=0,\"\",VLOOKUP($E15,'مخزن 111'!$D$7:$I$249,MATCH(I$6,'مخزن 111'!$D$6:$I$6,0),0))","v":"KGM"},{"$f":"IF(COUNTIF('مخزن 111'!$D$7:$D$249,$E15)=0,\"\",VLOOKUP($E15,'مخزن 111'!$D$7:$I$249,MATCH(J$6,'مخزن 111'!$D$6:$I$6,0),0))","v":1850}]
[null,null,null,{"$f":"IF($F16=\"\",\"\",MAX($D$6:D15)+1)","v":5},120403202,{"$f":"IF(COUNTIF('مخزن 111'!$D$7:$D$249,$E16)=0,\"\",VLOOKUP($E16,'مخزن 111'!$D$7:$I$249,MATCH(F$6,'مخزن 111'!$D$6:$I$6,0),0))","v":"مجمدة كجم"},{"$f":"IF(COUNTIF('مخزن 111'!$D$7:$D$249,$E16)=0,\"\",VLOOKUP($E16,'مخزن 111'!$D$7:$I$249,MATCH(G$6,'مخزن 111'!$D$6:$I$6,0),0))","v":"GREEN BEANS         "},{"$f":"IF(COUNTIF('مخزن 111'!$D$7:$D$249,$E16)=0,\"\",VLOOKUP($E16,'مخزن 111'!$D$7:$I$249,MATCH(H$6,'مخزن 111'!$D$6:$I$6,0),0))","v":"فاصوليا خضراء"},{"$f":"IF(COUNTIF('مخزن 111'!$D$7:$D$249,$E16)=0,\"\",VLOOKUP($E16,'مخزن 111'!$D$7:$I$249,MATCH(I$6,'مخزن 111'!$D$6:$I$6,0),0))","v":"KGM"},{"$f":"IF(COUNTIF('مخزن 111'!$D$7:$D$249,$E16)=0,\"\",VLOOKUP($E16,'مخزن 111'!$D$7:$I$249,MATCH(J$6,'مخزن 111'!$D$6:$I$6,0),0))","v":280}]
[null,null,null,{"$f":"IF($F17=\"\",\"\",MAX($D$6:D16)+1)","v":""},120405102,{"$f":"IF(COUNTIF('مخزن 111'!$D$7:$D$249,$E17)=0,\"\",VLOOKUP($E17,'مخزن 111'!$D$7:$I$249,MATCH(F$6,'مخزن 111'!$D$6:$I$6,0),0))","v":""},{"$f":"IF(COUNTIF('مخزن 111'!$D$7:$D$249,$E17)=0,\"\",VLOOKUP($E17,'مخزن 111'!$D$7:$I$249,MATCH(G$6,'مخزن 111'!$D$6:$I$6,0),0))","v":""},{"$f":"IF(COUNTIF('مخزن 111'!$D$7:$D$249,$E17)=0,\"\",VLOOKUP($E17,'مخزن 111'!$D$7:$I$249,MATCH(H$6,'مخزن 111'!$D$6:$I$6,0),0))","v":""},{"$f":"IF(COUNTIF('مخزن 111'!$D$7:$D$249,$E17)=0,\"\",VLOOKUP($E17,'مخزن 111'!$D$7:$I$249,MATCH(I$6,'مخزن 111'!$D$6:$I$6,0),0))","v":""},{"$f":"IF(COUNTIF('مخزن 111'!$D$7:$D$249,$E17)=0,\"\",VLOOKUP($E17,'مخزن 111'!$D$7:$I$249,MATCH(J$6,'مخزن 111'!$D$6:$I$6,0),0))","v":""}]
[null,null,null,{"$f":"IF($F18=\"\",\"\",MAX($D$6:D17)+1)","v":6},120405306,{"$f":"IF(COUNTIF('مخزن 111'!$D$7:$D$249,$E18)=0,\"\",VLOOKUP($E18,'مخزن 111'!$D$7:$I$249,MATCH(F$6,'مخزن 111'!$D$6:$I$6,0),0))","v":"بطاطس بودر"},{"$f":"IF(COUNTIF('مخزن 111'!$D$7:$D$249,$E18)=0,\"\",VLOOKUP($E18,'مخزن 111'!$D$7:$I$249,MATCH(G$6,'مخزن 111'!$D$6:$I$6,0),0))","v":"POTATOES            "},{"$f":"IF(COUNTIF('مخزن 111'!$D$7:$D$249,$E18)=0,\"\",VLOOKUP($E18,'مخزن 111'!$D$7:$I$249,MATCH(H$6,'مخزن 111'!$D$6:$I$6,0),0))","v":"بطاطس"},{"$f":"IF(COUNTIF('مخزن 111'!$D$7:$D$249,$E18)=0,\"\",VLOOKUP($E18,'مخزن 111'!$D$7:$I$249,MATCH(I$6,'مخزن 111'!$D$6:$I$6,0),0))","v":"KGM"},{"$f":"IF(COUNTIF('مخزن 111'!$D$7:$D$249,$E18)=0,\"\",VLOOKUP($E18,'مخزن 111'!$D$7:$I$249,MATCH(J$6,'مخزن 111'!$D$6:$I$6,0),0))","v":2}]
[null,null,null,{"$f":"IF($F19=\"\",\"\",MAX($D$6:D18)+1)","v":7},120407308,{"$f":"IF(COUNTIF('مخزن 111'!$D$7:$D$249,$E19)=0,\"\",VLOOKUP($E19,'مخزن 111'!$D$7:$I$249,MATCH(F$6,'مخزن 111'!$D$6:$I$6,0),0))","v":"صلصة3كيلو"},{"$f":"IF(COUNTIF('مخزن 111'!$D$7:$D$249,$E19)=0,\"\",VLOOKUP($E19,'مخزن 111'!$D$7:$I$249,MATCH(G$6,'مخزن 111'!$D$6:$I$6,0),0))","v":"TOMATOES            "},{"$f":"IF(COUNTIF('مخزن 111'!$D$7:$D$249,$E19)=0,\"\",VLOOKUP($E19,'مخزن 111'!$D$7:$I$249,MATCH(H$6,'مخزن 111'!$D$6:$I$6,0),0))","v":"طماطم"},{"$f":"IF(COUNTIF('مخزن 111'!$D$7:$D$249,$E19)=0,\"\",VLOOKUP($E19,'مخزن 111'!$D$7:$I$249,MATCH(I$6,'مخزن 111'!$D$6:$I$6,0),0))","v":"TIN"},{"$f":"IF(COUNTIF('مخزن 111'!$D$7:$D$249,$E19)=0,\"\",VLOOKUP($E19,'مخزن 111'!$D$7:$I$249,MATCH(J$6,'مخزن 111'!$D$6:$I$6,0),0))","v":76}]
[null,null,null,{"$f":"IF($F20=\"\",\"\",MAX($D$6:D19)+1)","v":""},120416318,{"$f":"IF(COUNTIF('مخزن 111'!$D$7:$D$249,$E20)=0,\"\",VLOOKUP($E20,'مخزن 111'!$D$7:$I$249,MATCH(F$6,'مخزن 111'!$D$6:$I$6,0),0))","v":""},{"$f":"IF(COUNTIF('مخزن 111'!$D$7:$D$249,$E20)=0,\"\",VLOOKUP($E20,'مخزن 111'!$D$7:$I$249,MATCH(G$6,'مخزن 111'!$D$6:$I$6,0),0))","v":""},{"$f":"IF(COUNTIF('مخزن 111'!$D$7:$D$249,$E20)=0,\"\",VLOOKUP($E20,'مخزن 111'!$D$7:$I$249,MATCH(H$6,'مخزن 111'!$D$6:$I$6,0),0))","v":""},{"$f":"IF(COUNTIF('مخزن 111'!$D$7:$D$249,$E20)=0,\"\",VLOOKUP($E20,'مخزن 111'!$D$7:$I$249,MATCH(I$6,'مخزن 111'!$D$6:$I$6,0),0))","v":""},{"$f":"IF(COUNTIF('مخزن 111'!$D$7:$D$249,$E20)=0,\"\",VLOOKUP($E20,'مخزن 111'!$D$7:$I$249,MATCH(J$6,'مخزن 111'!$D$6:$I$6,0),0))","v":""}]
[null,null,null,{"$f":"IF($F21=\"\",\"\",MAX($D$6:D20)+1)","v":8},120502306,{"$f":"IF(COUNTIF('مخزن 111'!$D$7:$D$249,$E21)=0,\"\",VLOOKUP($E21,'مخزن 111'!$D$7:$I$249,MATCH(F$6,'مخزن 111'!$D$6:$I$6,0),0))","v":"كمبوت820جم"},{"$f":"IF(COUNTIF('مخزن 111'!$D$7:$D$249,$E21)=0,\"\",VLOOKUP($E21,'مخزن 111'!$D$7:$I$249,MATCH(G$6,'مخزن 111'!$D$6:$I$6,0),0))","v":"PEACHES             "},{"$f":"IF(COUNTIF('مخزن 111'!$D$7:$D$249,$E21)=0,\"\",VLOOKUP($E21,'مخزن 111'!$D$7:$I$249,MATCH(H$6,'مخزن 111'!$D$6:$I$6,0),0))","v":"خوخ"},{"$f":"IF(COUNTIF('مخزن 111'!$D$7:$D$249,$E21)=0,\"\",VLOOKUP($E21,'مخزن 111'!$D$7:$I$249,MATCH(I$6,'مخزن 111'!$D$6:$I$6,0),0))","v":"TIN"},{"$f":"IF(COUNTIF('مخزن 111'!$D$7:$D$249,$E21)=0,\"\",VLOOKUP($E21,'مخزن 111'!$D$7:$I$249,MATCH(J$6,'مخزن 111'!$D$6:$I$6,0),0))","v":12}]
[null,null,null,{"$f":"IF($F22=\"\",\"\",MAX($D$6:D21)+1)","v":9},120504302,{"$f":"IF(COUNTIF('مخزن 111'!$D$7:$D$249,$E22)=0,\"\",VLOOKUP($E22,'مخزن 111'!$D$7:$I$249,MATCH(F$6,'مخزن 111'!$D$6:$I$6,0),0))","v":"كمبوت850جم"},{"$f":"IF(COUNTIF('مخزن 111'!$D$7:$D$249,$E22)=0,\"\",VLOOKUP($E22,'مخزن 111'!$D$7:$I$249,MATCH(G$6,'مخزن 111'!$D$6:$I$6,0),0))","v":"PINEAPPLE           "},{"$f":"IF(COUNTIF('مخزن 111'!$D$7:$D$249,$E22)=0,\"\",VLOOKUP($E22,'مخزن 111'!$D$7:$I$249,MATCH(H$6,'مخزن 111'!$D$6:$I$6,0),0))","v":"كمبوت اناناس"},{"$f":"IF(COUNTIF('مخزن 111'!$D$7:$D$249,$E22)=0,\"\",VLOOKUP($E22,'مخزن 111'!$D$7:$I$249,MATCH(I$6,'مخزن 111'!$D$6:$I$6,0),0))","v":"TIN"},{"$f":"IF(COUNTIF('مخزن 111'!$D$7:$D$249,$E22)=0,\"\",VLOOKUP($E22,'مخزن 111'!$D$7:$I$249,MATCH(J$6,'مخزن 111'!$D$6:$I$6,0),0))","v":672}]
[null,null,null,{"$f":"IF($F23=\"\",\"\",MAX($D$6:D22)+1)","v":10},120506305,{"$f":"IF(COUNTIF('مخزن 111'!$D$7:$D$249,$E23)=0,\"\",VLOOKUP($E23,'مخزن 111'!$D$7:$I$249,MATCH(F$6,'مخزن 111'!$D$6:$I$6,0),0))","v":"كريز كيلو"},{"$f":"IF(COUNTIF('مخزن 111'!$D$7:$D$249,$E23)=0,\"\",VLOOKUP($E23,'مخزن 111'!$D$7:$I$249,MATCH(G$6,'مخزن 111'!$D$6:$I$6,0),0))","v":"CHERRY              "},{"$f":"IF(COUNTIF('مخزن 111'!$D$7:$D$249,$E23)=0,\"\",VLOOKUP($E23,'مخزن 111'!$D$7:$I$249,MATCH(H$6,'مخزن 111'!$D$6:$I$6,0),0))","v":"كريز"},{"$f":"IF(COUNTIF('مخزن 111'!$D$7:$D$249,$E23)=0,\"\",VLOOKUP($E23,'مخزن 111'!$D$7:$I$249,MATCH(I$6,'مخزن 111'!$D$6:$I$6,0),0))","v":"KGM"},{"$f":"IF(COUNTIF('مخزن 111'!$D$7:$D$249,$E23)=0,\"\",VLOOKUP($E23,'مخزن 111'!$D$7:$I$249,MATCH(J$6,'مخزن 111'!$D$6:$I$6,0),0))","v":4.5}]
[null,null,null,{"$f":"IF($F24=\"\",\"\",MAX($D$6:D23)+1)","v":11},120601104,{"$f":"IF(COUNTIF('مخزن 111'!$D$7:$D$249,$E24)=0,\"\",VLOOKUP($E24,'مخزن 111'!$D$7:$I$249,MATCH(F$6,'مخزن 111'!$D$6:$I$6,0),0))","v":"شريط  كجم"},{"$f":"IF(COUNTIF('مخزن 111'!$D$7:$D$249,$E24)=0,\"\",VLOOKUP($E24,'مخزن 111'!$D$7:$I$249,MATCH(G$6,'مخزن 111'!$D$6:$I$6,0),0))","v":"MACARONI            "},{"$f":"IF(COUNTIF('مخزن 111'!$D$7:$D$249,$E24)=0,\"\",VLOOKUP($E24,'مخزن 111'!$D$7:$I$249,MATCH(H$6,'مخزن 111'!$D$6:$I$6,0),0))","v":"مكرونةوسمبوسه"},{"$f":"IF(COUNTIF('مخزن 111'!$D$7:$D$249,$E24)=0,\"\",VLOOKUP($E24,'مخزن 111'!$D$7:$I$249,MATCH(I$6,'مخزن 111'!$D$6:$I$6,0),0))","v":"KGM"},{"$f":"IF(COUNTIF('مخزن 111'!$D$7:$D$249,$E24)=0,\"\",VLOOKUP($E24,'مخزن 111'!$D$7:$I$249,MATCH(J$6,'مخزن 111'!$D$6:$I$6,0),0))","v":160}]
[null,null,null,{"$f":"IF($F25=\"\",\"\",MAX($D$6:D24)+1)","v":12},120601106,{"$f":"IF(COUNTIF('مخزن 111'!$D$7:$D$249,$E25)=0,\"\",VLOOKUP($E25,'مخزن 111'!$D$7:$I$249,MATCH(F$6,'مخزن 111'!$D$6:$I$6,0),0))","v":"بنة كجم"},{"$f":"IF(COUNTIF('مخزن 111'!$D$7:$D$249,$E25)=0,\"\",VLOOKUP($E25,'مخزن 111'!$D$7:$I$249,MATCH(G$6,'مخزن 111'!$D$6:$I$6,0),0))","v":"MACARONI            "},{"$f":"IF(COUNTIF('مخزن 111'!$D$7:$D$249,$E25)=0,\"\",VLOOKUP($E25,'مخزن 111'!$D$7:$I$249,MATCH(H$6,'مخزن 111'!$D$6:$I$6,0),0))","v":"مكرونةوسمبوسه"},{"$f":"IF(COUNTIF('مخزن 111'!$D$7:$D$249,$E25)=0,\"\",VLOOKUP($E25,'مخزن 111'!$D$7:$I$249,MATCH(I$6,'مخزن 111'!$D$6:$I$6,0),0))","v":"KGM"},{"$f":"IF(COUNTIF('مخزن 111'!$D$7:$D$249,$E25)=0,\"\",VLOOKUP($E25,'مخزن 111'!$D$7:$I$249,MATCH(J$6,'مخزن 111'!$D$6:$I$6,0),0))","v":1260}]
[null,null,null,{"$f":"IF($F26=\"\",\"\",MAX($D$6:D25)+1)","v":13},120603106,{"$f":"IF(COUNTIF('مخزن 111'!$D$7:$D$249,$E26)=0,\"\",VLOOKUP($E26,'مخزن 111'!$D$7:$I$249,MATCH(F$6,'مخزن 111'!$D$6:$I$6,0),0))","v":"محلى 50كجم"},{"$f":"IF(COUNTIF('مخزن 111'!$D$7:$D$249,$E26)=0,\"\",VLOOKUP($E26,'مخزن 111'!$D$7:$I$249,MATCH(G$6,'مخزن 111'!$D$6:$I$6,0),0))","v":"FLOWER              "},{"$f":"IF(COUNTIF('مخزن 111'!$D$7:$D$249,$E26)=0,\"\",VLOOKUP($E26,'مخزن 111'!$D$7:$I$249,MATCH(H$6,'مخزن 111'!$D$6:$I$6,0),0))","v":"دقيق بانواعه"},{"$f":"IF(COUNTIF('مخزن 111'!$D$7:$D$249,$E26)=0,\"\",VLOOKUP($E26,'مخزن 111'!$D$7:$I$249,MATCH(I$6,'مخزن 111'!$D$6:$I$6,0),0))","v":"KGM"},{"$f":"IF(COUNTIF('مخزن 111'!$D$7:$D$249,$E26)=0,\"\",VLOOKUP($E26,'مخزن 111'!$D$7:$I$249,MATCH(J$6,'مخزن 111'!$D$6:$I$6,0),0))","v":2893.04}]
[null,null,null,{"$f":"IF($F27=\"\",\"\",MAX($D$6:D26)+1)","v":""},120603169,{"$f":"IF(COUNTIF('مخزن 111'!$D$7:$D$249,$E27)=0,\"\",VLOOKUP($E27,'مخزن 111'!$D$7:$I$249,MATCH(F$6,'مخزن 111'!$D$6:$I$6,0),0))","v":""},{"$f":"IF(COUNTIF('مخزن 111'!$D$7:$D$249,$E27)=0,\"\",VLOOKUP($E27,'مخزن 111'!$D$7:$I$249,MATCH(G$6,'مخزن 111'!$D$6:$I$6,0),0))","v":""},{"$f":"IF(COUNTIF('مخزن 111'!$D$7:$D$249,$E27)=0,\"\",VLOOKUP($E27,'مخزن 111'!$D$7:$I$249,MATCH(H$6,'مخزن 111'!$D$6:$I$6,0),0))","v":""},{"$f":"IF(COUNTIF('مخزن 111'!$D$7:$D$249,$E27)=0,\"\",VLOOKUP($E27,'مخزن 111'!$D$7:$I$249,MATCH(I$6,'مخزن 111'!$D$6:$I$6,0),0))","v":""},{"$f":"IF(COUNTIF('مخزن 111'!$D$7:$D$249,$E27)=0,\"\",VLOOKUP($E27,'مخزن 111'!$D$7:$I$249,MATCH(J$6,'مخزن 111'!$D$6:$I$6,0),0))","v":""}]
[null,null,null,{"$f":"IF($F28=\"\",\"\",MAX($D$6:D27)+1)","v":14},120605101,{"$f":"IF(COUNTIF('مخزن 111'!$D$7:$D$249,$E28)=0,\"\",VLOOKUP($E28,'مخزن 111'!$D$7:$I$249,MATCH(F$6,'مخزن 111'!$D$6:$I$6,0),0))","v":"بالكيلو"},{"$f":"IF(COUNTIF('مخزن 111'!$D$7:$D$249,$E28)=0,\"\",VLOOKUP($E28,'مخزن 111'!$D$7:$I$249,MATCH(G$6,'مخزن 111'!$D$6:$I$6,0),0))","v":"RICE                "},{"$f":"IF(COUNTIF('مخزن 111'!$D$7:$D$249,$E28)=0,\"\",VLOOKUP($E28,'مخزن 111'!$D$7:$I$249,MATCH(H$6,'مخزن 111'!$D$6:$I$6,0),0))","v":"ارز سياحى"},{"$f":"IF(COUNTIF('مخزن 111'!$D$7:$D$249,$E28)=0,\"\",VLOOKUP($E28,'مخزن 111'!$D$7:$I$249,MATCH(I$6,'مخزن 111'!$D$6:$I$6,0),0))","v":"KGM"},{"$f":"IF(COUNTIF('مخزن 111'!$D$7:$D$249,$E28)=0,\"\",VLOOKUP($E28,'مخزن 111'!$D$7:$I$249,MATCH(J$6,'مخزن 111'!$D$6:$I$6,0),0))","v":950}]
[null,null,null,{"$f":"IF($F29=\"\",\"\",MAX($D$6:D28)+1)","v":15},120605105,{"$f":"IF(COUNTIF('مخزن 111'!$D$7:$D$249,$E29)=0,\"\",VLOOKUP($E29,'مخزن 111'!$D$7:$I$249,MATCH(F$6,'مخزن 111'!$D$6:$I$6,0),0))","v":"بسمتى مغلى"},{"$f":"IF(COUNTIF('مخزن 111'!$D$7:$D$249,$E29)=0,\"\",VLOOKUP($E29,'مخزن 111'!$D$7:$I$249,MATCH(G$6,'مخزن 111'!$D$6:$I$6,0),0))","v":"RICE                "},{"$f":"IF(COUNTIF('مخزن 111'!$D$7:$D$249,$E29)=0,\"\",VLOOKUP($E29,'مخزن 111'!$D$7:$I$249,MATCH(H$6,'مخزن 111'!$D$6:$I$6,0),0))","v":"ارز سياحى"},{"$f":"IF(COUNTIF('مخزن 111'!$D$7:$D$249,$E29)=0,\"\",VLOOKUP($E29,'مخزن 111'!$D$7:$I$249,MATCH(I$6,'مخزن 111'!$D$6:$I$6,0),0))","v":"KGM"},{"$f":"IF(COUNTIF('مخزن 111'!$D$7:$D$249,$E29)=0,\"\",VLOOKUP($E29,'مخزن 111'!$D$7:$I$249,MATCH(J$6,'مخزن 111'!$D$6:$I$6,0),0))","v":2840}]
[null,null,null,{"$f":"IF($F30=\"\",\"\",MAX($D$6:D29)+1)","v":16},120609303,{"$f":"IF(COUNTIF('مخزن 111'!$D$7:$D$249,$E30)=0,\"\",VLOOKUP($E30,'مخزن 111'!$D$7:$I$249,MATCH(F$6,'مخزن 111'!$D$6:$I$6,0),0))","v":"ناعم"},{"$f":"IF(COUNTIF('مخزن 111'!$D$7:$D$249,$E30)=0,\"\",VLOOKUP($E30,'مخزن 111'!$D$7:$I$249,MATCH(G$6,'مخزن 111'!$D$6:$I$6,0),0))","v":"SUGAR               "},{"$f":"IF(COUNTIF('مخزن 111'!$D$7:$D$249,$E30)=0,\"\",VLOOKUP($E30,'مخزن 111'!$D$7:$I$249,MATCH(H$6,'مخزن 111'!$D$6:$I$6,0),0))","v":"سكر"},{"$f":"IF(COUNTIF('مخزن 111'!$D$7:$D$249,$E30)=0,\"\",VLOOKUP($E30,'مخزن 111'!$D$7:$I$249,MATCH(I$6,'مخزن 111'!$D$6:$I$6,0),0))","v":"KGM"},{"$f":"IF(COUNTIF('مخزن 111'!$D$7:$D$249,$E30)=0,\"\",VLOOKUP($E30,'مخزن 111'!$D$7:$I$249,MATCH(J$6,'مخزن 111'!$D$6:$I$6,0),0))","v":1550}]
[null,null,null,{"$f":"IF($F31=\"\",\"\",MAX($D$6:D30)+1)","v":17},120609401,{"$f":"IF(COUNTIF('مخزن 111'!$D$7:$D$249,$E31)=0,\"\",VLOOKUP($E31,'مخزن 111'!$D$7:$I$249,MATCH(F$6,'مخزن 111'!$D$6:$I$6,0),0))","v":"بودره"},{"$f":"IF(COUNTIF('مخزن 111'!$D$7:$D$249,$E31)=0,\"\",VLOOKUP($E31,'مخزن 111'!$D$7:$I$249,MATCH(G$6,'مخزن 111'!$D$6:$I$6,0),0))","v":"SUGAR               "},{"$f":"IF(COUNTIF('مخزن 111'!$D$7:$D$249,$E31)=0,\"\",VLOOKUP($E31,'مخزن 111'!$D$7:$I$249,MATCH(H$6,'مخزن 111'!$D$6:$I$6,0),0))","v":"سكر"},{"$f":"IF(COUNTIF('مخزن 111'!$D$7:$D$249,$E31)=0,\"\",VLOOKUP($E31,'مخزن 111'!$D$7:$I$249,MATCH(I$6,'مخزن 111'!$D$6:$I$6,0),0))","v":"KGM"},{"$f":"IF(COUNTIF('مخزن 111'!$D$7:$D$249,$E31)=0,\"\",VLOOKUP($E31,'مخزن 111'!$D$7:$I$249,MATCH(J$6,'مخزن 111'!$D$6:$I$6,0),0))","v":360}]
[null,null,null,{"$f":"IF($F32=\"\",\"\",MAX($D$6:D31)+1)","v":18},120713301,{"$f":"IF(COUNTIF('مخزن 111'!$D$7:$D$249,$E32)=0,\"\",VLOOKUP($E32,'مخزن 111'!$D$7:$I$249,MATCH(F$6,'مخزن 111'!$D$6:$I$6,0),0))","v":"ناعمة كجم"},{"$f":"IF(COUNTIF('مخزن 111'!$D$7:$D$249,$E32)=0,\"\",VLOOKUP($E32,'مخزن 111'!$D$7:$I$249,MATCH(G$6,'مخزن 111'!$D$6:$I$6,0),0))","v":"CINNAMON            "},{"$f":"IF(COUNTIF('مخزن 111'!$D$7:$D$249,$E32)=0,\"\",VLOOKUP($E32,'مخزن 111'!$D$7:$I$249,MATCH(H$6,'مخزن 111'!$D$6:$I$6,0),0))","v":"قرفة"},{"$f":"IF(COUNTIF('مخزن 111'!$D$7:$D$249,$E32)=0,\"\",VLOOKUP($E32,'مخزن 111'!$D$7:$I$249,MATCH(I$6,'مخزن 111'!$D$6:$I$6,0),0))","v":"KGM"},{"$f":"IF(COUNTIF('مخزن 111'!$D$7:$D$249,$E32)=0,\"\",VLOOKUP($E32,'مخزن 111'!$D$7:$I$249,MATCH(J$6,'مخزن 111'!$D$6:$I$6,0),0))","v":8}]
[null,null,null,{"$f":"IF($F33=\"\",\"\",MAX($D$6:D32)+1)","v":19},120718312,{"$f":"IF(COUNTIF('مخزن 111'!$D$7:$D$249,$E33)=0,\"\",VLOOKUP($E33,'مخزن 111'!$D$7:$I$249,MATCH(F$6,'مخزن 111'!$D$6:$I$6,0),0))","v":"ملح300جم"},{"$f":"IF(COUNTIF('مخزن 111'!$D$7:$D$249,$E33)=0,\"\",VLOOKUP($E33,'مخزن 111'!$D$7:$I$249,MATCH(G$6,'مخزن 111'!$D$6:$I$6,0),0))","v":"SALT                "},{"$f":"IF(COUNTIF('مخزن 111'!$D$7:$D$249,$E33)=0,\"\",VLOOKUP($E33,'مخزن 111'!$D$7:$I$249,MATCH(H$6,'مخزن 111'!$D$6:$I$6,0),0))","v":"ملح"},{"$f":"IF(COUNTIF('مخزن 111'!$D$7:$D$249,$E33)=0,\"\",VLOOKUP($E33,'مخزن 111'!$D$7:$I$249,MATCH(I$6,'مخزن 111'!$D$6:$I$6,0),0))","v":"PKT"},{"$f":"IF(COUNTIF('مخزن 111'!$D$7:$D$249,$E33)=0,\"\",VLOOKUP($E33,'مخزن 111'!$D$7:$I$249,MATCH(J$6,'مخزن 111'!$D$6:$I$6,0),0))","v":1440}]
[null,null,null,{"$f":"IF($F34=\"\",\"\",MAX($D$6:D33)+1)","v":20},120722301,{"$f":"IF(COUNTIF('مخزن 111'!$D$7:$D$249,$E34)=0,\"\",VLOOKUP($E34,'مخزن 111'!$D$7:$I$249,MATCH(F$6,'مخزن 111'!$D$6:$I$6,0),0))","v":"بالكيلو"},{"$f":"IF(COUNTIF('مخزن 111'!$D$7:$D$249,$E34)=0,\"\",VLOOKUP($E34,'مخزن 111'!$D$7:$I$249,MATCH(G$6,'مخزن 111'!$D$6:$I$6,0),0))","v":"BLACK SEED          "},{"$f":"IF(COUNTIF('مخزن 111'!$D$7:$D$249,$E34)=0,\"\",VLOOKUP($E34,'مخزن 111'!$D$7:$I$249,MATCH(H$6,'مخزن 111'!$D$6:$I$6,0),0))","v":"حبة البركه"},{"$f":"IF(COUNTIF('مخزن 111'!$D$7:$D$249,$E34)=0,\"\",VLOOKUP($E34,'مخزن 111'!$D$7:$I$249,MATCH(I$6,'مخزن 111'!$D$6:$I$6,0),0))","v":"KGM"},{"$f":"IF(COUNTIF('مخزن 111'!$D$7:$D$249,$E34)=0,\"\",VLOOKUP($E34,'مخزن 111'!$D$7:$I$249,MATCH(J$6,'مخزن 111'!$D$6:$I$6,0),0))","v":14.5}]
[null,null,null,{"$f":"IF($F35=\"\",\"\",MAX($D$6:D34)+1)","v":21},120740115,{"$f":"IF(COUNTIF('مخزن 111'!$D$7:$D$249,$E35)=0,\"\",VLOOKUP($E35,'مخزن 111'!$D$7:$I$249,MATCH(F$6,'مخزن 111'!$D$6:$I$6,0),0))","v":"ينسون5.2:1"},{"$f":"IF(COUNTIF('مخزن 111'!$D$7:$D$249,$E35)=0,\"\",VLOOKUP($E35,'مخزن 111'!$D$7:$I$249,MATCH(G$6,'مخزن 111'!$D$6:$I$6,0),0))","v":"SACHETTES           "},{"$f":"IF(COUNTIF('مخزن 111'!$D$7:$D$249,$E35)=0,\"\",VLOOKUP($E35,'مخزن 111'!$D$7:$I$249,MATCH(H$6,'مخزن 111'!$D$6:$I$6,0),0))","v":"عبوات"},{"$f":"IF(COUNTIF('مخزن 111'!$D$7:$D$249,$E35)=0,\"\",VLOOKUP($E35,'مخزن 111'!$D$7:$I$249,MATCH(I$6,'مخزن 111'!$D$6:$I$6,0),0))","v":"TIN"},{"$f":"IF(COUNTIF('مخزن 111'!$D$7:$D$249,$E35)=0,\"\",VLOOKUP($E35,'مخزن 111'!$D$7:$I$249,MATCH(J$6,'مخزن 111'!$D$6:$I$6,0),0))","v":576}]
[null,null,null,{"$f":"IF($F36=\"\",\"\",MAX($D$6:D35)+1)","v":22},120801111,{"$f":"IF(COUNTIF('مخزن 111'!$D$7:$D$249,$E36)=0,\"\",VLOOKUP($E36,'مخزن 111'!$D$7:$I$249,MATCH(F$6,'مخزن 111'!$D$6:$I$6,0),0))","v":"فيتايونانى"},{"$f":"IF(COUNTIF('مخزن 111'!$D$7:$D$249,$E36)=0,\"\",VLOOKUP($E36,'مخزن 111'!$D$7:$I$249,MATCH(G$6,'مخزن 111'!$D$6:$I$6,0),0))","v":"WHITE CHEESE        "},{"$f":"IF(COUNTIF('مخزن 111'!$D$7:$D$249,$E36)=0,\"\",VLOOKUP($E36,'مخزن 111'!$D$7:$I$249,MATCH(H$6,'مخزن 111'!$D$6:$I$6,0),0))","v":"جبنة بيضاء"},{"$f":"IF(COUNTIF('مخزن 111'!$D$7:$D$249,$E36)=0,\"\",VLOOKUP($E36,'مخزن 111'!$D$7:$I$249,MATCH(I$6,'مخزن 111'!$D$6:$I$6,0),0))","v":"KGM"},{"$f":"IF(COUNTIF('مخزن 111'!$D$7:$D$249,$E36)=0,\"\",VLOOKUP($E36,'مخزن 111'!$D$7:$I$249,MATCH(J$6,'مخزن 111'!$D$6:$I$6,0),0))","v":38.35}]
[null,null,null,{"$f":"IF($F37=\"\",\"\",MAX($D$6:D36)+1)","v":""},120801113,{"$f":"IF(COUNTIF('مخزن 111'!$D$7:$D$249,$E37)=0,\"\",VLOOKUP($E37,'مخزن 111'!$D$7:$I$249,MATCH(F$6,'مخزن 111'!$D$6:$I$6,0),0))","v":""},{"$f":"IF(COUNTIF('مخزن 111'!$D$7:$D$249,$E37)=0,\"\",VLOOKUP($E37,'مخزن 111'!$D$7:$I$249,MATCH(G$6,'مخزن 111'!$D$6:$I$6,0),0))","v":""},{"$f":"IF(COUNTIF('مخزن 111'!$D$7:$D$249,$E37)=0,\"\",VLOOKUP($E37,'مخزن 111'!$D$7:$I$249,MATCH(H$6,'مخزن 111'!$D$6:$I$6,0),0))","v":""},{"$f":"IF(COUNTIF('مخزن 111'!$D$7:$D$249,$E37)=0,\"\",VLOOKUP($E37,'مخزن 111'!$D$7:$I$249,MATCH(I$6,'مخزن 111'!$D$6:$I$6,0),0))","v":""},{"$f":"IF(COUNTIF('مخزن 111'!$D$7:$D$249,$E37)=0,\"\",VLOOKUP($E37,'مخزن 111'!$D$7:$I$249,MATCH(J$6,'مخزن 111'!$D$6:$I$6,0),0))","v":""}]
[null,null,null,{"$f":"IF($F38=\"\",\"\",MAX($D$6:D37)+1)","v":""},120804107,{"$f":"IF(COUNTIF('مخزن 111'!$D$7:$D$249,$E38)=0,\"\",VLOOKUP($E38,'مخزن 111'!$D$7:$I$249,MATCH(F$6,'مخزن 111'!$D$6:$I$6,0),0))","v":""},{"$f":"IF(COUNTIF('مخزن 111'!$D$7:$D$249,$E38)=0,\"\",VLOOKUP($E38,'مخزن 111'!$D$7:$I$249,MATCH(G$6,'مخزن 111'!$D$6:$I$6,0),0))","v":""},{"$f":"IF(COUNTIF('مخزن 111'!$D$7:$D$249,$E38)=0,\"\",VLOOKUP($E38,'مخزن 111'!$D$7:$I$249,MATCH(H$6,'مخزن 111'!$D$6:$I$6,0),0))","v":""},{"$f":"IF(COUNTIF('مخزن 111'!$D$7:$D$249,$E38)=0,\"\",VLOOKUP($E38,'مخزن 111'!$D$7:$I$249,MATCH(I$6,'مخزن 111'!$D$6:$I$6,0),0))","v":""},{"$f":"IF(COUNTIF('مخزن 111'!$D$7:$D$249,$E38)=0,\"\",VLOOKUP($E38,'مخزن 111'!$D$7:$I$249,MATCH(J$6,'مخزن 111'!$D$6:$I$6,0),0))","v":""}]
[null,null,null,{"$f":"IF($F39=\"\",\"\",MAX($D$6:D38)+1)","v":23},120805101,{"$f":"IF(COUNTIF('مخزن 111'!$D$7:$D$249,$E39)=0,\"\",VLOOKUP($E39,'مخزن 111'!$D$7:$I$249,MATCH(F$6,'مخزن 111'!$D$6:$I$6,0),0))","v":"ايدام"},{"$f":"IF(COUNTIF('مخزن 111'!$D$7:$D$249,$E39)=0,\"\",VLOOKUP($E39,'مخزن 111'!$D$7:$I$249,MATCH(G$6,'مخزن 111'!$D$6:$I$6,0),0))","v":"CHEESE              "},{"$f":"IF(COUNTIF('مخزن 111'!$D$7:$D$249,$E39)=0,\"\",VLOOKUP($E39,'مخزن 111'!$D$7:$I$249,MATCH(H$6,'مخزن 111'!$D$6:$I$6,0),0))","v":"جبن مطبوخ"},{"$f":"IF(COUNTIF('مخزن 111'!$D$7:$D$249,$E39)=0,\"\",VLOOKUP($E39,'مخزن 111'!$D$7:$I$249,MATCH(I$6,'مخزن 111'!$D$6:$I$6,0),0))","v":"KGM"},{"$f":"IF(COUNTIF('مخزن 111'!$D$7:$D$249,$E39)=0,\"\",VLOOKUP($E39,'مخزن 111'!$D$7:$I$249,MATCH(J$6,'مخزن 111'!$D$6:$I$6,0),0))","v":22.457000000000001}]
[null,null,null,{"$f":"IF($F40=\"\",\"\",MAX($D$6:D39)+1)","v":24},120805103,{"$f":"IF(COUNTIF('مخزن 111'!$D$7:$D$249,$E40)=0,\"\",VLOOKUP($E40,'مخزن 111'!$D$7:$I$249,MATCH(F$6,'مخزن 111'!$D$6:$I$6,0),0))","v":"جودة"},{"$f":"IF(COUNTIF('مخزن 111'!$D$7:$D$249,$E40)=0,\"\",VLOOKUP($E40,'مخزن 111'!$D$7:$I$249,MATCH(G$6,'مخزن 111'!$D$6:$I$6,0),0))","v":"CHEESE              "},{"$f":"IF(COUNTIF('مخزن 111'!$D$7:$D$249,$E40)=0,\"\",VLOOKUP($E40,'مخزن 111'!$D$7:$I$249,MATCH(H$6,'مخزن 111'!$D$6:$I$6,0),0))","v":"جبن مطبوخ"},{"$f":"IF(COUNTIF('مخزن 111'!$D$7:$D$249,$E40)=0,\"\",VLOOKUP($E40,'مخزن 111'!$D$7:$I$249,MATCH(I$6,'مخزن 111'!$D$6:$I$6,0),0))","v":"KGM"},{"$f":"IF(COUNTIF('مخزن 111'!$D$7:$D$249,$E40)=0,\"\",VLOOKUP($E40,'مخزن 111'!$D$7:$I$249,MATCH(J$6,'مخزن 111'!$D$6:$I$6,0),0))","v":1853.01}]
[null,null,null,{"$f":"IF($F41=\"\",\"\",MAX($D$6:D40)+1)","v":25},120805111,{"$f":"IF(COUNTIF('مخزن 111'!$D$7:$D$249,$E41)=0,\"\",VLOOKUP($E41,'مخزن 111'!$D$7:$I$249,MATCH(F$6,'مخزن 111'!$D$6:$I$6,0),0))","v":"ج موتزاريلا"},{"$f":"IF(COUNTIF('مخزن 111'!$D$7:$D$249,$E41)=0,\"\",VLOOKUP($E41,'مخزن 111'!$D$7:$I$249,MATCH(G$6,'مخزن 111'!$D$6:$I$6,0),0))","v":"CHEESE              "},{"$f":"IF(COUNTIF('مخزن 111'!$D$7:$D$249,$E41)=0,\"\",VLOOKUP($E41,'مخزن 111'!$D$7:$I$249,MATCH(H$6,'مخزن 111'!$D$6:$I$6,0),0))","v":"جبن مطبوخ"},{"$f":"IF(COUNTIF('مخزن 111'!$D$7:$D$249,$E41)=0,\"\",VLOOKUP($E41,'مخزن 111'!$D$7:$I$249,MATCH(I$6,'مخزن 111'!$D$6:$I$6,0),0))","v":"KGM"},{"$f":"IF(COUNTIF('مخزن 111'!$D$7:$D$249,$E41)=0,\"\",VLOOKUP($E41,'مخزن 111'!$D$7:$I$249,MATCH(J$6,'مخزن 111'!$D$6:$I$6,0),0))","v":144}]
[null,null,null,{"$f":"IF($F42=\"\",\"\",MAX($D$6:D41)+1)","v":26},120807304,{"$f":"IF(COUNTIF('مخزن 111'!$D$7:$D$249,$E42)=0,\"\",VLOOKUP($E42,'مخزن 111'!$D$7:$I$249,MATCH(F$6,'مخزن 111'!$D$6:$I$6,0),0))","v":"ج/مطبوخةمث"},{"$f":"IF(COUNTIF('مخزن 111'!$D$7:$D$249,$E42)=0,\"\",VLOOKUP($E42,'مخزن 111'!$D$7:$I$249,MATCH(G$6,'مخزن 111'!$D$6:$I$6,0),0))","v":"TRIANGLE CHEESE     "},{"$f":"IF(COUNTIF('مخزن 111'!$D$7:$D$249,$E42)=0,\"\",VLOOKUP($E42,'مخزن 111'!$D$7:$I$249,MATCH(H$6,'مخزن 111'!$D$6:$I$6,0),0))","v":"جبنة مطبوخة"},{"$f":"IF(COUNTIF('مخزن 111'!$D$7:$D$249,$E42)=0,\"\",VLOOKUP($E42,'مخزن 111'!$D$7:$I$249,MATCH(I$6,'مخزن 111'!$D$6:$I$6,0),0))","v":"EA."},{"$f":"IF(COUNTIF('مخزن 111'!$D$7:$D$249,$E42)=0,\"\",VLOOKUP($E42,'مخزن 111'!$D$7:$I$249,MATCH(J$6,'مخزن 111'!$D$6:$I$6,0),0))","v":100800}]
[null,null,null,{"$f":"IF($F43=\"\",\"\",MAX($D$6:D42)+1)","v":27},120903318,{"$f":"IF(COUNTIF('مخزن 111'!$D$7:$D$249,$E43)=0,\"\",VLOOKUP($E43,'مخزن 111'!$D$7:$I$249,MATCH(F$6,'مخزن 111'!$D$6:$I$6,0),0))","v":"لبن0منزوع0"},{"$f":"IF(COUNTIF('مخزن 111'!$D$7:$D$249,$E43)=0,\"\",VLOOKUP($E43,'مخزن 111'!$D$7:$I$249,MATCH(G$6,'مخزن 111'!$D$6:$I$6,0),0))","v":"L/L FRESH MILK      "},{"$f":"IF(COUNTIF('مخزن 111'!$D$7:$D$249,$E43)=0,\"\",VLOOKUP($E43,'مخزن 111'!$D$7:$I$249,MATCH(H$6,'مخزن 111'!$D$6:$I$6,0),0))","v":"لبن طويل العمر"},{"$f":"IF(COUNTIF('مخزن 111'!$D$7:$D$249,$E43)=0,\"\",VLOOKUP($E43,'مخزن 111'!$D$7:$I$249,MATCH(I$6,'مخزن 111'!$D$6:$I$6,0),0))","v":"PKT"},{"$f":"IF(COUNTIF('مخزن 111'!$D$7:$D$249,$E43)=0,\"\",VLOOKUP($E43,'مخزن 111'!$D$7:$I$249,MATCH(J$6,'مخزن 111'!$D$6:$I$6,0),0))","v":276}]
[null,null,null,{"$f":"IF($F44=\"\",\"\",MAX($D$6:D43)+1)","v":28},120903332,{"$f":"IF(COUNTIF('مخزن 111'!$D$7:$D$249,$E44)=0,\"\",VLOOKUP($E44,'مخزن 111'!$D$7:$I$249,MATCH(F$6,'مخزن 111'!$D$6:$I$6,0),0))","v":"كامل الدسم"},{"$f":"IF(COUNTIF('مخزن 111'!$D$7:$D$249,$E44)=0,\"\",VLOOKUP($E44,'مخزن 111'!$D$7:$I$249,MATCH(G$6,'مخزن 111'!$D$6:$I$6,0),0))","v":"L/L FRESH MILK      "},{"$f":"IF(COUNTIF('مخزن 111'!$D$7:$D$249,$E44)=0,\"\",VLOOKUP($E44,'مخزن 111'!$D$7:$I$249,MATCH(H$6,'مخزن 111'!$D$6:$I$6,0),0))","v":"لبن طويل العمر"},{"$f":"IF(COUNTIF('مخزن 111'!$D$7:$D$249,$E44)=0,\"\",VLOOKUP($E44,'مخزن 111'!$D$7:$I$249,MATCH(I$6,'مخزن 111'!$D$6:$I$6,0),0))","v":"LTR"},{"$f":"IF(COUNTIF('مخزن 111'!$D$7:$D$249,$E44)=0,\"\",VLOOKUP($E44,'مخزن 111'!$D$7:$I$249,MATCH(J$6,'مخزن 111'!$D$6:$I$6,0),0))","v":2568}]
[null,null,null,{"$f":"IF($F45=\"\",\"\",MAX($D$6:D44)+1)","v":29},120905304,{"$f":"IF(COUNTIF('مخزن 111'!$D$7:$D$249,$E45)=0,\"\",VLOOKUP($E45,'مخزن 111'!$D$7:$I$249,MATCH(F$6,'مخزن 111'!$D$6:$I$6,0),0))","v":"شانتييه"},{"$f":"IF(COUNTIF('مخزن 111'!$D$7:$D$249,$E45)=0,\"\",VLOOKUP($E45,'مخزن 111'!$D$7:$I$249,MATCH(G$6,'مخزن 111'!$D$6:$I$6,0),0))","v":"CREAM               "},{"$f":"IF(COUNTIF('مخزن 111'!$D$7:$D$249,$E45)=0,\"\",VLOOKUP($E45,'مخزن 111'!$D$7:$I$249,MATCH(H$6,'مخزن 111'!$D$6:$I$6,0),0))","v":"كريمه"},{"$f":"IF(COUNTIF('مخزن 111'!$D$7:$D$249,$E45)=0,\"\",VLOOKUP($E45,'مخزن 111'!$D$7:$I$249,MATCH(I$6,'مخزن 111'!$D$6:$I$6,0),0))","v":"KGM"},{"$f":"IF(COUNTIF('مخزن 111'!$D$7:$D$249,$E45)=0,\"\",VLOOKUP($E45,'مخزن 111'!$D$7:$I$249,MATCH(J$6,'مخزن 111'!$D$6:$I$6,0),0))","v":675}]
[null,null,null,{"$f":"IF($F46=\"\",\"\",MAX($D$6:D45)+1)","v":""},120905366,{"$f":"IF(COUNTIF('مخزن 111'!$D$7:$D$249,$E46)=0,\"\",VLOOKUP($E46,'مخزن 111'!$D$7:$I$249,MATCH(F$6,'مخزن 111'!$D$6:$I$6,0),0))","v":""},{"$f":"IF(COUNTIF('مخزن 111'!$D$7:$D$249,$E46)=0,\"\",VLOOKUP($E46,'مخزن 111'!$D$7:$I$249,MATCH(G$6,'مخزن 111'!$D$6:$I$6,0),0))","v":""},{"$f":"IF(COUNTIF('مخزن 111'!$D$7:$D$249,$E46)=0,\"\",VLOOKUP($E46,'مخزن 111'!$D$7:$I$249,MATCH(H$6,'مخزن 111'!$D$6:$I$6,0),0))","v":""},{"$f":"IF(COUNTIF('مخزن 111'!$D$7:$D$249,$E46)=0,\"\",VLOOKUP($E46,'مخزن 111'!$D$7:$I$249,MATCH(I$6,'مخزن 111'!$D$6:$I$6,0),0))","v":""},{"$f":"IF(COUNTIF('مخزن 111'!$D$7:$D$249,$E46)=0,\"\",VLOOKUP($E46,'مخزن 111'!$D$7:$I$249,MATCH(J$6,'مخزن 111'!$D$6:$I$6,0),0))","v":""}]
[null,null,null,{"$f":"IF($F47=\"\",\"\",MAX($D$6:D46)+1)","v":30},121001308,{"$f":"IF(COUNTIF('مخزن 111'!$D$7:$D$249,$E47)=0,\"\",VLOOKUP($E47,'مخزن 111'!$D$7:$I$249,MATCH(F$6,'مخزن 111'!$D$6:$I$6,0),0))","v":"زبدة 25كجم"},{"$f":"IF(COUNTIF('مخزن 111'!$D$7:$D$249,$E47)=0,\"\",VLOOKUP($E47,'مخزن 111'!$D$7:$I$249,MATCH(G$6,'مخزن 111'!$D$6:$I$6,0),0))","v":"BUTTER              "},{"$f":"IF(COUNTIF('مخزن 111'!$D$7:$D$249,$E47)=0,\"\",VLOOKUP($E47,'مخزن 111'!$D$7:$I$249,MATCH(H$6,'مخزن 111'!$D$6:$I$6,0),0))","v":"مسلى طبيعى"},{"$f":"IF(COUNTIF('مخزن 111'!$D$7:$D$249,$E47)=0,\"\",VLOOKUP($E47,'مخزن 111'!$D$7:$I$249,MATCH(I$6,'مخزن 111'!$D$6:$I$6,0),0))","v":"KGM"},{"$f":"IF(COUNTIF('مخزن 111'!$D$7:$D$249,$E47)=0,\"\",VLOOKUP($E47,'مخزن 111'!$D$7:$I$249,MATCH(J$6,'مخزن 111'!$D$6:$I$6,0),0))","v":6000}]
[null,null,null,{"$f":"IF($F48=\"\",\"\",MAX($D$6:D47)+1)","v":31},121003313,{"$f":"IF(COUNTIF('مخزن 111'!$D$7:$D$249,$E48)=0,\"\",VLOOKUP($E48,'مخزن 111'!$D$7:$I$249,MATCH(F$6,'مخزن 111'!$D$6:$I$6,0),0))","v":"زيت1لترزرة"},{"$f":"IF(COUNTIF('مخزن 111'!$D$7:$D$249,$E48)=0,\"\",VLOOKUP($E48,'مخزن 111'!$D$7:$I$249,MATCH(G$6,'مخزن 111'!$D$6:$I$6,0),0))","v":"CORN OIL            "},{"$f":"IF(COUNTIF('مخزن 111'!$D$7:$D$249,$E48)=0,\"\",VLOOKUP($E48,'مخزن 111'!$D$7:$I$249,MATCH(H$6,'مخزن 111'!$D$6:$I$6,0),0))","v":"زيت ذرة"},{"$f":"IF(COUNTIF('مخزن 111'!$D$7:$D$249,$E48)=0,\"\",VLOOKUP($E48,'مخزن 111'!$D$7:$I$249,MATCH(I$6,'مخزن 111'!$D$6:$I$6,0),0))","v":"TIN"},{"$f":"IF(COUNTIF('مخزن 111'!$D$7:$D$249,$E48)=0,\"\",VLOOKUP($E48,'مخزن 111'!$D$7:$I$249,MATCH(J$6,'مخزن 111'!$D$6:$I$6,0),0))","v":1272}]
[null,null,null,{"$f":"IF($F49=\"\",\"\",MAX($D$6:D48)+1)","v":""},121004314,{"$f":"IF(COUNTIF('مخزن 111'!$D$7:$D$249,$E49)=0,\"\",VLOOKUP($E49,'مخزن 111'!$D$7:$I$249,MATCH(F$6,'مخزن 111'!$D$6:$I$6,0),0))","v":""},{"$f":"IF(COUNTIF('مخزن 111'!$D$7:$D$249,$E49)=0,\"\",VLOOKUP($E49,'مخزن 111'!$D$7:$I$249,MATCH(G$6,'مخزن 111'!$D$6:$I$6,0),0))","v":""},{"$f":"IF(COUNTIF('مخزن 111'!$D$7:$D$249,$E49)=0,\"\",VLOOKUP($E49,'مخزن 111'!$D$7:$I$249,MATCH(H$6,'مخزن 111'!$D$6:$I$6,0),0))","v":""},{"$f":"IF(COUNTIF('مخزن 111'!$D$7:$D$249,$E49)=0,\"\",VLOOKUP($E49,'مخزن 111'!$D$7:$I$249,MATCH(I$6,'مخزن 111'!$D$6:$I$6,0),0))","v":""},{"$f":"IF(COUNTIF('مخزن 111'!$D$7:$D$249,$E49)=0,\"\",VLOOKUP($E49,'مخزن 111'!$D$7:$I$249,MATCH(J$6,'مخزن 111'!$D$6:$I$6,0),0))","v":""}]
[null,null,null,{"$f":"IF($F50=\"\",\"\",MAX($D$6:D49)+1)","v":32},121007107,{"$f":"IF(COUNTIF('مخزن 111'!$D$7:$D$249,$E50)=0,\"\",VLOOKUP($E50,'مخزن 111'!$D$7:$I$249,MATCH(F$6,'مخزن 111'!$D$6:$I$6,0),0))","v":"زيت قلى لت"},{"$f":"IF(COUNTIF('مخزن 111'!$D$7:$D$249,$E50)=0,\"\",VLOOKUP($E50,'مخزن 111'!$D$7:$I$249,MATCH(G$6,'مخزن 111'!$D$6:$I$6,0),0))","v":"PLANT OIL           "},{"$f":"IF(COUNTIF('مخزن 111'!$D$7:$D$249,$E50)=0,\"\",VLOOKUP($E50,'مخزن 111'!$D$7:$I$249,MATCH(H$6,'مخزن 111'!$D$6:$I$6,0),0))","v":"زيت نباتى للتحمير"},{"$f":"IF(COUNTIF('مخزن 111'!$D$7:$D$249,$E50)=0,\"\",VLOOKUP($E50,'مخزن 111'!$D$7:$I$249,MATCH(I$6,'مخزن 111'!$D$6:$I$6,0),0))","v":"LTR"},{"$f":"IF(COUNTIF('مخزن 111'!$D$7:$D$249,$E50)=0,\"\",VLOOKUP($E50,'مخزن 111'!$D$7:$I$249,MATCH(J$6,'مخزن 111'!$D$6:$I$6,0),0))","v":1060}]
[null,null,null,{"$f":"IF($F51=\"\",\"\",MAX($D$6:D50)+1)","v":33},121104310,{"$f":"IF(COUNTIF('مخزن 111'!$D$7:$D$249,$E51)=0,\"\",VLOOKUP($E51,'مخزن 111'!$D$7:$I$249,MATCH(F$6,'مخزن 111'!$D$6:$I$6,0),0))","v":"مرقةدج1100"},{"$f":"IF(COUNTIF('مخزن 111'!$D$7:$D$249,$E51)=0,\"\",VLOOKUP($E51,'مخزن 111'!$D$7:$I$249,MATCH(G$6,'مخزن 111'!$D$6:$I$6,0),0))","v":"SOUP                "},{"$f":"IF(COUNTIF('مخزن 111'!$D$7:$D$249,$E51)=0,\"\",VLOOKUP($E51,'مخزن 111'!$D$7:$I$249,MATCH(H$6,'مخزن 111'!$D$6:$I$6,0),0))","v":"شوربه"},{"$f":"IF(COUNTIF('مخزن 111'!$D$7:$D$249,$E51)=0,\"\",VLOOKUP($E51,'مخزن 111'!$D$7:$I$249,MATCH(I$6,'مخزن 111'!$D$6:$I$6,0),0))","v":"TIN"},{"$f":"IF(COUNTIF('مخزن 111'!$D$7:$D$249,$E51)=0,\"\",VLOOKUP($E51,'مخزن 111'!$D$7:$I$249,MATCH(J$6,'مخزن 111'!$D$6:$I$6,0),0))","v":108}]
[null,null,null,{"$f":"IF($F52=\"\",\"\",MAX($D$6:D51)+1)","v":""},121204331,{"$f":"IF(COUNTIF('مخزن 111'!$D$7:$D$249,$E52)=0,\"\",VLOOKUP($E52,'مخزن 111'!$D$7:$I$249,MATCH(F$6,'مخزن 111'!$D$6:$I$6,0),0))","v":""},{"$f":"IF(COUNTIF('مخزن 111'!$D$7:$D$249,$E52)=0,\"\",VLOOKUP($E52,'مخزن 111'!$D$7:$I$249,MATCH(G$6,'مخزن 111'!$D$6:$I$6,0),0))","v":""},{"$f":"IF(COUNTIF('مخزن 111'!$D$7:$D$249,$E52)=0,\"\",VLOOKUP($E52,'مخزن 111'!$D$7:$I$249,MATCH(H$6,'مخزن 111'!$D$6:$I$6,0),0))","v":""},{"$f":"IF(COUNTIF('مخزن 111'!$D$7:$D$249,$E52)=0,\"\",VLOOKUP($E52,'مخزن 111'!$D$7:$I$249,MATCH(I$6,'مخزن 111'!$D$6:$I$6,0),0))","v":""},{"$f":"IF(COUNTIF('مخزن 111'!$D$7:$D$249,$E52)=0,\"\",VLOOKUP($E52,'مخزن 111'!$D$7:$I$249,MATCH(J$6,'مخزن 111'!$D$6:$I$6,0),0))","v":""}]
[null,null,null,{"$f":"IF($F53=\"\",\"\",MAX($D$6:D52)+1)","v":34},121205102,{"$f":"IF(COUNTIF('مخزن 111'!$D$7:$D$249,$E53)=0,\"\",VLOOKUP($E53,'مخزن 111'!$D$7:$I$249,MATCH(F$6,'مخزن 111'!$D$6:$I$6,0),0))","v":"أبيض كم"},{"$f":"IF(COUNTIF('مخزن 111'!$D$7:$D$249,$E53)=0,\"\",VLOOKUP($E53,'مخزن 111'!$D$7:$I$249,MATCH(G$6,'مخزن 111'!$D$6:$I$6,0),0))","v":"SESAME              "},{"$f":"IF(COUNTIF('مخزن 111'!$D$7:$D$249,$E53)=0,\"\",VLOOKUP($E53,'مخزن 111'!$D$7:$I$249,MATCH(H$6,'مخزن 111'!$D$6:$I$6,0),0))","v":"سمسم"},{"$f":"IF(COUNTIF('مخزن 111'!$D$7:$D$249,$E53)=0,\"\",VLOOKUP($E53,'مخزن 111'!$D$7:$I$249,MATCH(I$6,'مخزن 111'!$D$6:$I$6,0),0))","v":"KGM"},{"$f":"IF(COUNTIF('مخزن 111'!$D$7:$D$249,$E53)=0,\"\",VLOOKUP($E53,'مخزن 111'!$D$7:$I$249,MATCH(J$6,'مخزن 111'!$D$6:$I$6,0),0))","v":40}]
[null,null,null,{"$f":"IF($F54=\"\",\"\",MAX($D$6:D53)+1)","v":""},121206305,{"$f":"IF(COUNTIF('مخزن 111'!$D$7:$D$249,$E54)=0,\"\",VLOOKUP($E54,'مخزن 111'!$D$7:$I$249,MATCH(F$6,'مخزن 111'!$D$6:$I$6,0),0))","v":""},{"$f":"IF(COUNTIF('مخزن 111'!$D$7:$D$249,$E54)=0,\"\",VLOOKUP($E54,'مخزن 111'!$D$7:$I$249,MATCH(G$6,'مخزن 111'!$D$6:$I$6,0),0))","v":""},{"$f":"IF(COUNTIF('مخزن 111'!$D$7:$D$249,$E54)=0,\"\",VLOOKUP($E54,'مخزن 111'!$D$7:$I$249,MATCH(H$6,'مخزن 111'!$D$6:$I$6,0),0))","v":""},{"$f":"IF(COUNTIF('مخزن 111'!$D$7:$D$249,$E54)=0,\"\",VLOOKUP($E54,'مخزن 111'!$D$7:$I$249,MATCH(I$6,'مخزن 111'!$D$6:$I$6,0),0))","v":""},{"$f":"IF(COUNTIF('مخزن 111'!$D$7:$D$249,$E54)=0,\"\",VLOOKUP($E54,'مخزن 111'!$D$7:$I$249,MATCH(J$6,'مخزن 111'!$D$6:$I$6,0),0))","v":""}]
[null,null,null,{"$f":"IF($F55=\"\",\"\",MAX($D$6:D54)+1)","v":""},121206321,{"$f":"IF(COUNTIF('مخزن 111'!$D$7:$D$249,$E55)=0,\"\",VLOOKUP($E55,'مخزن 111'!$D$7:$I$249,MATCH(F$6,'مخزن 111'!$D$6:$I$6,0),0))","v":""},{"$f":"IF(COUNTIF('مخزن 111'!$D$7:$D$249,$E55)=0,\"\",VLOOKUP($E55,'مخزن 111'!$D$7:$I$249,MATCH(G$6,'مخزن 111'!$D$6:$I$6,0),0))","v":""},{"$f":"IF(COUNTIF('مخزن 111'!$D$7:$D$249,$E55)=0,\"\",VLOOKUP($E55,'مخزن 111'!$D$7:$I$249,MATCH(H$6,'مخزن 111'!$D$6:$I$6,0),0))","v":""},{"$f":"IF(COUNTIF('مخزن 111'!$D$7:$D$249,$E55)=0,\"\",VLOOKUP($E55,'مخزن 111'!$D$7:$I$249,MATCH(I$6,'مخزن 111'!$D$6:$I$6,0),0))","v":""},{"$f":"IF(COUNTIF('مخزن 111'!$D$7:$D$249,$E55)=0,\"\",VLOOKUP($E55,'مخزن 111'!$D$7:$I$249,MATCH(J$6,'مخزن 111'!$D$6:$I$6,0),0))","v":""}]
[null,null,null,{"$f":"IF($F56=\"\",\"\",MAX($D$6:D55)+1)","v":35},121207309,{"$f":"IF(COUNTIF('مخزن 111'!$D$7:$D$249,$E56)=0,\"\",VLOOKUP($E56,'مخزن 111'!$D$7:$I$249,MATCH(F$6,'مخزن 111'!$D$6:$I$6,0),0))","v":"حمص مسل400"},{"$f":"IF(COUNTIF('مخزن 111'!$D$7:$D$249,$E56)=0,\"\",VLOOKUP($E56,'مخزن 111'!$D$7:$I$249,MATCH(G$6,'مخزن 111'!$D$6:$I$6,0),0))","v":"HOMMOS              "},{"$f":"IF(COUNTIF('مخزن 111'!$D$7:$D$249,$E56)=0,\"\",VLOOKUP($E56,'مخزن 111'!$D$7:$I$249,MATCH(H$6,'مخزن 111'!$D$6:$I$6,0),0))","v":"حمص"},{"$f":"IF(COUNTIF('مخزن 111'!$D$7:$D$249,$E56)=0,\"\",VLOOKUP($E56,'مخزن 111'!$D$7:$I$249,MATCH(I$6,'مخزن 111'!$D$6:$I$6,0),0))","v":"TIN"},{"$f":"IF(COUNTIF('مخزن 111'!$D$7:$D$249,$E56)=0,\"\",VLOOKUP($E56,'مخزن 111'!$D$7:$I$249,MATCH(J$6,'مخزن 111'!$D$6:$I$6,0),0))","v":480}]
[null,null,null,{"$f":"IF($F57=\"\",\"\",MAX($D$6:D56)+1)","v":36},121301315,{"$f":"IF(COUNTIF('مخزن 111'!$D$7:$D$249,$E57)=0,\"\",VLOOKUP($E57,'مخزن 111'!$D$7:$I$249,MATCH(F$6,'مخزن 111'!$D$6:$I$6,0),0))","v":"ز/م1450م/س"},{"$f":"IF(COUNTIF('مخزن 111'!$D$7:$D$249,$E57)=0,\"\",VLOOKUP($E57,'مخزن 111'!$D$7:$I$249,MATCH(G$6,'مخزن 111'!$D$6:$I$6,0),0))","v":"OLIVES              "},{"$f":"IF(COUNTIF('مخزن 111'!$D$7:$D$249,$E57)=0,\"\",VLOOKUP($E57,'مخزن 111'!$D$7:$I$249,MATCH(H$6,'مخزن 111'!$D$6:$I$6,0),0))","v":"زيتون"},{"$f":"IF(COUNTIF('مخزن 111'!$D$7:$D$249,$E57)=0,\"\",VLOOKUP($E57,'مخزن 111'!$D$7:$I$249,MATCH(I$6,'مخزن 111'!$D$6:$I$6,0),0))","v":"TIN"},{"$f":"IF(COUNTIF('مخزن 111'!$D$7:$D$249,$E57)=0,\"\",VLOOKUP($E57,'مخزن 111'!$D$7:$I$249,MATCH(J$6,'مخزن 111'!$D$6:$I$6,0),0))","v":36}]
[null,null,null,{"$f":"IF($F58=\"\",\"\",MAX($D$6:D57)+1)","v":37},121301316,{"$f":"IF(COUNTIF('مخزن 111'!$D$7:$D$249,$E58)=0,\"\",VLOOKUP($E58,'مخزن 111'!$D$7:$I$249,MATCH(F$6,'مخزن 111'!$D$6:$I$6,0),0))","v":"ز/م/خ1450م"},{"$f":"IF(COUNTIF('مخزن 111'!$D$7:$D$249,$E58)=0,\"\",VLOOKUP($E58,'مخزن 111'!$D$7:$I$249,MATCH(G$6,'مخزن 111'!$D$6:$I$6,0),0))","v":"OLIVES              "},{"$f":"IF(COUNTIF('مخزن 111'!$D$7:$D$249,$E58)=0,\"\",VLOOKUP($E58,'مخزن 111'!$D$7:$I$249,MATCH(H$6,'مخزن 111'!$D$6:$I$6,0),0))","v":"زيتون"},{"$f":"IF(COUNTIF('مخزن 111'!$D$7:$D$249,$E58)=0,\"\",VLOOKUP($E58,'مخزن 111'!$D$7:$I$249,MATCH(I$6,'مخزن 111'!$D$6:$I$6,0),0))","v":"TIN"},{"$f":"IF(COUNTIF('مخزن 111'!$D$7:$D$249,$E58)=0,\"\",VLOOKUP($E58,'مخزن 111'!$D$7:$I$249,MATCH(J$6,'مخزن 111'!$D$6:$I$6,0),0))","v":167}]
[null,null,null,{"$f":"IF($F59=\"\",\"\",MAX($D$6:D58)+1)","v":38},121304511,{"$f":"IF(COUNTIF('مخزن 111'!$D$7:$D$249,$E59)=0,\"\",VLOOKUP($E59,'مخزن 111'!$D$7:$I$249,MATCH(F$6,'مخزن 111'!$D$6:$I$6,0),0))","v":"كتشب ظرف7ج"},{"$f":"IF(COUNTIF('مخزن 111'!$D$7:$D$249,$E59)=0,\"\",VLOOKUP($E59,'مخزن 111'!$D$7:$I$249,MATCH(G$6,'مخزن 111'!$D$6:$I$6,0),0))","v":"KETCHUP             "},{"$f":"IF(COUNTIF('مخزن 111'!$D$7:$D$249,$E59)=0,\"\",VLOOKUP($E59,'مخزن 111'!$D$7:$I$249,MATCH(H$6,'مخزن 111'!$D$6:$I$6,0),0))","v":"كاتشب"},{"$f":"IF(COUNTIF('مخزن 111'!$D$7:$D$249,$E59)=0,\"\",VLOOKUP($E59,'مخزن 111'!$D$7:$I$249,MATCH(I$6,'مخزن 111'!$D$6:$I$6,0),0))","v":"PKT"},{"$f":"IF(COUNTIF('مخزن 111'!$D$7:$D$249,$E59)=0,\"\",VLOOKUP($E59,'مخزن 111'!$D$7:$I$249,MATCH(J$6,'مخزن 111'!$D$6:$I$6,0),0))","v":8000}]
[null,null,null,{"$f":"IF($F60=\"\",\"\",MAX($D$6:D59)+1)","v":39},121306323,{"$f":"IF(COUNTIF('مخزن 111'!$D$7:$D$249,$E60)=0,\"\",VLOOKUP($E60,'مخزن 111'!$D$7:$I$249,MATCH(F$6,'مخزن 111'!$D$6:$I$6,0),0))","v":"م /السحرى"},{"$f":"IF(COUNTIF('مخزن 111'!$D$7:$D$249,$E60)=0,\"\",VLOOKUP($E60,'مخزن 111'!$D$7:$I$249,MATCH(G$6,'مخزن 111'!$D$6:$I$6,0),0))","v":"MUSTARD             "},{"$f":"IF(COUNTIF('مخزن 111'!$D$7:$D$249,$E60)=0,\"\",VLOOKUP($E60,'مخزن 111'!$D$7:$I$249,MATCH(H$6,'مخزن 111'!$D$6:$I$6,0),0))","v":"مستردةومايونيز"},{"$f":"IF(COUNTIF('مخزن 111'!$D$7:$D$249,$E60)=0,\"\",VLOOKUP($E60,'مخزن 111'!$D$7:$I$249,MATCH(I$6,'مخزن 111'!$D$6:$I$6,0),0))","v":"JRK"},{"$f":"IF(COUNTIF('مخزن 111'!$D$7:$D$249,$E60)=0,\"\",VLOOKUP($E60,'مخزن 111'!$D$7:$I$249,MATCH(J$6,'مخزن 111'!$D$6:$I$6,0),0))","v":49}]
[null,null,null,{"$f":"IF($F61=\"\",\"\",MAX($D$6:D60)+1)","v":""},121306337,{"$f":"IF(COUNTIF('مخزن 111'!$D$7:$D$249,$E61)=0,\"\",VLOOKUP($E61,'مخزن 111'!$D$7:$I$249,MATCH(F$6,'مخزن 111'!$D$6:$I$6,0),0))","v":""},{"$f":"IF(COUNTIF('مخزن 111'!$D$7:$D$249,$E61)=0,\"\",VLOOKUP($E61,'مخزن 111'!$D$7:$I$249,MATCH(G$6,'مخزن 111'!$D$6:$I$6,0),0))","v":""},{"$f":"IF(COUNTIF('مخزن 111'!$D$7:$D$249,$E61)=0,\"\",VLOOKUP($E61,'مخزن 111'!$D$7:$I$249,MATCH(H$6,'مخزن 111'!$D$6:$I$6,0),0))","v":""},{"$f":"IF(COUNTIF('مخزن 111'!$D$7:$D$249,$E61)=0,\"\",VLOOKUP($E61,'مخزن 111'!$D$7:$I$249,MATCH(I$6,'مخزن 111'!$D$6:$I$6,0),0))","v":""},{"$f":"IF(COUNTIF('مخزن 111'!$D$7:$D$249,$E61)=0,\"\",VLOOKUP($E61,'مخزن 111'!$D$7:$I$249,MATCH(J$6,'مخزن 111'!$D$6:$I$6,0),0))","v":""}]
[null,null,null,{"$f":"IF($F62=\"\",\"\",MAX($D$6:D61)+1)","v":40},121401419,{"$f":"IF(COUNTIF('مخزن 111'!$D$7:$D$249,$E62)=0,\"\",VLOOKUP($E62,'مخزن 111'!$D$7:$I$249,MATCH(F$6,'مخزن 111'!$D$6:$I$6,0),0))","v":"50جم6قطع"},{"$f":"IF(COUNTIF('مخزن 111'!$D$7:$D$249,$E62)=0,\"\",VLOOKUP($E62,'مخزن 111'!$D$7:$I$249,MATCH(G$6,'مخزن 111'!$D$6:$I$6,0),0))","v":"VARIED BISCUIT      "},{"$f":"IF(COUNTIF('مخزن 111'!$D$7:$D$249,$E62)=0,\"\",VLOOKUP($E62,'مخزن 111'!$D$7:$I$249,MATCH(H$6,'مخزن 111'!$D$6:$I$6,0),0))","v":"بسكويت انواع"},{"$f":"IF(COUNTIF('مخزن 111'!$D$7:$D$249,$E62)=0,\"\",VLOOKUP($E62,'مخزن 111'!$D$7:$I$249,MATCH(I$6,'مخزن 111'!$D$6:$I$6,0),0))","v":"PKT"},{"$f":"IF(COUNTIF('مخزن 111'!$D$7:$D$249,$E62)=0,\"\",VLOOKUP($E62,'مخزن 111'!$D$7:$I$249,MATCH(J$6,'مخزن 111'!$D$6:$I$6,0),0))","v":30500}]
[null,null,null,{"$f":"IF($F63=\"\",\"\",MAX($D$6:D62)+1)","v":""},121401462,{"$f":"IF(COUNTIF('مخزن 111'!$D$7:$D$249,$E63)=0,\"\",VLOOKUP($E63,'مخزن 111'!$D$7:$I$249,MATCH(F$6,'مخزن 111'!$D$6:$I$6,0),0))","v":""},{"$f":"IF(COUNTIF('مخزن 111'!$D$7:$D$249,$E63)=0,\"\",VLOOKUP($E63,'مخزن 111'!$D$7:$I$249,MATCH(G$6,'مخزن 111'!$D$6:$I$6,0),0))","v":""},{"$f":"IF(COUNTIF('مخزن 111'!$D$7:$D$249,$E63)=0,\"\",VLOOKUP($E63,'مخزن 111'!$D$7:$I$249,MATCH(H$6,'مخزن 111'!$D$6:$I$6,0),0))","v":""},{"$f":"IF(COUNTIF('مخزن 111'!$D$7:$D$249,$E63)=0,\"\",VLOOKUP($E63,'مخزن 111'!$D$7:$I$249,MATCH(I$6,'مخزن 111'!$D$6:$I$6,0),0))","v":""},{"$f":"IF(COUNTIF('مخزن 111'!$D$7:$D$249,$E63)=0,\"\",VLOOKUP($E63,'مخزن 111'!$D$7:$I$249,MATCH(J$6,'مخزن 111'!$D$6:$I$6,0),0))","v":""}]
[null,null,null,{"$f":"IF($F64=\"\",\"\",MAX($D$6:D63)+1)","v":""},121401657,{"$f":"IF(COUNTIF('مخزن 111'!$D$7:$D$249,$E64)=0,\"\",VLOOKUP($E64,'مخزن 111'!$D$7:$I$249,MATCH(F$6,'مخزن 111'!$D$6:$I$6,0),0))","v":""},{"$f":"IF(COUNTIF('مخزن 111'!$D$7:$D$249,$E64)=0,\"\",VLOOKUP($E64,'مخزن 111'!$D$7:$I$249,MATCH(G$6,'مخزن 111'!$D$6:$I$6,0),0))","v":""},{"$f":"IF(COUNTIF('مخزن 111'!$D$7:$D$249,$E64)=0,\"\",VLOOKUP($E64,'مخزن 111'!$D$7:$I$249,MATCH(H$6,'مخزن 111'!$D$6:$I$6,0),0))","v":""},{"$f":"IF(COUNTIF('مخزن 111'!$D$7:$D$249,$E64)=0,\"\",VLOOKUP($E64,'مخزن 111'!$D$7:$I$249,MATCH(I$6,'مخزن 111'!$D$6:$I$6,0),0))","v":""},{"$f":"IF(COUNTIF('مخزن 111'!$D$7:$D$249,$E64)=0,\"\",VLOOKUP($E64,'مخزن 111'!$D$7:$I$249,MATCH(J$6,'مخزن 111'!$D$6:$I$6,0),0))","v":""}]
[null,null,null,{"$f":"IF($F65=\"\",\"\",MAX($D$6:D64)+1)","v":""},121401681,{"$f":"IF(COUNTIF('مخزن 111'!$D$7:$D$249,$E65)=0,\"\",VLOOKUP($E65,'مخزن 111'!$D$7:$I$249,MATCH(F$6,'مخزن 111'!$D$6:$I$6,0),0))","v":""},{"$f":"IF(COUNTIF('مخزن 111'!$D$7:$D$249,$E65)=0,\"\",VLOOKUP($E65,'مخزن 111'!$D$7:$I$249,MATCH(G$6,'مخزن 111'!$D$6:$I$6,0),0))","v":""},{"$f":"IF(COUNTIF('مخزن 111'!$D$7:$D$249,$E65)=0,\"\",VLOOKUP($E65,'مخزن 111'!$D$7:$I$249,MATCH(H$6,'مخزن 111'!$D$6:$I$6,0),0))","v":""},{"$f":"IF(COUNTIF('مخزن 111'!$D$7:$D$249,$E65)=0,\"\",VLOOKUP($E65,'مخزن 111'!$D$7:$I$249,MATCH(I$6,'مخزن 111'!$D$6:$I$6,0),0))","v":""},{"$f":"IF(COUNTIF('مخزن 111'!$D$7:$D$249,$E65)=0,\"\",VLOOKUP($E65,'مخزن 111'!$D$7:$I$249,MATCH(J$6,'مخزن 111'!$D$6:$I$6,0),0))","v":""}]
[null,null,null,{"$f":"IF($F66=\"\",\"\",MAX($D$6:D65)+1)","v":41},121402330,{"$f":"IF(COUNTIF('مخزن 111'!$D$7:$D$249,$E66)=0,\"\",VLOOKUP($E66,'مخزن 111'!$D$7:$I$249,MATCH(F$6,'مخزن 111'!$D$6:$I$6,0),0))","v":"كفرتور2500"},{"$f":"IF(COUNTIF('مخزن 111'!$D$7:$D$249,$E66)=0,\"\",VLOOKUP($E66,'مخزن 111'!$D$7:$I$249,MATCH(G$6,'مخزن 111'!$D$6:$I$6,0),0))","v":"CHOCOLATE           "},{"$f":"IF(COUNTIF('مخزن 111'!$D$7:$D$249,$E66)=0,\"\",VLOOKUP($E66,'مخزن 111'!$D$7:$I$249,MATCH(H$6,'مخزن 111'!$D$6:$I$6,0),0))","v":"شيكولاتة"},{"$f":"IF(COUNTIF('مخزن 111'!$D$7:$D$249,$E66)=0,\"\",VLOOKUP($E66,'مخزن 111'!$D$7:$I$249,MATCH(I$6,'مخزن 111'!$D$6:$I$6,0),0))","v":"PKT"},{"$f":"IF(COUNTIF('مخزن 111'!$D$7:$D$249,$E66)=0,\"\",VLOOKUP($E66,'مخزن 111'!$D$7:$I$249,MATCH(J$6,'مخزن 111'!$D$6:$I$6,0),0))","v":48}]
[null,null,null,{"$f":"IF($F67=\"\",\"\",MAX($D$6:D66)+1)","v":42},121402341,{"$f":"IF(COUNTIF('مخزن 111'!$D$7:$D$249,$E67)=0,\"\",VLOOKUP($E67,'مخزن 111'!$D$7:$I$249,MATCH(F$6,'مخزن 111'!$D$6:$I$6,0),0))","v":"ش/كفر2500ج"},{"$f":"IF(COUNTIF('مخزن 111'!$D$7:$D$249,$E67)=0,\"\",VLOOKUP($E67,'مخزن 111'!$D$7:$I$249,MATCH(G$6,'مخزن 111'!$D$6:$I$6,0),0))","v":"CHOCOLATE           "},{"$f":"IF(COUNTIF('مخزن 111'!$D$7:$D$249,$E67)=0,\"\",VLOOKUP($E67,'مخزن 111'!$D$7:$I$249,MATCH(H$6,'مخزن 111'!$D$6:$I$6,0),0))","v":"شيكولاتة"},{"$f":"IF(COUNTIF('مخزن 111'!$D$7:$D$249,$E67)=0,\"\",VLOOKUP($E67,'مخزن 111'!$D$7:$I$249,MATCH(I$6,'مخزن 111'!$D$6:$I$6,0),0))","v":"PKT"},{"$f":"IF(COUNTIF('مخزن 111'!$D$7:$D$249,$E67)=0,\"\",VLOOKUP($E67,'مخزن 111'!$D$7:$I$249,MATCH(J$6,'مخزن 111'!$D$6:$I$6,0),0))","v":24}]
[null,null,null,{"$f":"IF($F68=\"\",\"\",MAX($D$6:D67)+1)","v":43},121501324,{"$f":"IF(COUNTIF('مخزن 111'!$D$7:$D$249,$E68)=0,\"\",VLOOKUP($E68,'مخزن 111'!$D$7:$I$249,MATCH(F$6,'مخزن 111'!$D$6:$I$6,0),0))","v":"مشمش  ك"},{"$f":"IF(COUNTIF('مخزن 111'!$D$7:$D$249,$E68)=0,\"\",VLOOKUP($E68,'مخزن 111'!$D$7:$I$249,MATCH(G$6,'مخزن 111'!$D$6:$I$6,0),0))","v":"JAM                 "},{"$f":"IF(COUNTIF('مخزن 111'!$D$7:$D$249,$E68)=0,\"\",VLOOKUP($E68,'مخزن 111'!$D$7:$I$249,MATCH(H$6,'مخزن 111'!$D$6:$I$6,0),0))","v":"مربى"},{"$f":"IF(COUNTIF('مخزن 111'!$D$7:$D$249,$E68)=0,\"\",VLOOKUP($E68,'مخزن 111'!$D$7:$I$249,MATCH(I$6,'مخزن 111'!$D$6:$I$6,0),0))","v":"KGM"},{"$f":"IF(COUNTIF('مخزن 111'!$D$7:$D$249,$E68)=0,\"\",VLOOKUP($E68,'مخزن 111'!$D$7:$I$249,MATCH(J$6,'مخزن 111'!$D$6:$I$6,0),0))","v":270}]
[null,null,null,{"$f":"IF($F69=\"\",\"\",MAX($D$6:D68)+1)","v":""},121601304,{"$f":"IF(COUNTIF('مخزن 111'!$D$7:$D$249,$E69)=0,\"\",VLOOKUP($E69,'مخزن 111'!$D$7:$I$249,MATCH(F$6,'مخزن 111'!$D$6:$I$6,0),0))","v":""},{"$f":"IF(COUNTIF('مخزن 111'!$D$7:$D$249,$E69)=0,\"\",VLOOKUP($E69,'مخزن 111'!$D$7:$I$249,MATCH(G$6,'مخزن 111'!$D$6:$I$6,0),0))","v":""},{"$f":"IF(COUNTIF('مخزن 111'!$D$7:$D$249,$E69)=0,\"\",VLOOKUP($E69,'مخزن 111'!$D$7:$I$249,MATCH(H$6,'مخزن 111'!$D$6:$I$6,0),0))","v":""},{"$f":"IF(COUNTIF('مخزن 111'!$D$7:$D$249,$E69)=0,\"\",VLOOKUP($E69,'مخزن 111'!$D$7:$I$249,MATCH(I$6,'مخزن 111'!$D$6:$I$6,0),0))","v":""},{"$f":"IF(COUNTIF('مخزن 111'!$D$7:$D$249,$E69)=0,\"\",VLOOKUP($E69,'مخزن 111'!$D$7:$I$249,MATCH(J$6,'مخزن 111'!$D$6:$I$6,0),0))","v":""}]
[null,null,null,{"$f":"IF($F70=\"\",\"\",MAX($D$6:D69)+1)","v":44},121706310,{"$f":"IF(COUNTIF('مخزن 111'!$D$7:$D$249,$E70)=0,\"\",VLOOKUP($E70,'مخزن 111'!$D$7:$I$249,MATCH(F$6,'مخزن 111'!$D$6:$I$6,0),0))","v":"خل1لترأبيض"},{"$f":"IF(COUNTIF('مخزن 111'!$D$7:$D$249,$E70)=0,\"\",VLOOKUP($E70,'مخزن 111'!$D$7:$I$249,MATCH(G$6,'مخزن 111'!$D$6:$I$6,0),0))","v":"VENIGAR             "},{"$f":"IF(COUNTIF('مخزن 111'!$D$7:$D$249,$E70)=0,\"\",VLOOKUP($E70,'مخزن 111'!$D$7:$I$249,MATCH(H$6,'مخزن 111'!$D$6:$I$6,0),0))","v":"خل"},{"$f":"IF(COUNTIF('مخزن 111'!$D$7:$D$249,$E70)=0,\"\",VLOOKUP($E70,'مخزن 111'!$D$7:$I$249,MATCH(I$6,'مخزن 111'!$D$6:$I$6,0),0))","v":"BOT"},{"$f":"IF(COUNTIF('مخزن 111'!$D$7:$D$249,$E70)=0,\"\",VLOOKUP($E70,'مخزن 111'!$D$7:$I$249,MATCH(J$6,'مخزن 111'!$D$6:$I$6,0),0))","v":132}]
[null,null,null,{"$f":"IF($F71=\"\",\"\",MAX($D$6:D70)+1)","v":45},121707334,{"$f":"IF(COUNTIF('مخزن 111'!$D$7:$D$249,$E71)=0,\"\",VLOOKUP($E71,'مخزن 111'!$D$7:$I$249,MATCH(F$6,'مخزن 111'!$D$6:$I$6,0),0))","v":"جيل ع بارد"},{"$f":"IF(COUNTIF('مخزن 111'!$D$7:$D$249,$E71)=0,\"\",VLOOKUP($E71,'مخزن 111'!$D$7:$I$249,MATCH(G$6,'مخزن 111'!$D$6:$I$6,0),0))","v":"GILATTIN            "},{"$f":"IF(COUNTIF('مخزن 111'!$D$7:$D$249,$E71)=0,\"\",VLOOKUP($E71,'مخزن 111'!$D$7:$I$249,MATCH(H$6,'مخزن 111'!$D$6:$I$6,0),0))","v":"جيلاتينا"},{"$f":"IF(COUNTIF('مخزن 111'!$D$7:$D$249,$E71)=0,\"\",VLOOKUP($E71,'مخزن 111'!$D$7:$I$249,MATCH(I$6,'مخزن 111'!$D$6:$I$6,0),0))","v":"KGM"},{"$f":"IF(COUNTIF('مخزن 111'!$D$7:$D$249,$E71)=0,\"\",VLOOKUP($E71,'مخزن 111'!$D$7:$I$249,MATCH(J$6,'مخزن 111'!$D$6:$I$6,0),0))","v":243}]
[null,null,null,{"$f":"IF($F72=\"\",\"\",MAX($D$6:D71)+1)","v":""},121707335,{"$f":"IF(COUNTIF('مخزن 111'!$D$7:$D$249,$E72)=0,\"\",VLOOKUP($E72,'مخزن 111'!$D$7:$I$249,MATCH(F$6,'مخزن 111'!$D$6:$I$6,0),0))","v":""},{"$f":"IF(COUNTIF('مخزن 111'!$D$7:$D$249,$E72)=0,\"\",VLOOKUP($E72,'مخزن 111'!$D$7:$I$249,MATCH(G$6,'مخزن 111'!$D$6:$I$6,0),0))","v":""},{"$f":"IF(COUNTIF('مخزن 111'!$D$7:$D$249,$E72)=0,\"\",VLOOKUP($E72,'مخزن 111'!$D$7:$I$249,MATCH(H$6,'مخزن 111'!$D$6:$I$6,0),0))","v":""},{"$f":"IF(COUNTIF('مخزن 111'!$D$7:$D$249,$E72)=0,\"\",VLOOKUP($E72,'مخزن 111'!$D$7:$I$249,MATCH(I$6,'مخزن 111'!$D$6:$I$6,0),0))","v":""},{"$f":"IF(COUNTIF('مخزن 111'!$D$7:$D$249,$E72)=0,\"\",VLOOKUP($E72,'مخزن 111'!$D$7:$I$249,MATCH(J$6,'مخزن 111'!$D$6:$I$6,0),0))","v":""}]
[null,null,null,{"$f":"IF($F73=\"\",\"\",MAX($D$6:D72)+1)","v":46},121711307,{"$f":"IF(COUNTIF('مخزن 111'!$D$7:$D$249,$E73)=0,\"\",VLOOKUP($E73,'مخزن 111'!$D$7:$I$249,MATCH(F$6,'مخزن 111'!$D$6:$I$6,0),0))","v":"مسحوق خبيز"},{"$f":"IF(COUNTIF('مخزن 111'!$D$7:$D$249,$E73)=0,\"\",VLOOKUP($E73,'مخزن 111'!$D$7:$I$249,MATCH(G$6,'مخزن 111'!$D$6:$I$6,0),0))","v":"YEAST/BAKING POWDER "},{"$f":"IF(COUNTIF('مخزن 111'!$D$7:$D$249,$E73)=0,\"\",VLOOKUP($E73,'مخزن 111'!$D$7:$I$249,MATCH(H$6,'مخزن 111'!$D$6:$I$6,0),0))","v":"مسحوق خبيز;خميرة/بيكينجبودر"},{"$f":"IF(COUNTIF('مخزن 111'!$D$7:$D$249,$E73)=0,\"\",VLOOKUP($E73,'مخزن 111'!$D$7:$I$249,MATCH(I$6,'مخزن 111'!$D$6:$I$6,0),0))","v":"KGM"},{"$f":"IF(COUNTIF('مخزن 111'!$D$7:$D$249,$E73)=0,\"\",VLOOKUP($E73,'مخزن 111'!$D$7:$I$249,MATCH(J$6,'مخزن 111'!$D$6:$I$6,0),0))","v":100}]
[null,null,null,{"$f":"IF($F74=\"\",\"\",MAX($D$6:D73)+1)","v":47},121711311,{"$f":"IF(COUNTIF('مخزن 111'!$D$7:$D$249,$E74)=0,\"\",VLOOKUP($E74,'مخزن 111'!$D$7:$I$249,MATCH(F$6,'مخزن 111'!$D$6:$I$6,0),0))","v":"خ.محلى450ج"},{"$f":"IF(COUNTIF('مخزن 111'!$D$7:$D$249,$E74)=0,\"\",VLOOKUP($E74,'مخزن 111'!$D$7:$I$249,MATCH(G$6,'مخزن 111'!$D$6:$I$6,0),0))","v":"YEAST/BAKING POWDER "},{"$f":"IF(COUNTIF('مخزن 111'!$D$7:$D$249,$E74)=0,\"\",VLOOKUP($E74,'مخزن 111'!$D$7:$I$249,MATCH(H$6,'مخزن 111'!$D$6:$I$6,0),0))","v":"خ.محلى450ج;خميرة/بيكينجبودر"},{"$f":"IF(COUNTIF('مخزن 111'!$D$7:$D$249,$E74)=0,\"\",VLOOKUP($E74,'مخزن 111'!$D$7:$I$249,MATCH(I$6,'مخزن 111'!$D$6:$I$6,0),0))","v":"PKT"},{"$f":"IF(COUNTIF('مخزن 111'!$D$7:$D$249,$E74)=0,\"\",VLOOKUP($E74,'مخزن 111'!$D$7:$I$249,MATCH(J$6,'مخزن 111'!$D$6:$I$6,0),0))","v":300}]
[null,null,null,{"$f":"IF($F75=\"\",\"\",MAX($D$6:D74)+1)","v":48},121712104,{"$f":"IF(COUNTIF('مخزن 111'!$D$7:$D$249,$E75)=0,\"\",VLOOKUP($E75,'مخزن 111'!$D$7:$I$249,MATCH(F$6,'مخزن 111'!$D$6:$I$6,0),0))","v":"كيك اسفنجى"},{"$f":"IF(COUNTIF('مخزن 111'!$D$7:$D$249,$E75)=0,\"\",VLOOKUP($E75,'مخزن 111'!$D$7:$I$249,MATCH(G$6,'مخزن 111'!$D$6:$I$6,0),0))","v":"ADDITIVES           "},{"$f":"IF(COUNTIF('مخزن 111'!$D$7:$D$249,$E75)=0,\"\",VLOOKUP($E75,'مخزن 111'!$D$7:$I$249,MATCH(H$6,'مخزن 111'!$D$6:$I$6,0),0))","v":"كيك اسفنجى;محسنات خبزوكيك"},{"$f":"IF(COUNTIF('مخزن 111'!$D$7:$D$249,$E75)=0,\"\",VLOOKUP($E75,'مخزن 111'!$D$7:$I$249,MATCH(I$6,'مخزن 111'!$D$6:$I$6,0),0))","v":"KGM"},{"$f":"IF(COUNTIF('مخزن 111'!$D$7:$D$249,$E75)=0,\"\",VLOOKUP($E75,'مخزن 111'!$D$7:$I$249,MATCH(J$6,'مخزن 111'!$D$6:$I$6,0),0))","v":2060}]
[null,null,null,{"$f":"IF($F76=\"\",\"\",MAX($D$6:D75)+1)","v":""},121712107,{"$f":"IF(COUNTIF('مخزن 111'!$D$7:$D$249,$E76)=0,\"\",VLOOKUP($E76,'مخزن 111'!$D$7:$I$249,MATCH(F$6,'مخزن 111'!$D$6:$I$6,0),0))","v":""},{"$f":"IF(COUNTIF('مخزن 111'!$D$7:$D$249,$E76)=0,\"\",VLOOKUP($E76,'مخزن 111'!$D$7:$I$249,MATCH(G$6,'مخزن 111'!$D$6:$I$6,0),0))","v":""},{"$f":"IF(COUNTIF('مخزن 111'!$D$7:$D$249,$E76)=0,\"\",VLOOKUP($E76,'مخزن 111'!$D$7:$I$249,MATCH(H$6,'مخزن 111'!$D$6:$I$6,0),0))","v":""},{"$f":"IF(COUNTIF('مخزن 111'!$D$7:$D$249,$E76)=0,\"\",VLOOKUP($E76,'مخزن 111'!$D$7:$I$249,MATCH(I$6,'مخزن 111'!$D$6:$I$6,0),0))","v":""},{"$f":"IF(COUNTIF('مخزن 111'!$D$7:$D$249,$E76)=0,\"\",VLOOKUP($E76,'مخزن 111'!$D$7:$I$249,MATCH(J$6,'مخزن 111'!$D$6:$I$6,0),0))","v":""}]
[null,null,null,{"$f":"IF($F77=\"\",\"\",MAX($D$6:D76)+1)","v":""},320102326,{"$f":"IF(COUNTIF('مخزن 111'!$D$7:$D$249,$E77)=0,\"\",VLOOKUP($E77,'مخزن 111'!$D$7:$I$249,MATCH(F$6,'مخزن 111'!$D$6:$I$6,0),0))","v":""},{"$f":"IF(COUNTIF('مخزن 111'!$D$7:$D$249,$E77)=0,\"\",VLOOKUP($E77,'مخزن 111'!$D$7:$I$249,MATCH(G$6,'مخزن 111'!$D$6:$I$6,0),0))","v":""},{"$f":"IF(COUNTIF('مخزن 111'!$D$7:$D$249,$E77)=0,\"\",VLOOKUP($E77,'مخزن 111'!$D$7:$I$249,MATCH(H$6,'مخزن 111'!$D$6:$I$6,0),0))","v":""},{"$f":"IF(COUNTIF('مخزن 111'!$D$7:$D$249,$E77)=0,\"\",VLOOKUP($E77,'مخزن 111'!$D$7:$I$249,MATCH(I$6,'مخزن 111'!$D$6:$I$6,0),0))","v":""},{"$f":"IF(COUNTIF('مخزن 111'!$D$7:$D$249,$E77)=0,\"\",VLOOKUP($E77,'مخزن 111'!$D$7:$I$249,MATCH(J$6,'مخزن 111'!$D$6:$I$6,0),0))","v":""}]
[null,null,null,{"$f":"IF($F78=\"\",\"\",MAX($D$6:D77)+1)","v":""},320102328,{"$f":"IF(COUNTIF('مخزن 111'!$D$7:$D$249,$E78)=0,\"\",VLOOKUP($E78,'مخزن 111'!$D$7:$I$249,MATCH(F$6,'مخزن 111'!$D$6:$I$6,0),0))","v":""},{"$f":"IF(COUNTIF('مخزن 111'!$D$7:$D$249,$E78)=0,\"\",VLOOKUP($E78,'مخزن 111'!$D$7:$I$249,MATCH(G$6,'مخزن 111'!$D$6:$I$6,0),0))","v":""},{"$f":"IF(COUNTIF('مخزن 111'!$D$7:$D$249,$E78)=0,\"\",VLOOKUP($E78,'مخزن 111'!$D$7:$I$249,MATCH(H$6,'مخزن 111'!$D$6:$I$6,0),0))","v":""},{"$f":"IF(COUNTIF('مخزن 111'!$D$7:$D$249,$E78)=0,\"\",VLOOKUP($E78,'مخزن 111'!$D$7:$I$249,MATCH(I$6,'مخزن 111'!$D$6:$I$6,0),0))","v":""},{"$f":"IF(COUNTIF('مخزن 111'!$D$7:$D$249,$E78)=0,\"\",VLOOKUP($E78,'مخزن 111'!$D$7:$I$249,MATCH(J$6,'مخزن 111'!$D$6:$I$6,0),0))","v":""}]
[null,null,null,{"$f":"IF($F79=\"\",\"\",MAX($D$6:D78)+1)","v":""},320102333,{"$f":"IF(COUNTIF('مخزن 111'!$D$7:$D$249,$E79)=0,\"\",VLOOKUP($E79,'مخزن 111'!$D$7:$I$249,MATCH(F$6,'مخزن 111'!$D$6:$I$6,0),0))","v":""},{"$f":"IF(COUNTIF('مخزن 111'!$D$7:$D$249,$E79)=0,\"\",VLOOKUP($E79,'مخزن 111'!$D$7:$I$249,MATCH(G$6,'مخزن 111'!$D$6:$I$6,0),0))","v":""},{"$f":"IF(COUNTIF('مخزن 111'!$D$7:$D$249,$E79)=0,\"\",VLOOKUP($E79,'مخزن 111'!$D$7:$I$249,MATCH(H$6,'مخزن 111'!$D$6:$I$6,0),0))","v":""},{"$f":"IF(COUNTIF('مخزن 111'!$D$7:$D$249,$E79)=0,\"\",VLOOKUP($E79,'مخزن 111'!$D$7:$I$249,MATCH(I$6,'مخزن 111'!$D$6:$I$6,0),0))","v":""},{"$f":"IF(COUNTIF('مخزن 111'!$D$7:$D$249,$E79)=0,\"\",VLOOKUP($E79,'مخزن 111'!$D$7:$I$249,MATCH(J$6,'مخزن 111'!$D$6:$I$6,0),0))","v":""}]
[null,null,null,{"$f":"IF($F80=\"\",\"\",MAX($D$6:D79)+1)","v":49},320102340,{"$f":"IF(COUNTIF('مخزن 111'!$D$7:$D$249,$E80)=0,\"\",VLOOKUP($E80,'مخزن 111'!$D$7:$I$249,MATCH(F$6,'مخزن 111'!$D$6:$I$6,0),0))","v":"ل/دايت330م"},{"$f":"IF(COUNTIF('مخزن 111'!$D$7:$D$249,$E80)=0,\"\",VLOOKUP($E80,'مخزن 111'!$D$7:$I$249,MATCH(G$6,'مخزن 111'!$D$6:$I$6,0),0))","v":"SOFT DRINK BIG      "},{"$f":"IF(COUNTIF('مخزن 111'!$D$7:$D$249,$E80)=0,\"\",VLOOKUP($E80,'مخزن 111'!$D$7:$I$249,MATCH(H$6,'مخزن 111'!$D$6:$I$6,0),0))","v":"ل/دايت330م;مياه غازيه كبيره"},{"$f":"IF(COUNTIF('مخزن 111'!$D$7:$D$249,$E80)=0,\"\",VLOOKUP($E80,'مخزن 111'!$D$7:$I$249,MATCH(I$6,'مخزن 111'!$D$6:$I$6,0),0))","v":"CRT"},{"$f":"IF(COUNTIF('مخزن 111'!$D$7:$D$249,$E80)=0,\"\",VLOOKUP($E80,'مخزن 111'!$D$7:$I$249,MATCH(J$6,'مخزن 111'!$D$6:$I$6,0),0))","v":50}]
[null,null,null,{"$f":"IF($F81=\"\",\"\",MAX($D$6:D80)+1)","v":""},320102361,{"$f":"IF(COUNTIF('مخزن 111'!$D$7:$D$249,$E81)=0,\"\",VLOOKUP($E81,'مخزن 111'!$D$7:$I$249,MATCH(F$6,'مخزن 111'!$D$6:$I$6,0),0))","v":""},{"$f":"IF(COUNTIF('مخزن 111'!$D$7:$D$249,$E81)=0,\"\",VLOOKUP($E81,'مخزن 111'!$D$7:$I$249,MATCH(G$6,'مخزن 111'!$D$6:$I$6,0),0))","v":""},{"$f":"IF(COUNTIF('مخزن 111'!$D$7:$D$249,$E81)=0,\"\",VLOOKUP($E81,'مخزن 111'!$D$7:$I$249,MATCH(H$6,'مخزن 111'!$D$6:$I$6,0),0))","v":""},{"$f":"IF(COUNTIF('مخزن 111'!$D$7:$D$249,$E81)=0,\"\",VLOOKUP($E81,'مخزن 111'!$D$7:$I$249,MATCH(I$6,'مخزن 111'!$D$6:$I$6,0),0))","v":""},{"$f":"IF(COUNTIF('مخزن 111'!$D$7:$D$249,$E81)=0,\"\",VLOOKUP($E81,'مخزن 111'!$D$7:$I$249,MATCH(J$6,'مخزن 111'!$D$6:$I$6,0),0))","v":""}]
[null,null,null,{"$f":"IF($F82=\"\",\"\",MAX($D$6:D81)+1)","v":""},320102362,{"$f":"IF(COUNTIF('مخزن 111'!$D$7:$D$249,$E82)=0,\"\",VLOOKUP($E82,'مخزن 111'!$D$7:$I$249,MATCH(F$6,'مخزن 111'!$D$6:$I$6,0),0))","v":""},{"$f":"IF(COUNTIF('مخزن 111'!$D$7:$D$249,$E82)=0,\"\",VLOOKUP($E82,'مخزن 111'!$D$7:$I$249,MATCH(G$6,'مخزن 111'!$D$6:$I$6,0),0))","v":""},{"$f":"IF(COUNTIF('مخزن 111'!$D$7:$D$249,$E82)=0,\"\",VLOOKUP($E82,'مخزن 111'!$D$7:$I$249,MATCH(H$6,'مخزن 111'!$D$6:$I$6,0),0))","v":""},{"$f":"IF(COUNTIF('مخزن 111'!$D$7:$D$249,$E82)=0,\"\",VLOOKUP($E82,'مخزن 111'!$D$7:$I$249,MATCH(I$6,'مخزن 111'!$D$6:$I$6,0),0))","v":""},{"$f":"IF(COUNTIF('مخزن 111'!$D$7:$D$249,$E82)=0,\"\",VLOOKUP($E82,'مخزن 111'!$D$7:$I$249,MATCH(J$6,'مخزن 111'!$D$6:$I$6,0),0))","v":""}]
[null,null,null,{"$f":"IF($F83=\"\",\"\",MAX($D$6:D82)+1)","v":50},320105006,{"$f":"IF(COUNTIF('مخزن 111'!$D$7:$D$249,$E83)=0,\"\",VLOOKUP($E83,'مخزن 111'!$D$7:$I$249,MATCH(F$6,'مخزن 111'!$D$6:$I$6,0),0))","v":"كولا970مم"},{"$f":"IF(COUNTIF('مخزن 111'!$D$7:$D$249,$E83)=0,\"\",VLOOKUP($E83,'مخزن 111'!$D$7:$I$249,MATCH(G$6,'مخزن 111'!$D$6:$I$6,0),0))","v":"SOFT DRINKS 1 LITER "},{"$f":"IF(COUNTIF('مخزن 111'!$D$7:$D$249,$E83)=0,\"\",VLOOKUP($E83,'مخزن 111'!$D$7:$I$249,MATCH(H$6,'مخزن 111'!$D$6:$I$6,0),0))","v":"كولا970مم ;مشروبات غازية حوالى1"},{"$f":"IF(COUNTIF('مخزن 111'!$D$7:$D$249,$E83)=0,\"\",VLOOKUP($E83,'مخزن 111'!$D$7:$I$249,MATCH(I$6,'مخزن 111'!$D$6:$I$6,0),0))","v":"BOT"},{"$f":"IF(COUNTIF('مخزن 111'!$D$7:$D$249,$E83)=0,\"\",VLOOKUP($E83,'مخزن 111'!$D$7:$I$249,MATCH(J$6,'مخزن 111'!$D$6:$I$6,0),0))","v":2550}]
[null,null,null,{"$f":"IF($F84=\"\",\"\",MAX($D$6:D83)+1)","v":51},320105007,{"$f":"IF(COUNTIF('مخزن 111'!$D$7:$D$249,$E84)=0,\"\",VLOOKUP($E84,'مخزن 111'!$D$7:$I$249,MATCH(F$6,'مخزن 111'!$D$6:$I$6,0),0))","v":"كولالايت970م"},{"$f":"IF(COUNTIF('مخزن 111'!$D$7:$D$249,$E84)=0,\"\",VLOOKUP($E84,'مخزن 111'!$D$7:$I$249,MATCH(G$6,'مخزن 111'!$D$6:$I$6,0),0))","v":"SOFT DRINKS 1 LITER "},{"$f":"IF(COUNTIF('مخزن 111'!$D$7:$D$249,$E84)=0,\"\",VLOOKUP($E84,'مخزن 111'!$D$7:$I$249,MATCH(H$6,'مخزن 111'!$D$6:$I$6,0),0))","v":"كولالايت970م;مشروبات غازية حوالى1"},{"$f":"IF(COUNTIF('مخزن 111'!$D$7:$D$249,$E84)=0,\"\",VLOOKUP($E84,'مخزن 111'!$D$7:$I$249,MATCH(I$6,'مخزن 111'!$D$6:$I$6,0),0))","v":"BOT"},{"$f":"IF(COUNTIF('مخزن 111'!$D$7:$D$249,$E84)=0,\"\",VLOOKUP($E84,'مخزن 111'!$D$7:$I$249,MATCH(J$6,'مخزن 111'!$D$6:$I$6,0),0))","v":594}]
[null,null,null,{"$f":"IF($F85=\"\",\"\",MAX($D$6:D84)+1)","v":""},320201608,{"$f":"IF(COUNTIF('مخزن 111'!$D$7:$D$249,$E85)=0,\"\",VLOOKUP($E85,'مخزن 111'!$D$7:$I$249,MATCH(F$6,'مخزن 111'!$D$6:$I$6,0),0))","v":""},{"$f":"IF(COUNTIF('مخزن 111'!$D$7:$D$249,$E85)=0,\"\",VLOOKUP($E85,'مخزن 111'!$D$7:$I$249,MATCH(G$6,'مخزن 111'!$D$6:$I$6,0),0))","v":""},{"$f":"IF(COUNTIF('مخزن 111'!$D$7:$D$249,$E85)=0,\"\",VLOOKUP($E85,'مخزن 111'!$D$7:$I$249,MATCH(H$6,'مخزن 111'!$D$6:$I$6,0),0))","v":""},{"$f":"IF(COUNTIF('مخزن 111'!$D$7:$D$249,$E85)=0,\"\",VLOOKUP($E85,'مخزن 111'!$D$7:$I$249,MATCH(I$6,'مخزن 111'!$D$6:$I$6,0),0))","v":""},{"$f":"IF(COUNTIF('مخزن 111'!$D$7:$D$249,$E85)=0,\"\",VLOOKUP($E85,'مخزن 111'!$D$7:$I$249,MATCH(J$6,'مخزن 111'!$D$6:$I$6,0),0))","v":""}]
[null,null,null,{"$f":"IF($F86=\"\",\"\",MAX($D$6:D85)+1)","v":52},320201633,{"$f":"IF(COUNTIF('مخزن 111'!$D$7:$D$249,$E86)=0,\"\",VLOOKUP($E86,'مخزن 111'!$D$7:$I$249,MATCH(F$6,'مخزن 111'!$D$6:$I$6,0),0))","v":"أحمر2جم ظر"},{"$f":"IF(COUNTIF('مخزن 111'!$D$7:$D$249,$E86)=0,\"\",VLOOKUP($E86,'مخزن 111'!$D$7:$I$249,MATCH(G$6,'مخزن 111'!$D$6:$I$6,0),0))","v":"TEA                 "},{"$f":"IF(COUNTIF('مخزن 111'!$D$7:$D$249,$E86)=0,\"\",VLOOKUP($E86,'مخزن 111'!$D$7:$I$249,MATCH(H$6,'مخزن 111'!$D$6:$I$6,0),0))","v":"شاى"},{"$f":"IF(COUNTIF('مخزن 111'!$D$7:$D$249,$E86)=0,\"\",VLOOKUP($E86,'مخزن 111'!$D$7:$I$249,MATCH(I$6,'مخزن 111'!$D$6:$I$6,0),0))","v":"PKT"},{"$f":"IF(COUNTIF('مخزن 111'!$D$7:$D$249,$E86)=0,\"\",VLOOKUP($E86,'مخزن 111'!$D$7:$I$249,MATCH(J$6,'مخزن 111'!$D$6:$I$6,0),0))","v":101440}]
[null,null,null,{"$f":"IF($F87=\"\",\"\",MAX($D$6:D86)+1)","v":53},320202609,{"$f":"IF(COUNTIF('مخزن 111'!$D$7:$D$249,$E87)=0,\"\",VLOOKUP($E87,'مخزن 111'!$D$7:$I$249,MATCH(F$6,'مخزن 111'!$D$6:$I$6,0),0))","v":"نستله كلاسك"},{"$f":"IF(COUNTIF('مخزن 111'!$D$7:$D$249,$E87)=0,\"\",VLOOKUP($E87,'مخزن 111'!$D$7:$I$249,MATCH(G$6,'مخزن 111'!$D$6:$I$6,0),0))","v":"COFFEE              "},{"$f":"IF(COUNTIF('مخزن 111'!$D$7:$D$249,$E87)=0,\"\",VLOOKUP($E87,'مخزن 111'!$D$7:$I$249,MATCH(H$6,'مخزن 111'!$D$6:$I$6,0),0))","v":"بن"},{"$f":"IF(COUNTIF('مخزن 111'!$D$7:$D$249,$E87)=0,\"\",VLOOKUP($E87,'مخزن 111'!$D$7:$I$249,MATCH(I$6,'مخزن 111'!$D$6:$I$6,0),0))","v":"JAR"},{"$f":"IF(COUNTIF('مخزن 111'!$D$7:$D$249,$E87)=0,\"\",VLOOKUP($E87,'مخزن 111'!$D$7:$I$249,MATCH(J$6,'مخزن 111'!$D$6:$I$6,0),0))","v":10080}]
[null,null,null,{"$f":"IF($F88=\"\",\"\",MAX($D$6:D87)+1)","v":54},320202637,{"$f":"IF(COUNTIF('مخزن 111'!$D$7:$D$249,$E88)=0,\"\",VLOOKUP($E88,'مخزن 111'!$D$7:$I$249,MATCH(F$6,'مخزن 111'!$D$6:$I$6,0),0))","v":"ن/جولد50جم"},{"$f":"IF(COUNTIF('مخزن 111'!$D$7:$D$249,$E88)=0,\"\",VLOOKUP($E88,'مخزن 111'!$D$7:$I$249,MATCH(G$6,'مخزن 111'!$D$6:$I$6,0),0))","v":"COFFEE              "},{"$f":"IF(COUNTIF('مخزن 111'!$D$7:$D$249,$E88)=0,\"\",VLOOKUP($E88,'مخزن 111'!$D$7:$I$249,MATCH(H$6,'مخزن 111'!$D$6:$I$6,0),0))","v":"بن"},{"$f":"IF(COUNTIF('مخزن 111'!$D$7:$D$249,$E88)=0,\"\",VLOOKUP($E88,'مخزن 111'!$D$7:$I$249,MATCH(I$6,'مخزن 111'!$D$6:$I$6,0),0))","v":"JAR"},{"$f":"IF(COUNTIF('مخزن 111'!$D$7:$D$249,$E88)=0,\"\",VLOOKUP($E88,'مخزن 111'!$D$7:$I$249,MATCH(J$6,'مخزن 111'!$D$6:$I$6,0),0))","v":336}]
[null,null,null,{"$f":"IF($F89=\"\",\"\",MAX($D$6:D88)+1)","v":55},320203603,{"$f":"IF(COUNTIF('مخزن 111'!$D$7:$D$249,$E89)=0,\"\",VLOOKUP($E89,'مخزن 111'!$D$7:$I$249,MATCH(F$6,'مخزن 111'!$D$6:$I$6,0),0))","v":"بلاستك10جم"},{"$f":"IF(COUNTIF('مخزن 111'!$D$7:$D$249,$E89)=0,\"\",VLOOKUP($E89,'مخزن 111'!$D$7:$I$249,MATCH(G$6,'مخزن 111'!$D$6:$I$6,0),0))","v":"BUTTER PATS         "},{"$f":"IF(COUNTIF('مخزن 111'!$D$7:$D$249,$E89)=0,\"\",VLOOKUP($E89,'مخزن 111'!$D$7:$I$249,MATCH(H$6,'مخزن 111'!$D$6:$I$6,0),0))","v":"زبدة بالقطعة"},{"$f":"IF(COUNTIF('مخزن 111'!$D$7:$D$249,$E89)=0,\"\",VLOOKUP($E89,'مخزن 111'!$D$7:$I$249,MATCH(I$6,'مخزن 111'!$D$6:$I$6,0),0))","v":"THN"},{"$f":"IF(COUNTIF('مخزن 111'!$D$7:$D$249,$E89)=0,\"\",VLOOKUP($E89,'مخزن 111'!$D$7:$I$249,MATCH(J$6,'مخزن 111'!$D$6:$I$6,0),0))","v":80.400000000000006}]
[null,null,null,{"$f":"IF($F90=\"\",\"\",MAX($D$6:D89)+1)","v":56},320204601,{"$f":"IF(COUNTIF('مخزن 111'!$D$7:$D$249,$E90)=0,\"\",VLOOKUP($E90,'مخزن 111'!$D$7:$I$249,MATCH(F$6,'مخزن 111'!$D$6:$I$6,0),0))","v":"باكو10ج"},{"$f":"IF(COUNTIF('مخزن 111'!$D$7:$D$249,$E90)=0,\"\",VLOOKUP($E90,'مخزن 111'!$D$7:$I$249,MATCH(G$6,'مخزن 111'!$D$6:$I$6,0),0))","v":"SALAD DRESSING      "},{"$f":"IF(COUNTIF('مخزن 111'!$D$7:$D$249,$E90)=0,\"\",VLOOKUP($E90,'مخزن 111'!$D$7:$I$249,MATCH(H$6,'مخزن 111'!$D$6:$I$6,0),0))","v":"سلاطةدريسنج"},{"$f":"IF(COUNTIF('مخزن 111'!$D$7:$D$249,$E90)=0,\"\",VLOOKUP($E90,'مخزن 111'!$D$7:$I$249,MATCH(I$6,'مخزن 111'!$D$6:$I$6,0),0))","v":"THN"},{"$f":"IF(COUNTIF('مخزن 111'!$D$7:$D$249,$E90)=0,\"\",VLOOKUP($E90,'مخزن 111'!$D$7:$I$249,MATCH(J$6,'مخزن 111'!$D$6:$I$6,0),0))","v":116}]
[null,null,null,{"$f":"IF($F91=\"\",\"\",MAX($D$6:D90)+1)","v":57},320204636,{"$f":"IF(COUNTIF('مخزن 111'!$D$7:$D$249,$E91)=0,\"\",VLOOKUP($E91,'مخزن 111'!$D$7:$I$249,MATCH(F$6,'مخزن 111'!$D$6:$I$6,0),0))","v":"ديمىجلاس750"},{"$f":"IF(COUNTIF('مخزن 111'!$D$7:$D$249,$E91)=0,\"\",VLOOKUP($E91,'مخزن 111'!$D$7:$I$249,MATCH(G$6,'مخزن 111'!$D$6:$I$6,0),0))","v":"SALAD DRESSING      "},{"$f":"IF(COUNTIF('مخزن 111'!$D$7:$D$249,$E91)=0,\"\",VLOOKUP($E91,'مخزن 111'!$D$7:$I$249,MATCH(H$6,'مخزن 111'!$D$6:$I$6,0),0))","v":"سلاطةدريسنج"},{"$f":"IF(COUNTIF('مخزن 111'!$D$7:$D$249,$E91)=0,\"\",VLOOKUP($E91,'مخزن 111'!$D$7:$I$249,MATCH(I$6,'مخزن 111'!$D$6:$I$6,0),0))","v":"TIN"},{"$f":"IF(COUNTIF('مخزن 111'!$D$7:$D$249,$E91)=0,\"\",VLOOKUP($E91,'مخزن 111'!$D$7:$I$249,MATCH(J$6,'مخزن 111'!$D$6:$I$6,0),0))","v":114}]
[null,null,null,{"$f":"IF($F92=\"\",\"\",MAX($D$6:D91)+1)","v":""},320204639,{"$f":"IF(COUNTIF('مخزن 111'!$D$7:$D$249,$E92)=0,\"\",VLOOKUP($E92,'مخزن 111'!$D$7:$I$249,MATCH(F$6,'مخزن 111'!$D$6:$I$6,0),0))","v":""},{"$f":"IF(COUNTIF('مخزن 111'!$D$7:$D$249,$E92)=0,\"\",VLOOKUP($E92,'مخزن 111'!$D$7:$I$249,MATCH(G$6,'مخزن 111'!$D$6:$I$6,0),0))","v":""},{"$f":"IF(COUNTIF('مخزن 111'!$D$7:$D$249,$E92)=0,\"\",VLOOKUP($E92,'مخزن 111'!$D$7:$I$249,MATCH(H$6,'مخزن 111'!$D$6:$I$6,0),0))","v":""},{"$f":"IF(COUNTIF('مخزن 111'!$D$7:$D$249,$E92)=0,\"\",VLOOKUP($E92,'مخزن 111'!$D$7:$I$249,MATCH(I$6,'مخزن 111'!$D$6:$I$6,0),0))","v":""},{"$f":"IF(COUNTIF('مخزن 111'!$D$7:$D$249,$E92)=0,\"\",VLOOKUP($E92,'مخزن 111'!$D$7:$I$249,MATCH(J$6,'مخزن 111'!$D$6:$I$6,0),0))","v":""}]
[null,null,null,{"$f":"IF($F93=\"\",\"\",MAX($D$6:D92)+1)","v":58},320206603,{"$f":"IF(COUNTIF('مخزن 111'!$D$7:$D$249,$E93)=0,\"\",VLOOKUP($E93,'مخزن 111'!$D$7:$I$249,MATCH(F$6,'مخزن 111'!$D$6:$I$6,0),0))","v":"كريمر م/م"},{"$f":"IF(COUNTIF('مخزن 111'!$D$7:$D$249,$E93)=0,\"\",VLOOKUP($E93,'مخزن 111'!$D$7:$I$249,MATCH(G$6,'مخزن 111'!$D$6:$I$6,0),0))","v":"DRY MILK            "},{"$f":"IF(COUNTIF('مخزن 111'!$D$7:$D$249,$E93)=0,\"\",VLOOKUP($E93,'مخزن 111'!$D$7:$I$249,MATCH(H$6,'مخزن 111'!$D$6:$I$6,0),0))","v":"لبن جاف باكو"},{"$f":"IF(COUNTIF('مخزن 111'!$D$7:$D$249,$E93)=0,\"\",VLOOKUP($E93,'مخزن 111'!$D$7:$I$249,MATCH(I$6,'مخزن 111'!$D$6:$I$6,0),0))","v":"THN"},{"$f":"IF(COUNTIF('مخزن 111'!$D$7:$D$249,$E93)=0,\"\",VLOOKUP($E93,'مخزن 111'!$D$7:$I$249,MATCH(J$6,'مخزن 111'!$D$6:$I$6,0),0))","v":12}]
[null,null,null,{"$f":"IF($F94=\"\",\"\",MAX($D$6:D93)+1)","v":59},320207617,{"$f":"IF(COUNTIF('مخزن 111'!$D$7:$D$249,$E94)=0,\"\",VLOOKUP($E94,'مخزن 111'!$D$7:$I$249,MATCH(F$6,'مخزن 111'!$D$6:$I$6,0),0))","v":"سكرمغلف بد"},{"$f":"IF(COUNTIF('مخزن 111'!$D$7:$D$249,$E94)=0,\"\",VLOOKUP($E94,'مخزن 111'!$D$7:$I$249,MATCH(G$6,'مخزن 111'!$D$6:$I$6,0),0))","v":"SUGAR               "},{"$f":"IF(COUNTIF('مخزن 111'!$D$7:$D$249,$E94)=0,\"\",VLOOKUP($E94,'مخزن 111'!$D$7:$I$249,MATCH(H$6,'مخزن 111'!$D$6:$I$6,0),0))","v":"سكر ناعم"},{"$f":"IF(COUNTIF('مخزن 111'!$D$7:$D$249,$E94)=0,\"\",VLOOKUP($E94,'مخزن 111'!$D$7:$I$249,MATCH(I$6,'مخزن 111'!$D$6:$I$6,0),0))","v":"THN"},{"$f":"IF(COUNTIF('مخزن 111'!$D$7:$D$249,$E94)=0,\"\",VLOOKUP($E94,'مخزن 111'!$D$7:$I$249,MATCH(J$6,'مخزن 111'!$D$6:$I$6,0),0))","v":116}]
[null,null,null,{"$f":"IF($F95=\"\",\"\",MAX($D$6:D94)+1)","v":60},320208624,{"$f":"IF(COUNTIF('مخزن 111'!$D$7:$D$249,$E95)=0,\"\",VLOOKUP($E95,'مخزن 111'!$D$7:$I$249,MATCH(F$6,'مخزن 111'!$D$6:$I$6,0),0))","v":"م/ب/ف20جم"},{"$f":"IF(COUNTIF('مخزن 111'!$D$7:$D$249,$E95)=0,\"\",VLOOKUP($E95,'مخزن 111'!$D$7:$I$249,MATCH(G$6,'مخزن 111'!$D$6:$I$6,0),0))","v":"JAM PORTION         "},{"$f":"IF(COUNTIF('مخزن 111'!$D$7:$D$249,$E95)=0,\"\",VLOOKUP($E95,'مخزن 111'!$D$7:$I$249,MATCH(H$6,'مخزن 111'!$D$6:$I$6,0),0))","v":"مربى"},{"$f":"IF(COUNTIF('مخزن 111'!$D$7:$D$249,$E95)=0,\"\",VLOOKUP($E95,'مخزن 111'!$D$7:$I$249,MATCH(I$6,'مخزن 111'!$D$6:$I$6,0),0))","v":"EA."},{"$f":"IF(COUNTIF('مخزن 111'!$D$7:$D$249,$E95)=0,\"\",VLOOKUP($E95,'مخزن 111'!$D$7:$I$249,MATCH(J$6,'مخزن 111'!$D$6:$I$6,0),0))","v":31360}]
[null,null,null,{"$f":"IF($F96=\"\",\"\",MAX($D$6:D95)+1)","v":61},320209612,{"$f":"IF(COUNTIF('مخزن 111'!$D$7:$D$249,$E96)=0,\"\",VLOOKUP($E96,'مخزن 111'!$D$7:$I$249,MATCH(F$6,'مخزن 111'!$D$6:$I$6,0),0))","v":"ع/نح/ب/20ج"},{"$f":"IF(COUNTIF('مخزن 111'!$D$7:$D$249,$E96)=0,\"\",VLOOKUP($E96,'مخزن 111'!$D$7:$I$249,MATCH(G$6,'مخزن 111'!$D$6:$I$6,0),0))","v":"HONEY PORTION       "},{"$f":"IF(COUNTIF('مخزن 111'!$D$7:$D$249,$E96)=0,\"\",VLOOKUP($E96,'مخزن 111'!$D$7:$I$249,MATCH(H$6,'مخزن 111'!$D$6:$I$6,0),0))","v":"عسل نحل"},{"$f":"IF(COUNTIF('مخزن 111'!$D$7:$D$249,$E96)=0,\"\",VLOOKUP($E96,'مخزن 111'!$D$7:$I$249,MATCH(I$6,'مخزن 111'!$D$6:$I$6,0),0))","v":"EA."},{"$f":"IF(COUNTIF('مخزن 111'!$D$7:$D$249,$E96)=0,\"\",VLOOKUP($E96,'مخزن 111'!$D$7:$I$249,MATCH(J$6,'مخزن 111'!$D$6:$I$6,0),0))","v":2240}]
[null,null,null,{"$f":"IF($F97=\"\",\"\",MAX($D$6:D96)+1)","v":62},320304301,{"$f":"IF(COUNTIF('مخزن 111'!$D$7:$D$249,$E97)=0,\"\",VLOOKUP($E97,'مخزن 111'!$D$7:$I$249,MATCH(F$6,'مخزن 111'!$D$6:$I$6,0),0))","v":"برتقال"},{"$f":"IF(COUNTIF('مخزن 111'!$D$7:$D$249,$E97)=0,\"\",VLOOKUP($E97,'مخزن 111'!$D$7:$I$249,MATCH(G$6,'مخزن 111'!$D$6:$I$6,0),0))","v":" UICE CARTON 1 LTR  "},{"$f":"IF(COUNTIF('مخزن 111'!$D$7:$D$249,$E97)=0,\"\",VLOOKUP($E97,'مخزن 111'!$D$7:$I$249,MATCH(H$6,'مخزن 111'!$D$6:$I$6,0),0))","v":"عصير علب كرتون 1لتر"},{"$f":"IF(COUNTIF('مخزن 111'!$D$7:$D$249,$E97)=0,\"\",VLOOKUP($E97,'مخزن 111'!$D$7:$I$249,MATCH(I$6,'مخزن 111'!$D$6:$I$6,0),0))","v":"CRT"},{"$f":"IF(COUNTIF('مخزن 111'!$D$7:$D$249,$E97)=0,\"\",VLOOKUP($E97,'مخزن 111'!$D$7:$I$249,MATCH(J$6,'مخزن 111'!$D$6:$I$6,0),0))","v":675}]
[null,null,null,{"$f":"IF($F98=\"\",\"\",MAX($D$6:D97)+1)","v":63},320304302,{"$f":"IF(COUNTIF('مخزن 111'!$D$7:$D$249,$E98)=0,\"\",VLOOKUP($E98,'مخزن 111'!$D$7:$I$249,MATCH(F$6,'مخزن 111'!$D$6:$I$6,0),0))","v":"تفاح"},{"$f":"IF(COUNTIF('مخزن 111'!$D$7:$D$249,$E98)=0,\"\",VLOOKUP($E98,'مخزن 111'!$D$7:$I$249,MATCH(G$6,'مخزن 111'!$D$6:$I$6,0),0))","v":" UICE CARTON 1 LTR  "},{"$f":"IF(COUNTIF('مخزن 111'!$D$7:$D$249,$E98)=0,\"\",VLOOKUP($E98,'مخزن 111'!$D$7:$I$249,MATCH(H$6,'مخزن 111'!$D$6:$I$6,0),0))","v":"عصير علب كرتون 1لتر"},{"$f":"IF(COUNTIF('مخزن 111'!$D$7:$D$249,$E98)=0,\"\",VLOOKUP($E98,'مخزن 111'!$D$7:$I$249,MATCH(I$6,'مخزن 111'!$D$6:$I$6,0),0))","v":"CRT"},{"$f":"IF(COUNTIF('مخزن 111'!$D$7:$D$249,$E98)=0,\"\",VLOOKUP($E98,'مخزن 111'!$D$7:$I$249,MATCH(J$6,'مخزن 111'!$D$6:$I$6,0),0))","v":365}]
[null,null,null,{"$f":"IF($F99=\"\",\"\",MAX($D$6:D98)+1)","v":64},320304303,{"$f":"IF(COUNTIF('مخزن 111'!$D$7:$D$249,$E99)=0,\"\",VLOOKUP($E99,'مخزن 111'!$D$7:$I$249,MATCH(F$6,'مخزن 111'!$D$6:$I$6,0),0))","v":"مانجو"},{"$f":"IF(COUNTIF('مخزن 111'!$D$7:$D$249,$E99)=0,\"\",VLOOKUP($E99,'مخزن 111'!$D$7:$I$249,MATCH(G$6,'مخزن 111'!$D$6:$I$6,0),0))","v":" UICE CARTON 1 LTR  "},{"$f":"IF(COUNTIF('مخزن 111'!$D$7:$D$249,$E99)=0,\"\",VLOOKUP($E99,'مخزن 111'!$D$7:$I$249,MATCH(H$6,'مخزن 111'!$D$6:$I$6,0),0))","v":"عصير علب كرتون 1لتر"},{"$f":"IF(COUNTIF('مخزن 111'!$D$7:$D$249,$E99)=0,\"\",VLOOKUP($E99,'مخزن 111'!$D$7:$I$249,MATCH(I$6,'مخزن 111'!$D$6:$I$6,0),0))","v":"CRT"},{"$f":"IF(COUNTIF('مخزن 111'!$D$7:$D$249,$E99)=0,\"\",VLOOKUP($E99,'مخزن 111'!$D$7:$I$249,MATCH(J$6,'مخزن 111'!$D$6:$I$6,0),0))","v":450}]
[null,null,null,{"$f":"IF($F100=\"\",\"\",MAX($D$6:D99)+1)","v":65},320304305,{"$f":"IF(COUNTIF('مخزن 111'!$D$7:$D$249,$E100)=0,\"\",VLOOKUP($E100,'مخزن 111'!$D$7:$I$249,MATCH(F$6,'مخزن 111'!$D$6:$I$6,0),0))","v":"جوافة1لتر"},{"$f":"IF(COUNTIF('مخزن 111'!$D$7:$D$249,$E100)=0,\"\",VLOOKUP($E100,'مخزن 111'!$D$7:$I$249,MATCH(G$6,'مخزن 111'!$D$6:$I$6,0),0))","v":" UICE CARTON 1 LTR  "},{"$f":"IF(COUNTIF('مخزن 111'!$D$7:$D$249,$E100)=0,\"\",VLOOKUP($E100,'مخزن 111'!$D$7:$I$249,MATCH(H$6,'مخزن 111'!$D$6:$I$6,0),0))","v":"عصير علب كرتون 1لتر"},{"$f":"IF(COUNTIF('مخزن 111'!$D$7:$D$249,$E100)=0,\"\",VLOOKUP($E100,'مخزن 111'!$D$7:$I$249,MATCH(I$6,'مخزن 111'!$D$6:$I$6,0),0))","v":"CRT"},{"$f":"IF(COUNTIF('مخزن 111'!$D$7:$D$249,$E100)=0,\"\",VLOOKUP($E100,'مخزن 111'!$D$7:$I$249,MATCH(J$6,'مخزن 111'!$D$6:$I$6,0),0))","v":450}]
[null,null,null,{"$f":"IF($F101=\"\",\"\",MAX($D$6:D100)+1)","v":66},320304306,{"$f":"IF(COUNTIF('مخزن 111'!$D$7:$D$249,$E101)=0,\"\",VLOOKUP($E101,'مخزن 111'!$D$7:$I$249,MATCH(F$6,'مخزن 111'!$D$6:$I$6,0),0))","v":"تفاح/غ/م"},{"$f":"IF(COUNTIF('مخزن 111'!$D$7:$D$249,$E101)=0,\"\",VLOOKUP($E101,'مخزن 111'!$D$7:$I$249,MATCH(G$6,'مخزن 111'!$D$6:$I$6,0),0))","v":" UICE CARTON 1 LTR  "},{"$f":"IF(COUNTIF('مخزن 111'!$D$7:$D$249,$E101)=0,\"\",VLOOKUP($E101,'مخزن 111'!$D$7:$I$249,MATCH(H$6,'مخزن 111'!$D$6:$I$6,0),0))","v":"عصير علب كرتون 1لتر"},{"$f":"IF(COUNTIF('مخزن 111'!$D$7:$D$249,$E101)=0,\"\",VLOOKUP($E101,'مخزن 111'!$D$7:$I$249,MATCH(I$6,'مخزن 111'!$D$6:$I$6,0),0))","v":"CRT"},{"$f":"IF(COUNTIF('مخزن 111'!$D$7:$D$249,$E101)=0,\"\",VLOOKUP($E101,'مخزن 111'!$D$7:$I$249,MATCH(J$6,'مخزن 111'!$D$6:$I$6,0),0))","v":435}]
[null,null,null,{"$f":"IF($F102=\"\",\"\",MAX($D$6:D101)+1)","v":""},320304318,{"$f":"IF(COUNTIF('مخزن 111'!$D$7:$D$249,$E102)=0,\"\",VLOOKUP($E102,'مخزن 111'!$D$7:$I$249,MATCH(F$6,'مخزن 111'!$D$6:$I$6,0),0))","v":""},{"$f":"IF(COUNTIF('مخزن 111'!$D$7:$D$249,$E102)=0,\"\",VLOOKUP($E102,'مخزن 111'!$D$7:$I$249,MATCH(G$6,'مخزن 111'!$D$6:$I$6,0),0))","v":""},{"$f":"IF(COUNTIF('مخزن 111'!$D$7:$D$249,$E102)=0,\"\",VLOOKUP($E102,'مخزن 111'!$D$7:$I$249,MATCH(H$6,'مخزن 111'!$D$6:$I$6,0),0))","v":""},{"$f":"IF(COUNTIF('مخزن 111'!$D$7:$D$249,$E102)=0,\"\",VLOOKUP($E102,'مخزن 111'!$D$7:$I$249,MATCH(I$6,'مخزن 111'!$D$6:$I$6,0),0))","v":""},{"$f":"IF(COUNTIF('مخزن 111'!$D$7:$D$249,$E102)=0,\"\",VLOOKUP($E102,'مخزن 111'!$D$7:$I$249,MATCH(J$6,'مخزن 111'!$D$6:$I$6,0),0))","v":""}]
[null,null,null,{"$f":"IF($F103=\"\",\"\",MAX($D$6:D102)+1)","v":67},320305427,{"$f":"IF(COUNTIF('مخزن 111'!$D$7:$D$249,$E103)=0,\"\",VLOOKUP($E103,'مخزن 111'!$D$7:$I$249,MATCH(F$6,'مخزن 111'!$D$6:$I$6,0),0))","v":"تفاح/م235م"},{"$f":"IF(COUNTIF('مخزن 111'!$D$7:$D$249,$E103)=0,\"\",VLOOKUP($E103,'مخزن 111'!$D$7:$I$249,MATCH(G$6,'مخزن 111'!$D$6:$I$6,0),0))","v":"VARIED JUICE        "},{"$f":"IF(COUNTIF('مخزن 111'!$D$7:$D$249,$E103)=0,\"\",VLOOKUP($E103,'مخزن 111'!$D$7:$I$249,MATCH(H$6,'مخزن 111'!$D$6:$I$6,0),0))","v":"عصير انواع"},{"$f":"IF(COUNTIF('مخزن 111'!$D$7:$D$249,$E103)=0,\"\",VLOOKUP($E103,'مخزن 111'!$D$7:$I$249,MATCH(I$6,'مخزن 111'!$D$6:$I$6,0),0))","v":"TIN"},{"$f":"IF(COUNTIF('مخزن 111'!$D$7:$D$249,$E103)=0,\"\",VLOOKUP($E103,'مخزن 111'!$D$7:$I$249,MATCH(J$6,'مخزن 111'!$D$6:$I$6,0),0))","v":25515}]
[null,null,null,{"$f":"IF($F104=\"\",\"\",MAX($D$6:D103)+1)","v":68},320305428,{"$f":"IF(COUNTIF('مخزن 111'!$D$7:$D$249,$E104)=0,\"\",VLOOKUP($E104,'مخزن 111'!$D$7:$I$249,MATCH(F$6,'مخزن 111'!$D$6:$I$6,0),0))","v":"ع/جوافة235"},{"$f":"IF(COUNTIF('مخزن 111'!$D$7:$D$249,$E104)=0,\"\",VLOOKUP($E104,'مخزن 111'!$D$7:$I$249,MATCH(G$6,'مخزن 111'!$D$6:$I$6,0),0))","v":"VARIED JUICE        "},{"$f":"IF(COUNTIF('مخزن 111'!$D$7:$D$249,$E104)=0,\"\",VLOOKUP($E104,'مخزن 111'!$D$7:$I$249,MATCH(H$6,'مخزن 111'!$D$6:$I$6,0),0))","v":"عصير انواع"},{"$f":"IF(COUNTIF('مخزن 111'!$D$7:$D$249,$E104)=0,\"\",VLOOKUP($E104,'مخزن 111'!$D$7:$I$249,MATCH(I$6,'مخزن 111'!$D$6:$I$6,0),0))","v":"TIN"},{"$f":"IF(COUNTIF('مخزن 111'!$D$7:$D$249,$E104)=0,\"\",VLOOKUP($E104,'مخزن 111'!$D$7:$I$249,MATCH(J$6,'مخزن 111'!$D$6:$I$6,0),0))","v":14580}]
[null,null,null,{"$f":"IF($F105=\"\",\"\",MAX($D$6:D104)+1)","v":69},320305429,{"$f":"IF(COUNTIF('مخزن 111'!$D$7:$D$249,$E105)=0,\"\",VLOOKUP($E105,'مخزن 111'!$D$7:$I$249,MATCH(F$6,'مخزن 111'!$D$6:$I$6,0),0))","v":"ع/مانجو235"},{"$f":"IF(COUNTIF('مخزن 111'!$D$7:$D$249,$E105)=0,\"\",VLOOKUP($E105,'مخزن 111'!$D$7:$I$249,MATCH(G$6,'مخزن 111'!$D$6:$I$6,0),0))","v":"VARIED JUICE        "},{"$f":"IF(COUNTIF('مخزن 111'!$D$7:$D$249,$E105)=0,\"\",VLOOKUP($E105,'مخزن 111'!$D$7:$I$249,MATCH(H$6,'مخزن 111'!$D$6:$I$6,0),0))","v":"عصير انواع"},{"$f":"IF(COUNTIF('مخزن 111'!$D$7:$D$249,$E105)=0,\"\",VLOOKUP($E105,'مخزن 111'!$D$7:$I$249,MATCH(I$6,'مخزن 111'!$D$6:$I$6,0),0))","v":"TIN"},{"$f":"IF(COUNTIF('مخزن 111'!$D$7:$D$249,$E105)=0,\"\",VLOOKUP($E105,'مخزن 111'!$D$7:$I$249,MATCH(J$6,'مخزن 111'!$D$6:$I$6,0),0))","v":18090}]
[null,null,null,{"$f":"IF($F106=\"\",\"\",MAX($D$6:D105)+1)","v":70},320305430,{"$f":"IF(COUNTIF('مخزن 111'!$D$7:$D$249,$E106)=0,\"\",VLOOKUP($E106,'مخزن 111'!$D$7:$I$249,MATCH(F$6,'مخزن 111'!$D$6:$I$6,0),0))","v":"ع/برتقل235"},{"$f":"IF(COUNTIF('مخزن 111'!$D$7:$D$249,$E106)=0,\"\",VLOOKUP($E106,'مخزن 111'!$D$7:$I$249,MATCH(G$6,'مخزن 111'!$D$6:$I$6,0),0))","v":"VARIED JUICE        "},{"$f":"IF(COUNTIF('مخزن 111'!$D$7:$D$249,$E106)=0,\"\",VLOOKUP($E106,'مخزن 111'!$D$7:$I$249,MATCH(H$6,'مخزن 111'!$D$6:$I$6,0),0))","v":"عصير انواع"},{"$f":"IF(COUNTIF('مخزن 111'!$D$7:$D$249,$E106)=0,\"\",VLOOKUP($E106,'مخزن 111'!$D$7:$I$249,MATCH(I$6,'مخزن 111'!$D$6:$I$6,0),0))","v":"TIN"},{"$f":"IF(COUNTIF('مخزن 111'!$D$7:$D$249,$E106)=0,\"\",VLOOKUP($E106,'مخزن 111'!$D$7:$I$249,MATCH(J$6,'مخزن 111'!$D$6:$I$6,0),0))","v":36450}]
[null,null,null,{"$f":"IF($F107=\"\",\"\",MAX($D$6:D106)+1)","v":71},320401502,{"$f":"IF(COUNTIF('مخزن 111'!$D$7:$D$249,$E107)=0,\"\",VLOOKUP($E107,'مخزن 111'!$D$7:$I$249,MATCH(F$6,'مخزن 111'!$D$6:$I$6,0),0))","v":"عبوه1,5لتر"},{"$f":"IF(COUNTIF('مخزن 111'!$D$7:$D$249,$E107)=0,\"\",VLOOKUP($E107,'مخزن 111'!$D$7:$I$249,MATCH(G$6,'مخزن 111'!$D$6:$I$6,0),0))","v":"MINERAL WATER       "},{"$f":"IF(COUNTIF('مخزن 111'!$D$7:$D$249,$E107)=0,\"\",VLOOKUP($E107,'مخزن 111'!$D$7:$I$249,MATCH(H$6,'مخزن 111'!$D$6:$I$6,0),0))","v":"مياه معدنية"},{"$f":"IF(COUNTIF('مخزن 111'!$D$7:$D$249,$E107)=0,\"\",VLOOKUP($E107,'مخزن 111'!$D$7:$I$249,MATCH(I$6,'مخزن 111'!$D$6:$I$6,0),0))","v":"BOX"},{"$f":"IF(COUNTIF('مخزن 111'!$D$7:$D$249,$E107)=0,\"\",VLOOKUP($E107,'مخزن 111'!$D$7:$I$249,MATCH(J$6,'مخزن 111'!$D$6:$I$6,0),0))","v":330}]
[null,null,null,{"$f":"IF($F108=\"\",\"\",MAX($D$6:D107)+1)","v":72},320401509,{"$f":"IF(COUNTIF('مخزن 111'!$D$7:$D$249,$E108)=0,\"\",VLOOKUP($E108,'مخزن 111'!$D$7:$I$249,MATCH(F$6,'مخزن 111'!$D$6:$I$6,0),0))","v":"مياه600ملى"},{"$f":"IF(COUNTIF('مخزن 111'!$D$7:$D$249,$E108)=0,\"\",VLOOKUP($E108,'مخزن 111'!$D$7:$I$249,MATCH(G$6,'مخزن 111'!$D$6:$I$6,0),0))","v":"MINERAL WATER       "},{"$f":"IF(COUNTIF('مخزن 111'!$D$7:$D$249,$E108)=0,\"\",VLOOKUP($E108,'مخزن 111'!$D$7:$I$249,MATCH(H$6,'مخزن 111'!$D$6:$I$6,0),0))","v":"مياه معدنية"},{"$f":"IF(COUNTIF('مخزن 111'!$D$7:$D$249,$E108)=0,\"\",VLOOKUP($E108,'مخزن 111'!$D$7:$I$249,MATCH(I$6,'مخزن 111'!$D$6:$I$6,0),0))","v":"CRT"},{"$f":"IF(COUNTIF('مخزن 111'!$D$7:$D$249,$E108)=0,\"\",VLOOKUP($E108,'مخزن 111'!$D$7:$I$249,MATCH(J$6,'مخزن 111'!$D$6:$I$6,0),0))","v":316}]
[null,null,null,{"$f":"IF($F109=\"\",\"\",MAX($D$6:D108)+1)","v":""},410104128,{"$f":"IF(COUNTIF('مخزن 111'!$D$7:$D$249,$E109)=0,\"\",VLOOKUP($E109,'مخزن 111'!$D$7:$I$249,MATCH(F$6,'مخزن 111'!$D$6:$I$6,0),0))","v":""},{"$f":"IF(COUNTIF('مخزن 111'!$D$7:$D$249,$E109)=0,\"\",VLOOKUP($E109,'مخزن 111'!$D$7:$I$249,MATCH(G$6,'مخزن 111'!$D$6:$I$6,0),0))","v":""},{"$f":"IF(COUNTIF('مخزن 111'!$D$7:$D$249,$E109)=0,\"\",VLOOKUP($E109,'مخزن 111'!$D$7:$I$249,MATCH(H$6,'مخزن 111'!$D$6:$I$6,0),0))","v":""},{"$f":"IF(COUNTIF('مخزن 111'!$D$7:$D$249,$E109)=0,\"\",VLOOKUP($E109,'مخزن 111'!$D$7:$I$249,MATCH(I$6,'مخزن 111'!$D$6:$I$6,0),0))","v":""},{"$f":"IF(COUNTIF('مخزن 111'!$D$7:$D$249,$E109)=0,\"\",VLOOKUP($E109,'مخزن 111'!$D$7:$I$249,MATCH(J$6,'مخزن 111'!$D$6:$I$6,0),0))","v":""}]
[null,null,null,{"$f":"IF($F110=\"\",\"\",MAX($D$6:D109)+1)","v":""},420102170,{"$f":"IF(COUNTIF('مخزن 111'!$D$7:$D$249,$E110)=0,\"\",VLOOKUP($E110,'مخزن 111'!$D$7:$I$249,MATCH(F$6,'مخزن 111'!$D$6:$I$6,0),0))","v":""},{"$f":"IF(COUNTIF('مخزن 111'!$D$7:$D$249,$E110)=0,\"\",VLOOKUP($E110,'مخزن 111'!$D$7:$I$249,MATCH(G$6,'مخزن 111'!$D$6:$I$6,0),0))","v":""},{"$f":"IF(COUNTIF('مخزن 111'!$D$7:$D$249,$E110)=0,\"\",VLOOKUP($E110,'مخزن 111'!$D$7:$I$249,MATCH(H$6,'مخزن 111'!$D$6:$I$6,0),0))","v":""},{"$f":"IF(COUNTIF('مخزن 111'!$D$7:$D$249,$E110)=0,\"\",VLOOKUP($E110,'مخزن 111'!$D$7:$I$249,MATCH(I$6,'مخزن 111'!$D$6:$I$6,0),0))","v":""},{"$f":"IF(COUNTIF('مخزن 111'!$D$7:$D$249,$E110)=0,\"\",VLOOKUP($E110,'مخزن 111'!$D$7:$I$249,MATCH(J$6,'مخزن 111'!$D$6:$I$6,0),0))","v":""}]
[null,null,null,{"$f":"IF($F111=\"\",\"\",MAX($D$6:D110)+1)","v":""},420102174,{"$f":"IF(COUNTIF('مخزن 111'!$D$7:$D$249,$E111)=0,\"\",VLOOKUP($E111,'مخزن 111'!$D$7:$I$249,MATCH(F$6,'مخزن 111'!$D$6:$I$6,0),0))","v":""},{"$f":"IF(COUNTIF('مخزن 111'!$D$7:$D$249,$E111)=0,\"\",VLOOKUP($E111,'مخزن 111'!$D$7:$I$249,MATCH(G$6,'مخزن 111'!$D$6:$I$6,0),0))","v":""},{"$f":"IF(COUNTIF('مخزن 111'!$D$7:$D$249,$E111)=0,\"\",VLOOKUP($E111,'مخزن 111'!$D$7:$I$249,MATCH(H$6,'مخزن 111'!$D$6:$I$6,0),0))","v":""},{"$f":"IF(COUNTIF('مخزن 111'!$D$7:$D$249,$E111)=0,\"\",VLOOKUP($E111,'مخزن 111'!$D$7:$I$249,MATCH(I$6,'مخزن 111'!$D$6:$I$6,0),0))","v":""},{"$f":"IF(COUNTIF('مخزن 111'!$D$7:$D$249,$E111)=0,\"\",VLOOKUP($E111,'مخزن 111'!$D$7:$I$249,MATCH(J$6,'مخزن 111'!$D$6:$I$6,0),0))","v":""}]
[null,null,null,{"$f":"IF($F112=\"\",\"\",MAX($D$6:D111)+1)","v":""},420103178,{"$f":"IF(COUNTIF('مخزن 111'!$D$7:$D$249,$E112)=0,\"\",VLOOKUP($E112,'مخزن 111'!$D$7:$I$249,MATCH(F$6,'مخزن 111'!$D$6:$I$6,0),0))","v":""},{"$f":"IF(COUNTIF('مخزن 111'!$D$7:$D$249,$E112)=0,\"\",VLOOKUP($E112,'مخزن 111'!$D$7:$I$249,MATCH(G$6,'مخزن 111'!$D$6:$I$6,0),0))","v":""},{"$f":"IF(COUNTIF('مخزن 111'!$D$7:$D$249,$E112)=0,\"\",VLOOKUP($E112,'مخزن 111'!$D$7:$I$249,MATCH(H$6,'مخزن 111'!$D$6:$I$6,0),0))","v":""},{"$f":"IF(COUNTIF('مخزن 111'!$D$7:$D$249,$E112)=0,\"\",VLOOKUP($E112,'مخزن 111'!$D$7:$I$249,MATCH(I$6,'مخزن 111'!$D$6:$I$6,0),0))","v":""},{"$f":"IF(COUNTIF('مخزن 111'!$D$7:$D$249,$E112)=0,\"\",VLOOKUP($E112,'مخزن 111'!$D$7:$I$249,MATCH(J$6,'مخزن 111'!$D$6:$I$6,0),0))","v":""}]
[null,null,null,{"$f":"IF($F113=\"\",\"\",MAX($D$6:D112)+1)","v":""},420201103,{"$f":"IF(COUNTIF('مخزن 111'!$D$7:$D$249,$E113)=0,\"\",VLOOKUP($E113,'مخزن 111'!$D$7:$I$249,MATCH(F$6,'مخزن 111'!$D$6:$I$6,0),0))","v":""},{"$f":"IF(COUNTIF('مخزن 111'!$D$7:$D$249,$E113)=0,\"\",VLOOKUP($E113,'مخزن 111'!$D$7:$I$249,MATCH(G$6,'مخزن 111'!$D$6:$I$6,0),0))","v":""},{"$f":"IF(COUNTIF('مخزن 111'!$D$7:$D$249,$E113)=0,\"\",VLOOKUP($E113,'مخزن 111'!$D$7:$I$249,MATCH(H$6,'مخزن 111'!$D$6:$I$6,0),0))","v":""},{"$f":"IF(COUNTIF('مخزن 111'!$D$7:$D$249,$E113)=0,\"\",VLOOKUP($E113,'مخزن 111'!$D$7:$I$249,MATCH(I$6,'مخزن 111'!$D$6:$I$6,0),0))","v":""},{"$f":"IF(COUNTIF('مخزن 111'!$D$7:$D$249,$E113)=0,\"\",VLOOKUP($E113,'مخزن 111'!$D$7:$I$249,MATCH(J$6,'مخزن 111'!$D$6:$I$6,0),0))","v":""}]
[null,null,null,{"$f":"IF($F114=\"\",\"\",MAX($D$6:D113)+1)","v":""},420201104,{"$f":"IF(COUNTIF('مخزن 111'!$D$7:$D$249,$E114)=0,\"\",VLOOKUP($E114,'مخزن 111'!$D$7:$I$249,MATCH(F$6,'مخزن 111'!$D$6:$I$6,0),0))","v":""},{"$f":"IF(COUNTIF('مخزن 111'!$D$7:$D$249,$E114)=0,\"\",VLOOKUP($E114,'مخزن 111'!$D$7:$I$249,MATCH(G$6,'مخزن 111'!$D$6:$I$6,0),0))","v":""},{"$f":"IF(COUNTIF('مخزن 111'!$D$7:$D$249,$E114)=0,\"\",VLOOKUP($E114,'مخزن 111'!$D$7:$I$249,MATCH(H$6,'مخزن 111'!$D$6:$I$6,0),0))","v":""},{"$f":"IF(COUNTIF('مخزن 111'!$D$7:$D$249,$E114)=0,\"\",VLOOKUP($E114,'مخزن 111'!$D$7:$I$249,MATCH(I$6,'مخزن 111'!$D$6:$I$6,0),0))","v":""},{"$f":"IF(COUNTIF('مخزن 111'!$D$7:$D$249,$E114)=0,\"\",VLOOKUP($E114,'مخزن 111'!$D$7:$I$249,MATCH(J$6,'مخزن 111'!$D$6:$I$6,0),0))","v":""}]
[null,null,null,{"$f":"IF($F115=\"\",\"\",MAX($D$6:D114)+1)","v":""},420201106,{"$f":"IF(COUNTIF('مخزن 111'!$D$7:$D$249,$E115)=0,\"\",VLOOKUP($E115,'مخزن 111'!$D$7:$I$249,MATCH(F$6,'مخزن 111'!$D$6:$I$6,0),0))","v":""},{"$f":"IF(COUNTIF('مخزن 111'!$D$7:$D$249,$E115)=0,\"\",VLOOKUP($E115,'مخزن 111'!$D$7:$I$249,MATCH(G$6,'مخزن 111'!$D$6:$I$6,0),0))","v":""},{"$f":"IF(COUNTIF('مخزن 111'!$D$7:$D$249,$E115)=0,\"\",VLOOKUP($E115,'مخزن 111'!$D$7:$I$249,MATCH(H$6,'مخزن 111'!$D$6:$I$6,0),0))","v":""},{"$f":"IF(COUNTIF('مخزن 111'!$D$7:$D$249,$E115)=0,\"\",VLOOKUP($E115,'مخزن 111'!$D$7:$I$249,MATCH(I$6,'مخزن 111'!$D$6:$I$6,0),0))","v":""},{"$f":"IF(COUNTIF('مخزن 111'!$D$7:$D$249,$E115)=0,\"\",VLOOKUP($E115,'مخزن 111'!$D$7:$I$249,MATCH(J$6,'مخزن 111'!$D$6:$I$6,0),0))","v":""}]
[null,null,null,{"$f":"IF($F116=\"\",\"\",MAX($D$6:D115)+1)","v":""},420201112,{"$f":"IF(COUNTIF('مخزن 111'!$D$7:$D$249,$E116)=0,\"\",VLOOKUP($E116,'مخزن 111'!$D$7:$I$249,MATCH(F$6,'مخزن 111'!$D$6:$I$6,0),0))","v":""},{"$f":"IF(COUNTIF('مخزن 111'!$D$7:$D$249,$E116)=0,\"\",VLOOKUP($E116,'مخزن 111'!$D$7:$I$249,MATCH(G$6,'مخزن 111'!$D$6:$I$6,0),0))","v":""},{"$f":"IF(COUNTIF('مخزن 111'!$D$7:$D$249,$E116)=0,\"\",VLOOKUP($E116,'مخزن 111'!$D$7:$I$249,MATCH(H$6,'مخزن 111'!$D$6:$I$6,0),0))","v":""},{"$f":"IF(COUNTIF('مخزن 111'!$D$7:$D$249,$E116)=0,\"\",VLOOKUP($E116,'مخزن 111'!$D$7:$I$249,MATCH(I$6,'مخزن 111'!$D$6:$I$6,0),0))","v":""},{"$f":"IF(COUNTIF('مخزن 111'!$D$7:$D$249,$E116)=0,\"\",VLOOKUP($E116,'مخزن 111'!$D$7:$I$249,MATCH(J$6,'مخزن 111'!$D$6:$I$6,0),0))","v":""}]
[null,null,null,{"$f":"IF($F117=\"\",\"\",MAX($D$6:D116)+1)","v":""},420201114,{"$f":"IF(COUNTIF('مخزن 111'!$D$7:$D$249,$E117)=0,\"\",VLOOKUP($E117,'مخزن 111'!$D$7:$I$249,MATCH(F$6,'مخزن 111'!$D$6:$I$6,0),0))","v":""},{"$f":"IF(COUNTIF('مخزن 111'!$D$7:$D$249,$E117)=0,\"\",VLOOKUP($E117,'مخزن 111'!$D$7:$I$249,MATCH(G$6,'مخزن 111'!$D$6:$I$6,0),0))","v":""},{"$f":"IF(COUNTIF('مخزن 111'!$D$7:$D$249,$E117)=0,\"\",VLOOKUP($E117,'مخزن 111'!$D$7:$I$249,MATCH(H$6,'مخزن 111'!$D$6:$I$6,0),0))","v":""},{"$f":"IF(COUNTIF('مخزن 111'!$D$7:$D$249,$E117)=0,\"\",VLOOKUP($E117,'مخزن 111'!$D$7:$I$249,MATCH(I$6,'مخزن 111'!$D$6:$I$6,0),0))","v":""},{"$f":"IF(COUNTIF('مخزن 111'!$D$7:$D$249,$E117)=0,\"\",VLOOKUP($E117,'مخزن 111'!$D$7:$I$249,MATCH(J$6,'مخزن 111'!$D$6:$I$6,0),0))","v":""}]
[null,null,null,{"$f":"IF($F118=\"\",\"\",MAX($D$6:D117)+1)","v":""},420202203,{"$f":"IF(COUNTIF('مخزن 111'!$D$7:$D$249,$E118)=0,\"\",VLOOKUP($E118,'مخزن 111'!$D$7:$I$249,MATCH(F$6,'مخزن 111'!$D$6:$I$6,0),0))","v":""},{"$f":"IF(COUNTIF('مخزن 111'!$D$7:$D$249,$E118)=0,\"\",VLOOKUP($E118,'مخزن 111'!$D$7:$I$249,MATCH(G$6,'مخزن 111'!$D$6:$I$6,0),0))","v":""},{"$f":"IF(COUNTIF('مخزن 111'!$D$7:$D$249,$E118)=0,\"\",VLOOKUP($E118,'مخزن 111'!$D$7:$I$249,MATCH(H$6,'مخزن 111'!$D$6:$I$6,0),0))","v":""},{"$f":"IF(COUNTIF('مخزن 111'!$D$7:$D$249,$E118)=0,\"\",VLOOKUP($E118,'مخزن 111'!$D$7:$I$249,MATCH(I$6,'مخزن 111'!$D$6:$I$6,0),0))","v":""},{"$f":"IF(COUNTIF('مخزن 111'!$D$7:$D$249,$E118)=0,\"\",VLOOKUP($E118,'مخزن 111'!$D$7:$I$249,MATCH(J$6,'مخزن 111'!$D$6:$I$6,0),0))","v":""}]
[null,null,null,{"$f":"IF($F119=\"\",\"\",MAX($D$6:D118)+1)","v":""},420202226,{"$f":"IF(COUNTIF('مخزن 111'!$D$7:$D$249,$E119)=0,\"\",VLOOKUP($E119,'مخزن 111'!$D$7:$I$249,MATCH(F$6,'مخزن 111'!$D$6:$I$6,0),0))","v":""},{"$f":"IF(COUNTIF('مخزن 111'!$D$7:$D$249,$E119)=0,\"\",VLOOKUP($E119,'مخزن 111'!$D$7:$I$249,MATCH(G$6,'مخزن 111'!$D$6:$I$6,0),0))","v":""},{"$f":"IF(COUNTIF('مخزن 111'!$D$7:$D$249,$E119)=0,\"\",VLOOKUP($E119,'مخزن 111'!$D$7:$I$249,MATCH(H$6,'مخزن 111'!$D$6:$I$6,0),0))","v":""},{"$f":"IF(COUNTIF('مخزن 111'!$D$7:$D$249,$E119)=0,\"\",VLOOKUP($E119,'مخزن 111'!$D$7:$I$249,MATCH(I$6,'مخزن 111'!$D$6:$I$6,0),0))","v":""},{"$f":"IF(COUNTIF('مخزن 111'!$D$7:$D$249,$E119)=0,\"\",VLOOKUP($E119,'مخزن 111'!$D$7:$I$249,MATCH(J$6,'مخزن 111'!$D$6:$I$6,0),0))","v":""}]
[null,null,null,{"$f":"IF($F120=\"\",\"\",MAX($D$6:D119)+1)","v":""},420301113,{"$f":"IF(COUNTIF('مخزن 111'!$D$7:$D$249,$E120)=0,\"\",VLOOKUP($E120,'مخزن 111'!$D$7:$I$249,MATCH(F$6,'مخزن 111'!$D$6:$I$6,0),0))","v":""},{"$f":"IF(COUNTIF('مخزن 111'!$D$7:$D$249,$E120)=0,\"\",VLOOKUP($E120,'مخزن 111'!$D$7:$I$249,MATCH(G$6,'مخزن 111'!$D$6:$I$6,0),0))","v":""},{"$f":"IF(COUNTIF('مخزن 111'!$D$7:$D$249,$E120)=0,\"\",VLOOKUP($E120,'مخزن 111'!$D$7:$I$249,MATCH(H$6,'مخزن 111'!$D$6:$I$6,0),0))","v":""},{"$f":"IF(COUNTIF('مخزن 111'!$D$7:$D$249,$E120)=0,\"\",VLOOKUP($E120,'مخزن 111'!$D$7:$I$249,MATCH(I$6,'مخزن 111'!$D$6:$I$6,0),0))","v":""},{"$f":"IF(COUNTIF('مخزن 111'!$D$7:$D$249,$E120)=0,\"\",VLOOKUP($E120,'مخزن 111'!$D$7:$I$249,MATCH(J$6,'مخزن 111'!$D$6:$I$6,0),0))","v":""}]
[null,null,null,{"$f":"IF($F121=\"\",\"\",MAX($D$6:D120)+1)","v":""},420301144,{"$f":"IF(COUNTIF('مخزن 111'!$D$7:$D$249,$E121)=0,\"\",VLOOKUP($E121,'مخزن 111'!$D$7:$I$249,MATCH(F$6,'مخزن 111'!$D$6:$I$6,0),0))","v":""},{"$f":"IF(COUNTIF('مخزن 111'!$D$7:$D$249,$E121)=0,\"\",VLOOKUP($E121,'مخزن 111'!$D$7:$I$249,MATCH(G$6,'مخزن 111'!$D$6:$I$6,0),0))","v":""},{"$f":"IF(COUNTIF('مخزن 111'!$D$7:$D$249,$E121)=0,\"\",VLOOKUP($E121,'مخزن 111'!$D$7:$I$249,MATCH(H$6,'مخزن 111'!$D$6:$I$6,0),0))","v":""},{"$f":"IF(COUNTIF('مخزن 111'!$D$7:$D$249,$E121)=0,\"\",VLOOKUP($E121,'مخزن 111'!$D$7:$I$249,MATCH(I$6,'مخزن 111'!$D$6:$I$6,0),0))","v":""},{"$f":"IF(COUNTIF('مخزن 111'!$D$7:$D$249,$E121)=0,\"\",VLOOKUP($E121,'مخزن 111'!$D$7:$I$249,MATCH(J$6,'مخزن 111'!$D$6:$I$6,0),0))","v":""}]
[null,null,null,{"$f":"IF($F122=\"\",\"\",MAX($D$6:D121)+1)","v":""},420401113,{"$f":"IF(COUNTIF('مخزن 111'!$D$7:$D$249,$E122)=0,\"\",VLOOKUP($E122,'مخزن 111'!$D$7:$I$249,MATCH(F$6,'مخزن 111'!$D$6:$I$6,0),0))","v":""},{"$f":"IF(COUNTIF('مخزن 111'!$D$7:$D$249,$E122)=0,\"\",VLOOKUP($E122,'مخزن 111'!$D$7:$I$249,MATCH(G$6,'مخزن 111'!$D$6:$I$6,0),0))","v":""},{"$f":"IF(COUNTIF('مخزن 111'!$D$7:$D$249,$E122)=0,\"\",VLOOKUP($E122,'مخزن 111'!$D$7:$I$249,MATCH(H$6,'مخزن 111'!$D$6:$I$6,0),0))","v":""},{"$f":"IF(COUNTIF('مخزن 111'!$D$7:$D$249,$E122)=0,\"\",VLOOKUP($E122,'مخزن 111'!$D$7:$I$249,MATCH(I$6,'مخزن 111'!$D$6:$I$6,0),0))","v":""},{"$f":"IF(COUNTIF('مخزن 111'!$D$7:$D$249,$E122)=0,\"\",VLOOKUP($E122,'مخزن 111'!$D$7:$I$249,MATCH(J$6,'مخزن 111'!$D$6:$I$6,0),0))","v":""}]
[null,null,null,{"$f":"IF($F123=\"\",\"\",MAX($D$6:D122)+1)","v":""},420401134,{"$f":"IF(COUNTIF('مخزن 111'!$D$7:$D$249,$E123)=0,\"\",VLOOKUP($E123,'مخزن 111'!$D$7:$I$249,MATCH(F$6,'مخزن 111'!$D$6:$I$6,0),0))","v":""},{"$f":"IF(COUNTIF('مخزن 111'!$D$7:$D$249,$E123)=0,\"\",VLOOKUP($E123,'مخزن 111'!$D$7:$I$249,MATCH(G$6,'مخزن 111'!$D$6:$I$6,0),0))","v":""},{"$f":"IF(COUNTIF('مخزن 111'!$D$7:$D$249,$E123)=0,\"\",VLOOKUP($E123,'مخزن 111'!$D$7:$I$249,MATCH(H$6,'مخزن 111'!$D$6:$I$6,0),0))","v":""},{"$f":"IF(COUNTIF('مخزن 111'!$D$7:$D$249,$E123)=0,\"\",VLOOKUP($E123,'مخزن 111'!$D$7:$I$249,MATCH(I$6,'مخزن 111'!$D$6:$I$6,0),0))","v":""},{"$f":"IF(COUNTIF('مخزن 111'!$D$7:$D$249,$E123)=0,\"\",VLOOKUP($E123,'مخزن 111'!$D$7:$I$249,MATCH(J$6,'مخزن 111'!$D$6:$I$6,0),0))","v":""}]
[null,null,null,{"$f":"IF($F124=\"\",\"\",MAX($D$6:D123)+1)","v":""},420401137,{"$f":"IF(COUNTIF('مخزن 111'!$D$7:$D$249,$E124)=0,\"\",VLOOKUP($E124,'مخزن 111'!$D$7:$I$249,MATCH(F$6,'مخزن 111'!$D$6:$I$6,0),0))","v":""},{"$f":"IF(COUNTIF('مخزن 111'!$D$7:$D$249,$E124)=0,\"\",VLOOKUP($E124,'مخزن 111'!$D$7:$I$249,MATCH(G$6,'مخزن 111'!$D$6:$I$6,0),0))","v":""},{"$f":"IF(COUNTIF('مخزن 111'!$D$7:$D$249,$E124)=0,\"\",VLOOKUP($E124,'مخزن 111'!$D$7:$I$249,MATCH(H$6,'مخزن 111'!$D$6:$I$6,0),0))","v":""},{"$f":"IF(COUNTIF('مخزن 111'!$D$7:$D$249,$E124)=0,\"\",VLOOKUP($E124,'مخزن 111'!$D$7:$I$249,MATCH(I$6,'مخزن 111'!$D$6:$I$6,0),0))","v":""},{"$f":"IF(COUNTIF('مخزن 111'!$D$7:$D$249,$E124)=0,\"\",VLOOKUP($E124,'مخزن 111'!$D$7:$I$249,MATCH(J$6,'مخزن 111'!$D$6:$I$6,0),0))","v":""}]
[null,null,null,{"$f":"IF($F125=\"\",\"\",MAX($D$6:D124)+1)","v":""},420401146,{"$f":"IF(COUNTIF('مخزن 111'!$D$7:$D$249,$E125)=0,\"\",VLOOKUP($E125,'مخزن 111'!$D$7:$I$249,MATCH(F$6,'مخزن 111'!$D$6:$I$6,0),0))","v":""},{"$f":"IF(COUNTIF('مخزن 111'!$D$7:$D$249,$E125)=0,\"\",VLOOKUP($E125,'مخزن 111'!$D$7:$I$249,MATCH(G$6,'مخزن 111'!$D$6:$I$6,0),0))","v":""},{"$f":"IF(COUNTIF('مخزن 111'!$D$7:$D$249,$E125)=0,\"\",VLOOKUP($E125,'مخزن 111'!$D$7:$I$249,MATCH(H$6,'مخزن 111'!$D$6:$I$6,0),0))","v":""},{"$f":"IF(COUNTIF('مخزن 111'!$D$7:$D$249,$E125)=0,\"\",VLOOKUP($E125,'مخزن 111'!$D$7:$I$249,MATCH(I$6,'مخزن 111'!$D$6:$I$6,0),0))","v":""},{"$f":"IF(COUNTIF('مخزن 111'!$D$7:$D$249,$E125)=0,\"\",VLOOKUP($E125,'مخزن 111'!$D$7:$I$249,MATCH(J$6,'مخزن 111'!$D$6:$I$6,0),0))","v":""}]
[null,null,null,{"$f":"IF($F126=\"\",\"\",MAX($D$6:D125)+1)","v":""},420401150,{"$f":"IF(COUNTIF('مخزن 111'!$D$7:$D$249,$E126)=0,\"\",VLOOKUP($E126,'مخزن 111'!$D$7:$I$249,MATCH(F$6,'مخزن 111'!$D$6:$I$6,0),0))","v":""},{"$f":"IF(COUNTIF('مخزن 111'!$D$7:$D$249,$E126)=0,\"\",VLOOKUP($E126,'مخزن 111'!$D$7:$I$249,MATCH(G$6,'مخزن 111'!$D$6:$I$6,0),0))","v":""},{"$f":"IF(COUNTIF('مخزن 111'!$D$7:$D$249,$E126)=0,\"\",VLOOKUP($E126,'مخزن 111'!$D$7:$I$249,MATCH(H$6,'مخزن 111'!$D$6:$I$6,0),0))","v":""},{"$f":"IF(COUNTIF('مخزن 111'!$D$7:$D$249,$E126)=0,\"\",VLOOKUP($E126,'مخزن 111'!$D$7:$I$249,MATCH(I$6,'مخزن 111'!$D$6:$I$6,0),0))","v":""},{"$f":"IF(COUNTIF('مخزن 111'!$D$7:$D$249,$E126)=0,\"\",VLOOKUP($E126,'مخزن 111'!$D$7:$I$249,MATCH(J$6,'مخزن 111'!$D$6:$I$6,0),0))","v":""}]
[null,null,null,{"$f":"IF($F127=\"\",\"\",MAX($D$6:D126)+1)","v":""},420403109,{"$f":"IF(COUNTIF('مخزن 111'!$D$7:$D$249,$E127)=0,\"\",VLOOKUP($E127,'مخزن 111'!$D$7:$I$249,MATCH(F$6,'مخزن 111'!$D$6:$I$6,0),0))","v":""},{"$f":"IF(COUNTIF('مخزن 111'!$D$7:$D$249,$E127)=0,\"\",VLOOKUP($E127,'مخزن 111'!$D$7:$I$249,MATCH(G$6,'مخزن 111'!$D$6:$I$6,0),0))","v":""},{"$f":"IF(COUNTIF('مخزن 111'!$D$7:$D$249,$E127)=0,\"\",VLOOKUP($E127,'مخزن 111'!$D$7:$I$249,MATCH(H$6,'مخزن 111'!$D$6:$I$6,0),0))","v":""},{"$f":"IF(COUNTIF('مخزن 111'!$D$7:$D$249,$E127)=0,\"\",VLOOKUP($E127,'مخزن 111'!$D$7:$I$249,MATCH(I$6,'مخزن 111'!$D$6:$I$6,0),0))","v":""},{"$f":"IF(COUNTIF('مخزن 111'!$D$7:$D$249,$E127)=0,\"\",VLOOKUP($E127,'مخزن 111'!$D$7:$I$249,MATCH(J$6,'مخزن 111'!$D$6:$I$6,0),0))","v":""}]
[null,null,null,{"$f":"IF($F128=\"\",\"\",MAX($D$6:D127)+1)","v":""},420404111,{"$f":"IF(COUNTIF('مخزن 111'!$D$7:$D$249,$E128)=0,\"\",VLOOKUP($E128,'مخزن 111'!$D$7:$I$249,MATCH(F$6,'مخزن 111'!$D$6:$I$6,0),0))","v":""},{"$f":"IF(COUNTIF('مخزن 111'!$D$7:$D$249,$E128)=0,\"\",VLOOKUP($E128,'مخزن 111'!$D$7:$I$249,MATCH(G$6,'مخزن 111'!$D$6:$I$6,0),0))","v":""},{"$f":"IF(COUNTIF('مخزن 111'!$D$7:$D$249,$E128)=0,\"\",VLOOKUP($E128,'مخزن 111'!$D$7:$I$249,MATCH(H$6,'مخزن 111'!$D$6:$I$6,0),0))","v":""},{"$f":"IF(COUNTIF('مخزن 111'!$D$7:$D$249,$E128)=0,\"\",VLOOKUP($E128,'مخزن 111'!$D$7:$I$249,MATCH(I$6,'مخزن 111'!$D$6:$I$6,0),0))","v":""},{"$f":"IF(COUNTIF('مخزن 111'!$D$7:$D$249,$E128)=0,\"\",VLOOKUP($E128,'مخزن 111'!$D$7:$I$249,MATCH(J$6,'مخزن 111'!$D$6:$I$6,0),0))","v":""}]
[null,null,null,{"$f":"IF($F129=\"\",\"\",MAX($D$6:D128)+1)","v":""},420404122,{"$f":"IF(COUNTIF('مخزن 111'!$D$7:$D$249,$E129)=0,\"\",VLOOKUP($E129,'مخزن 111'!$D$7:$I$249,MATCH(F$6,'مخزن 111'!$D$6:$I$6,0),0))","v":""},{"$f":"IF(COUNTIF('مخزن 111'!$D$7:$D$249,$E129)=0,\"\",VLOOKUP($E129,'مخزن 111'!$D$7:$I$249,MATCH(G$6,'مخزن 111'!$D$6:$I$6,0),0))","v":""},{"$f":"IF(COUNTIF('مخزن 111'!$D$7:$D$249,$E129)=0,\"\",VLOOKUP($E129,'مخزن 111'!$D$7:$I$249,MATCH(H$6,'مخزن 111'!$D$6:$I$6,0),0))","v":""},{"$f":"IF(COUNTIF('مخزن 111'!$D$7:$D$249,$E129)=0,\"\",VLOOKUP($E129,'مخزن 111'!$D$7:$I$249,MATCH(I$6,'مخزن 111'!$D$6:$I$6,0),0))","v":""},{"$f":"IF(COUNTIF('مخزن 111'!$D$7:$D$249,$E129)=0,\"\",VLOOKUP($E129,'مخزن 111'!$D$7:$I$249,MATCH(J$6,'مخزن 111'!$D$6:$I$6,0),0))","v":""}]
[null,null,null,{"$f":"IF($F130=\"\",\"\",MAX($D$6:D129)+1)","v":""},420405101,{"$f":"IF(COUNTIF('مخزن 111'!$D$7:$D$249,$E130)=0,\"\",VLOOKUP($E130,'مخزن 111'!$D$7:$I$249,MATCH(F$6,'مخزن 111'!$D$6:$I$6,0),0))","v":""},{"$f":"IF(COUNTIF('مخزن 111'!$D$7:$D$249,$E130)=0,\"\",VLOOKUP($E130,'مخزن 111'!$D$7:$I$249,MATCH(G$6,'مخزن 111'!$D$6:$I$6,0),0))","v":""},{"$f":"IF(COUNTIF('مخزن 111'!$D$7:$D$249,$E130)=0,\"\",VLOOKUP($E130,'مخزن 111'!$D$7:$I$249,MATCH(H$6,'مخزن 111'!$D$6:$I$6,0),0))","v":""},{"$f":"IF(COUNTIF('مخزن 111'!$D$7:$D$249,$E130)=0,\"\",VLOOKUP($E130,'مخزن 111'!$D$7:$I$249,MATCH(I$6,'مخزن 111'!$D$6:$I$6,0),0))","v":""},{"$f":"IF(COUNTIF('مخزن 111'!$D$7:$D$249,$E130)=0,\"\",VLOOKUP($E130,'مخزن 111'!$D$7:$I$249,MATCH(J$6,'مخزن 111'!$D$6:$I$6,0),0))","v":""}]
[null,null,null,{"$f":"IF($F131=\"\",\"\",MAX($D$6:D130)+1)","v":""},420901103,{"$f":"IF(COUNTIF('مخزن 111'!$D$7:$D$249,$E131)=0,\"\",VLOOKUP($E131,'مخزن 111'!$D$7:$I$249,MATCH(F$6,'مخزن 111'!$D$6:$I$6,0),0))","v":""},{"$f":"IF(COUNTIF('مخزن 111'!$D$7:$D$249,$E131)=0,\"\",VLOOKUP($E131,'مخزن 111'!$D$7:$I$249,MATCH(G$6,'مخزن 111'!$D$6:$I$6,0),0))","v":""},{"$f":"IF(COUNTIF('مخزن 111'!$D$7:$D$249,$E131)=0,\"\",VLOOKUP($E131,'مخزن 111'!$D$7:$I$249,MATCH(H$6,'مخزن 111'!$D$6:$I$6,0),0))","v":""},{"$f":"IF(COUNTIF('مخزن 111'!$D$7:$D$249,$E131)=0,\"\",VLOOKUP($E131,'مخزن 111'!$D$7:$I$249,MATCH(I$6,'مخزن 111'!$D$6:$I$6,0),0))","v":""},{"$f":"IF(COUNTIF('مخزن 111'!$D$7:$D$249,$E131)=0,\"\",VLOOKUP($E131,'مخزن 111'!$D$7:$I$249,MATCH(J$6,'مخزن 111'!$D$6:$I$6,0),0))","v":""}]
[null,null,null,{"$f":"IF($F132=\"\",\"\",MAX($D$6:D131)+1)","v":""},520402106,{"$f":"IF(COUNTIF('مخزن 111'!$D$7:$D$249,$E132)=0,\"\",VLOOKUP($E132,'مخزن 111'!$D$7:$I$249,MATCH(F$6,'مخزن 111'!$D$6:$I$6,0),0))","v":""},{"$f":"IF(COUNTIF('مخزن 111'!$D$7:$D$249,$E132)=0,\"\",VLOOKUP($E132,'مخزن 111'!$D$7:$I$249,MATCH(G$6,'مخزن 111'!$D$6:$I$6,0),0))","v":""},{"$f":"IF(COUNTIF('مخزن 111'!$D$7:$D$249,$E132)=0,\"\",VLOOKUP($E132,'مخزن 111'!$D$7:$I$249,MATCH(H$6,'مخزن 111'!$D$6:$I$6,0),0))","v":""},{"$f":"IF(COUNTIF('مخزن 111'!$D$7:$D$249,$E132)=0,\"\",VLOOKUP($E132,'مخزن 111'!$D$7:$I$249,MATCH(I$6,'مخزن 111'!$D$6:$I$6,0),0))","v":""},{"$f":"IF(COUNTIF('مخزن 111'!$D$7:$D$249,$E132)=0,\"\",VLOOKUP($E132,'مخزن 111'!$D$7:$I$249,MATCH(J$6,'مخزن 111'!$D$6:$I$6,0),0))","v":""}]
[null,null,null,{"$f":"IF($F133=\"\",\"\",MAX($D$6:D132)+1)","v":""},520402108,{"$f":"IF(COUNTIF('مخزن 111'!$D$7:$D$249,$E133)=0,\"\",VLOOKUP($E133,'مخزن 111'!$D$7:$I$249,MATCH(F$6,'مخزن 111'!$D$6:$I$6,0),0))","v":""},{"$f":"IF(COUNTIF('مخزن 111'!$D$7:$D$249,$E133)=0,\"\",VLOOKUP($E133,'مخزن 111'!$D$7:$I$249,MATCH(G$6,'مخزن 111'!$D$6:$I$6,0),0))","v":""},{"$f":"IF(COUNTIF('مخزن 111'!$D$7:$D$249,$E133)=0,\"\",VLOOKUP($E133,'مخزن 111'!$D$7:$I$249,MATCH(H$6,'مخزن 111'!$D$6:$I$6,0),0))","v":""},{"$f":"IF(COUNTIF('مخزن 111'!$D$7:$D$249,$E133)=0,\"\",VLOOKUP($E133,'مخزن 111'!$D$7:$I$249,MATCH(I$6,'مخزن 111'!$D$6:$I$6,0),0))","v":""},{"$f":"IF(COUNTIF('مخزن 111'!$D$7:$D$249,$E133)=0,\"\",VLOOKUP($E133,'مخزن 111'!$D$7:$I$249,MATCH(J$6,'مخزن 111'!$D$6:$I$6,0),0))","v":""}]
[null,null,null,{"$f":"IF($F134=\"\",\"\",MAX($D$6:D133)+1)","v":""},520402115,{"$f":"IF(COUNTIF('مخزن 111'!$D$7:$D$249,$E134)=0,\"\",VLOOKUP($E134,'مخزن 111'!$D$7:$I$249,MATCH(F$6,'مخزن 111'!$D$6:$I$6,0),0))","v":""},{"$f":"IF(COUNTIF('مخزن 111'!$D$7:$D$249,$E134)=0,\"\",VLOOKUP($E134,'مخزن 111'!$D$7:$I$249,MATCH(G$6,'مخزن 111'!$D$6:$I$6,0),0))","v":""},{"$f":"IF(COUNTIF('مخزن 111'!$D$7:$D$249,$E134)=0,\"\",VLOOKUP($E134,'مخزن 111'!$D$7:$I$249,MATCH(H$6,'مخزن 111'!$D$6:$I$6,0),0))","v":""},{"$f":"IF(COUNTIF('مخزن 111'!$D$7:$D$249,$E134)=0,\"\",VLOOKUP($E134,'مخزن 111'!$D$7:$I$249,MATCH(I$6,'مخزن 111'!$D$6:$I$6,0),0))","v":""},{"$f":"IF(COUNTIF('مخزن 111'!$D$7:$D$249,$E134)=0,\"\",VLOOKUP($E134,'مخزن 111'!$D$7:$I$249,MATCH(J$6,'مخزن 111'!$D$6:$I$6,0),0))","v":""}]
[null,null,null,{"$f":"IF($F135=\"\",\"\",MAX($D$6:D134)+1)","v":""},520402116,{"$f":"IF(COUNTIF('مخزن 111'!$D$7:$D$249,$E135)=0,\"\",VLOOKUP($E135,'مخزن 111'!$D$7:$I$249,MATCH(F$6,'مخزن 111'!$D$6:$I$6,0),0))","v":""},{"$f":"IF(COUNTIF('مخزن 111'!$D$7:$D$249,$E135)=0,\"\",VLOOKUP($E135,'مخزن 111'!$D$7:$I$249,MATCH(G$6,'مخزن 111'!$D$6:$I$6,0),0))","v":""},{"$f":"IF(COUNTIF('مخزن 111'!$D$7:$D$249,$E135)=0,\"\",VLOOKUP($E135,'مخزن 111'!$D$7:$I$249,MATCH(H$6,'مخزن 111'!$D$6:$I$6,0),0))","v":""},{"$f":"IF(COUNTIF('مخزن 111'!$D$7:$D$249,$E135)=0,\"\",VLOOKUP($E135,'مخزن 111'!$D$7:$I$249,MATCH(I$6,'مخزن 111'!$D$6:$I$6,0),0))","v":""},{"$f":"IF(COUNTIF('مخزن 111'!$D$7:$D$249,$E135)=0,\"\",VLOOKUP($E135,'مخزن 111'!$D$7:$I$249,MATCH(J$6,'مخزن 111'!$D$6:$I$6,0),0))","v":""}]
[null,null,null,{"$f":"IF($F136=\"\",\"\",MAX($D$6:D135)+1)","v":""},520402122,{"$f":"IF(COUNTIF('مخزن 111'!$D$7:$D$249,$E136)=0,\"\",VLOOKUP($E136,'مخزن 111'!$D$7:$I$249,MATCH(F$6,'مخزن 111'!$D$6:$I$6,0),0))","v":""},{"$f":"IF(COUNTIF('مخزن 111'!$D$7:$D$249,$E136)=0,\"\",VLOOKUP($E136,'مخزن 111'!$D$7:$I$249,MATCH(G$6,'مخزن 111'!$D$6:$I$6,0),0))","v":""},{"$f":"IF(COUNTIF('مخزن 111'!$D$7:$D$249,$E136)=0,\"\",VLOOKUP($E136,'مخزن 111'!$D$7:$I$249,MATCH(H$6,'مخزن 111'!$D$6:$I$6,0),0))","v":""},{"$f":"IF(COUNTIF('مخزن 111'!$D$7:$D$249,$E136)=0,\"\",VLOOKUP($E136,'مخزن 111'!$D$7:$I$249,MATCH(I$6,'مخزن 111'!$D$6:$I$6,0),0))","v":""},{"$f":"IF(COUNTIF('مخزن 111'!$D$7:$D$249,$E136)=0,\"\",VLOOKUP($E136,'مخزن 111'!$D$7:$I$249,MATCH(J$6,'مخزن 111'!$D$6:$I$6,0),0))","v":""}]
[null,null,null,{"$f":"IF($F137=\"\",\"\",MAX($D$6:D136)+1)","v":""},520402126,{"$f":"IF(COUNTIF('مخزن 111'!$D$7:$D$249,$E137)=0,\"\",VLOOKUP($E137,'مخزن 111'!$D$7:$I$249,MATCH(F$6,'مخزن 111'!$D$6:$I$6,0),0))","v":""},{"$f":"IF(COUNTIF('مخزن 111'!$D$7:$D$249,$E137)=0,\"\",VLOOKUP($E137,'مخزن 111'!$D$7:$I$249,MATCH(G$6,'مخزن 111'!$D$6:$I$6,0),0))","v":""},{"$f":"IF(COUNTIF('مخزن 111'!$D$7:$D$249,$E137)=0,\"\",VLOOKUP($E137,'مخزن 111'!$D$7:$I$249,MATCH(H$6,'مخزن 111'!$D$6:$I$6,0),0))","v":""},{"$f":"IF(COUNTIF('مخزن 111'!$D$7:$D$249,$E137)=0,\"\",VLOOKUP($E137,'مخزن 111'!$D$7:$I$249,MATCH(I$6,'مخزن 111'!$D$6:$I$6,0),0))","v":""},{"$f":"IF(COUNTIF('مخزن 111'!$D$7:$D$249,$E137)=0,\"\",VLOOKUP($E137,'مخزن 111'!$D$7:$I$249,MATCH(J$6,'مخزن 111'!$D$6:$I$6,0),0))","v":""}]
[null,null,null,{"$f":"IF($F138=\"\",\"\",MAX($D$6:D137)+1)","v":""},520402127,{"$f":"IF(COUNTIF('مخزن 111'!$D$7:$D$249,$E138)=0,\"\",VLOOKUP($E138,'مخزن 111'!$D$7:$I$249,MATCH(F$6,'مخزن 111'!$D$6:$I$6,0),0))","v":""},{"$f":"IF(COUNTIF('مخزن 111'!$D$7:$D$249,$E138)=0,\"\",VLOOKUP($E138,'مخزن 111'!$D$7:$I$249,MATCH(G$6,'مخزن 111'!$D$6:$I$6,0),0))","v":""},{"$f":"IF(COUNTIF('مخزن 111'!$D$7:$D$249,$E138)=0,\"\",VLOOKUP($E138,'مخزن 111'!$D$7:$I$249,MATCH(H$6,'مخزن 111'!$D$6:$I$6,0),0))","v":""},{"$f":"IF(COUNTIF('مخزن 111'!$D$7:$D$249,$E138)=0,\"\",VLOOKUP($E138,'مخزن 111'!$D$7:$I$249,MATCH(I$6,'مخزن 111'!$D$6:$I$6,0),0))","v":""},{"$f":"IF(COUNTIF('مخزن 111'!$D$7:$D$249,$E138)=0,\"\",VLOOKUP($E138,'مخزن 111'!$D$7:$I$249,MATCH(J$6,'مخزن 111'!$D$6:$I$6,0),0))","v":""}]
[null,null,null,{"$f":"IF($F139=\"\",\"\",MAX($D$6:D138)+1)","v":""},520402128,{"$f":"IF(COUNTIF('مخزن 111'!$D$7:$D$249,$E139)=0,\"\",VLOOKUP($E139,'مخزن 111'!$D$7:$I$249,MATCH(F$6,'مخزن 111'!$D$6:$I$6,0),0))","v":""},{"$f":"IF(COUNTIF('مخزن 111'!$D$7:$D$249,$E139)=0,\"\",VLOOKUP($E139,'مخزن 111'!$D$7:$I$249,MATCH(G$6,'مخزن 111'!$D$6:$I$6,0),0))","v":""},{"$f":"IF(COUNTIF('مخزن 111'!$D$7:$D$249,$E139)=0,\"\",VLOOKUP($E139,'مخزن 111'!$D$7:$I$249,MATCH(H$6,'مخزن 111'!$D$6:$I$6,0),0))","v":""},{"$f":"IF(COUNTIF('مخزن 111'!$D$7:$D$249,$E139)=0,\"\",VLOOKUP($E139,'مخزن 111'!$D$7:$I$249,MATCH(I$6,'مخزن 111'!$D$6:$I$6,0),0))","v":""},{"$f":"IF(COUNTIF('مخزن 111'!$D$7:$D$249,$E139)=0,\"\",VLOOKUP($E139,'مخزن 111'!$D$7:$I$249,MATCH(J$6,'مخزن 111'!$D$6:$I$6,0),0))","v":""}]
[null,null,null,{"$f":"IF($F140=\"\",\"\",MAX($D$6:D139)+1)","v":""},520402129,{"$f":"IF(COUNTIF('مخزن 111'!$D$7:$D$249,$E140)=0,\"\",VLOOKUP($E140,'مخزن 111'!$D$7:$I$249,MATCH(F$6,'مخزن 111'!$D$6:$I$6,0),0))","v":""},{"$f":"IF(COUNTIF('مخزن 111'!$D$7:$D$249,$E140)=0,\"\",VLOOKUP($E140,'مخزن 111'!$D$7:$I$249,MATCH(G$6,'مخزن 111'!$D$6:$I$6,0),0))","v":""},{"$f":"IF(COUNTIF('مخزن 111'!$D$7:$D$249,$E140)=0,\"\",VLOOKUP($E140,'مخزن 111'!$D$7:$I$249,MATCH(H$6,'مخزن 111'!$D$6:$I$6,0),0))","v":""},{"$f":"IF(COUNTIF('مخزن 111'!$D$7:$D$249,$E140)=0,\"\",VLOOKUP($E140,'مخزن 111'!$D$7:$I$249,MATCH(I$6,'مخزن 111'!$D$6:$I$6,0),0))","v":""},{"$f":"IF(COUNTIF('مخزن 111'!$D$7:$D$249,$E140)=0,\"\",VLOOKUP($E140,'مخزن 111'!$D$7:$I$249,MATCH(J$6,'مخزن 111'!$D$6:$I$6,0),0))","v":""}]
[null,null,null,{"$f":"IF($F141=\"\",\"\",MAX($D$6:D140)+1)","v":""},520402130,{"$f":"IF(COUNTIF('مخزن 111'!$D$7:$D$249,$E141)=0,\"\",VLOOKUP($E141,'مخزن 111'!$D$7:$I$249,MATCH(F$6,'مخزن 111'!$D$6:$I$6,0),0))","v":""},{"$f":"IF(COUNTIF('مخزن 111'!$D$7:$D$249,$E141)=0,\"\",VLOOKUP($E141,'مخزن 111'!$D$7:$I$249,MATCH(G$6,'مخزن 111'!$D$6:$I$6,0),0))","v":""},{"$f":"IF(COUNTIF('مخزن 111'!$D$7:$D$249,$E141)=0,\"\",VLOOKUP($E141,'مخزن 111'!$D$7:$I$249,MATCH(H$6,'مخزن 111'!$D$6:$I$6,0),0))","v":""},{"$f":"IF(COUNTIF('مخزن 111'!$D$7:$D$249,$E141)=0,\"\",VLOOKUP($E141,'مخزن 111'!$D$7:$I$249,MATCH(I$6,'مخزن 111'!$D$6:$I$6,0),0))","v":""},{"$f":"IF(COUNTIF('مخزن 111'!$D$7:$D$249,$E141)=0,\"\",VLOOKUP($E141,'مخزن 111'!$D$7:$I$249,MATCH(J$6,'مخزن 111'!$D$6:$I$6,0),0))","v":""}]
[null,null,null,{"$f":"IF($F142=\"\",\"\",MAX($D$6:D141)+1)","v":""},520503102,{"$f":"IF(COUNTIF('مخزن 111'!$D$7:$D$249,$E142)=0,\"\",VLOOKUP($E142,'مخزن 111'!$D$7:$I$249,MATCH(F$6,'مخزن 111'!$D$6:$I$6,0),0))","v":""},{"$f":"IF(COUNTIF('مخزن 111'!$D$7:$D$249,$E142)=0,\"\",VLOOKUP($E142,'مخزن 111'!$D$7:$I$249,MATCH(G$6,'مخزن 111'!$D$6:$I$6,0),0))","v":""},{"$f":"IF(COUNTIF('مخزن 111'!$D$7:$D$249,$E142)=0,\"\",VLOOKUP($E142,'مخزن 111'!$D$7:$I$249,MATCH(H$6,'مخزن 111'!$D$6:$I$6,0),0))","v":""},{"$f":"IF(COUNTIF('مخزن 111'!$D$7:$D$249,$E142)=0,\"\",VLOOKUP($E142,'مخزن 111'!$D$7:$I$249,MATCH(I$6,'مخزن 111'!$D$6:$I$6,0),0))","v":""},{"$f":"IF(COUNTIF('مخزن 111'!$D$7:$D$249,$E142)=0,\"\",VLOOKUP($E142,'مخزن 111'!$D$7:$I$249,MATCH(J$6,'مخزن 111'!$D$6:$I$6,0),0))","v":""}]
[null,null,null,{"$f":"IF($F143=\"\",\"\",MAX($D$6:D142)+1)","v":""},520505112,{"$f":"IF(COUNTIF('مخزن 111'!$D$7:$D$249,$E143)=0,\"\",VLOOKUP($E143,'مخزن 111'!$D$7:$I$249,MATCH(F$6,'مخزن 111'!$D$6:$I$6,0),0))","v":""},{"$f":"IF(COUNTIF('مخزن 111'!$D$7:$D$249,$E143)=0,\"\",VLOOKUP($E143,'مخزن 111'!$D$7:$I$249,MATCH(G$6,'مخزن 111'!$D$6:$I$6,0),0))","v":""},{"$f":"IF(COUNTIF('مخزن 111'!$D$7:$D$249,$E143)=0,\"\",VLOOKUP($E143,'مخزن 111'!$D$7:$I$249,MATCH(H$6,'مخزن 111'!$D$6:$I$6,0),0))","v":""},{"$f":"IF(COUNTIF('مخزن 111'!$D$7:$D$249,$E143)=0,\"\",VLOOKUP($E143,'مخزن 111'!$D$7:$I$249,MATCH(I$6,'مخزن 111'!$D$6:$I$6,0),0))","v":""},{"$f":"IF(COUNTIF('مخزن 111'!$D$7:$D$249,$E143)=0,\"\",VLOOKUP($E143,'مخزن 111'!$D$7:$I$249,MATCH(J$6,'مخزن 111'!$D$6:$I$6,0),0))","v":""}]
[null,null,null,{"$f":"IF($F144=\"\",\"\",MAX($D$6:D143)+1)","v":""},520506103,{"$f":"IF(COUNTIF('مخزن 111'!$D$7:$D$249,$E144)=0,\"\",VLOOKUP($E144,'مخزن 111'!$D$7:$I$249,MATCH(F$6,'مخزن 111'!$D$6:$I$6,0),0))","v":""},{"$f":"IF(COUNTIF('مخزن 111'!$D$7:$D$249,$E144)=0,\"\",VLOOKUP($E144,'مخزن 111'!$D$7:$I$249,MATCH(G$6,'مخزن 111'!$D$6:$I$6,0),0))","v":""},{"$f":"IF(COUNTIF('مخزن 111'!$D$7:$D$249,$E144)=0,\"\",VLOOKUP($E144,'مخزن 111'!$D$7:$I$249,MATCH(H$6,'مخزن 111'!$D$6:$I$6,0),0))","v":""},{"$f":"IF(COUNTIF('مخزن 111'!$D$7:$D$249,$E144)=0,\"\",VLOOKUP($E144,'مخزن 111'!$D$7:$I$249,MATCH(I$6,'مخزن 111'!$D$6:$I$6,0),0))","v":""},{"$f":"IF(COUNTIF('مخزن 111'!$D$7:$D$249,$E144)=0,\"\",VLOOKUP($E144,'مخزن 111'!$D$7:$I$249,MATCH(J$6,'مخزن 111'!$D$6:$I$6,0),0))","v":""}]
[null,null,null,{"$f":"IF($F145=\"\",\"\",MAX($D$6:D144)+1)","v":""},520506105,{"$f":"IF(COUNTIF('مخزن 111'!$D$7:$D$249,$E145)=0,\"\",VLOOKUP($E145,'مخزن 111'!$D$7:$I$249,MATCH(F$6,'مخزن 111'!$D$6:$I$6,0),0))","v":""},{"$f":"IF(COUNTIF('مخزن 111'!$D$7:$D$249,$E145)=0,\"\",VLOOKUP($E145,'مخزن 111'!$D$7:$I$249,MATCH(G$6,'مخزن 111'!$D$6:$I$6,0),0))","v":""},{"$f":"IF(COUNTIF('مخزن 111'!$D$7:$D$249,$E145)=0,\"\",VLOOKUP($E145,'مخزن 111'!$D$7:$I$249,MATCH(H$6,'مخزن 111'!$D$6:$I$6,0),0))","v":""},{"$f":"IF(COUNTIF('مخزن 111'!$D$7:$D$249,$E145)=0,\"\",VLOOKUP($E145,'مخزن 111'!$D$7:$I$249,MATCH(I$6,'مخزن 111'!$D$6:$I$6,0),0))","v":""},{"$f":"IF(COUNTIF('مخزن 111'!$D$7:$D$249,$E145)=0,\"\",VLOOKUP($E145,'مخزن 111'!$D$7:$I$249,MATCH(J$6,'مخزن 111'!$D$6:$I$6,0),0))","v":""}]
[null,null,null,{"$f":"IF($F146=\"\",\"\",MAX($D$6:D145)+1)","v":""},520506119,{"$f":"IF(COUNTIF('مخزن 111'!$D$7:$D$249,$E146)=0,\"\",VLOOKUP($E146,'مخزن 111'!$D$7:$I$249,MATCH(F$6,'مخزن 111'!$D$6:$I$6,0),0))","v":""},{"$f":"IF(COUNTIF('مخزن 111'!$D$7:$D$249,$E146)=0,\"\",VLOOKUP($E146,'مخزن 111'!$D$7:$I$249,MATCH(G$6,'مخزن 111'!$D$6:$I$6,0),0))","v":""},{"$f":"IF(COUNTIF('مخزن 111'!$D$7:$D$249,$E146)=0,\"\",VLOOKUP($E146,'مخزن 111'!$D$7:$I$249,MATCH(H$6,'مخزن 111'!$D$6:$I$6,0),0))","v":""},{"$f":"IF(COUNTIF('مخزن 111'!$D$7:$D$249,$E146)=0,\"\",VLOOKUP($E146,'مخزن 111'!$D$7:$I$249,MATCH(I$6,'مخزن 111'!$D$6:$I$6,0),0))","v":""},{"$f":"IF(COUNTIF('مخزن 111'!$D$7:$D$249,$E146)=0,\"\",VLOOKUP($E146,'مخزن 111'!$D$7:$I$249,MATCH(J$6,'مخزن 111'!$D$6:$I$6,0),0))","v":""}]
[null,null,null,{"$f":"IF($F147=\"\",\"\",MAX($D$6:D146)+1)","v":""},520506120,{"$f":"IF(COUNTIF('مخزن 111'!$D$7:$D$249,$E147)=0,\"\",VLOOKUP($E147,'مخزن 111'!$D$7:$I$249,MATCH(F$6,'مخزن 111'!$D$6:$I$6,0),0))","v":""},{"$f":"IF(COUNTIF('مخزن 111'!$D$7:$D$249,$E147)=0,\"\",VLOOKUP($E147,'مخزن 111'!$D$7:$I$249,MATCH(G$6,'مخزن 111'!$D$6:$I$6,0),0))","v":""},{"$f":"IF(COUNTIF('مخزن 111'!$D$7:$D$249,$E147)=0,\"\",VLOOKUP($E147,'مخزن 111'!$D$7:$I$249,MATCH(H$6,'مخزن 111'!$D$6:$I$6,0),0))","v":""},{"$f":"IF(COUNTIF('مخزن 111'!$D$7:$D$249,$E147)=0,\"\",VLOOKUP($E147,'مخزن 111'!$D$7:$I$249,MATCH(I$6,'مخزن 111'!$D$6:$I$6,0),0))","v":""},{"$f":"IF(COUNTIF('مخزن 111'!$D$7:$D$249,$E147)=0,\"\",VLOOKUP($E147,'مخزن 111'!$D$7:$I$249,MATCH(J$6,'مخزن 111'!$D$6:$I$6,0),0))","v":""}]
[null,null,null,{"$f":"IF($F148=\"\",\"\",MAX($D$6:D147)+1)","v":""},520506141,{"$f":"IF(COUNTIF('مخزن 111'!$D$7:$D$249,$E148)=0,\"\",VLOOKUP($E148,'مخزن 111'!$D$7:$I$249,MATCH(F$6,'مخزن 111'!$D$6:$I$6,0),0))","v":""},{"$f":"IF(COUNTIF('مخزن 111'!$D$7:$D$249,$E148)=0,\"\",VLOOKUP($E148,'مخزن 111'!$D$7:$I$249,MATCH(G$6,'مخزن 111'!$D$6:$I$6,0),0))","v":""},{"$f":"IF(COUNTIF('مخزن 111'!$D$7:$D$249,$E148)=0,\"\",VLOOKUP($E148,'مخزن 111'!$D$7:$I$249,MATCH(H$6,'مخزن 111'!$D$6:$I$6,0),0))","v":""},{"$f":"IF(COUNTIF('مخزن 111'!$D$7:$D$249,$E148)=0,\"\",VLOOKUP($E148,'مخزن 111'!$D$7:$I$249,MATCH(I$6,'مخزن 111'!$D$6:$I$6,0),0))","v":""},{"$f":"IF(COUNTIF('مخزن 111'!$D$7:$D$249,$E148)=0,\"\",VLOOKUP($E148,'مخزن 111'!$D$7:$I$249,MATCH(J$6,'مخزن 111'!$D$6:$I$6,0),0))","v":""}]
[null,null,null,{"$f":"IF($F149=\"\",\"\",MAX($D$6:D148)+1)","v":""},520506144,{"$f":"IF(COUNTIF('مخزن 111'!$D$7:$D$249,$E149)=0,\"\",VLOOKUP($E149,'مخزن 111'!$D$7:$I$249,MATCH(F$6,'مخزن 111'!$D$6:$I$6,0),0))","v":""},{"$f":"IF(COUNTIF('مخزن 111'!$D$7:$D$249,$E149)=0,\"\",VLOOKUP($E149,'مخزن 111'!$D$7:$I$249,MATCH(G$6,'مخزن 111'!$D$6:$I$6,0),0))","v":""},{"$f":"IF(COUNTIF('مخزن 111'!$D$7:$D$249,$E149)=0,\"\",VLOOKUP($E149,'مخزن 111'!$D$7:$I$249,MATCH(H$6,'مخزن 111'!$D$6:$I$6,0),0))","v":""},{"$f":"IF(COUNTIF('مخزن 111'!$D$7:$D$249,$E149)=0,\"\",VLOOKUP($E149,'مخزن 111'!$D$7:$I$249,MATCH(I$6,'مخزن 111'!$D$6:$I$6,0),0))","v":""},{"$f":"IF(COUNTIF('مخزن 111'!$D$7:$D$249,$E149)=0,\"\",VLOOKUP($E149,'مخزن 111'!$D$7:$I$249,MATCH(J$6,'مخزن 111'!$D$6:$I$6,0),0))","v":""}]
[null,null,null,{"$f":"IF($F150=\"\",\"\",MAX($D$6:D149)+1)","v":""},520506168,{"$f":"IF(COUNTIF('مخزن 111'!$D$7:$D$249,$E150)=0,\"\",VLOOKUP($E150,'مخزن 111'!$D$7:$I$249,MATCH(F$6,'مخزن 111'!$D$6:$I$6,0),0))","v":""},{"$f":"IF(COUNTIF('مخزن 111'!$D$7:$D$249,$E150)=0,\"\",VLOOKUP($E150,'مخزن 111'!$D$7:$I$249,MATCH(G$6,'مخزن 111'!$D$6:$I$6,0),0))","v":""},{"$f":"IF(COUNTIF('مخزن 111'!$D$7:$D$249,$E150)=0,\"\",VLOOKUP($E150,'مخزن 111'!$D$7:$I$249,MATCH(H$6,'مخزن 111'!$D$6:$I$6,0),0))","v":""},{"$f":"IF(COUNTIF('مخزن 111'!$D$7:$D$249,$E150)=0,\"\",VLOOKUP($E150,'مخزن 111'!$D$7:$I$249,MATCH(I$6,'مخزن 111'!$D$6:$I$6,0),0))","v":""},{"$f":"IF(COUNTIF('مخزن 111'!$D$7:$D$249,$E150)=0,\"\",VLOOKUP($E150,'مخزن 111'!$D$7:$I$249,MATCH(J$6,'مخزن 111'!$D$6:$I$6,0),0))","v":""}]
[null,null,null,{"$f":"IF($F151=\"\",\"\",MAX($D$6:D150)+1)","v":""},520506174,{"$f":"IF(COUNTIF('مخزن 111'!$D$7:$D$249,$E151)=0,\"\",VLOOKUP($E151,'مخزن 111'!$D$7:$I$249,MATCH(F$6,'مخزن 111'!$D$6:$I$6,0),0))","v":""},{"$f":"IF(COUNTIF('مخزن 111'!$D$7:$D$249,$E151)=0,\"\",VLOOKUP($E151,'مخزن 111'!$D$7:$I$249,MATCH(G$6,'مخزن 111'!$D$6:$I$6,0),0))","v":""},{"$f":"IF(COUNTIF('مخزن 111'!$D$7:$D$249,$E151)=0,\"\",VLOOKUP($E151,'مخزن 111'!$D$7:$I$249,MATCH(H$6,'مخزن 111'!$D$6:$I$6,0),0))","v":""},{"$f":"IF(COUNTIF('مخزن 111'!$D$7:$D$249,$E151)=0,\"\",VLOOKUP($E151,'مخزن 111'!$D$7:$I$249,MATCH(I$6,'مخزن 111'!$D$6:$I$6,0),0))","v":""},{"$f":"IF(COUNTIF('مخزن 111'!$D$7:$D$249,$E151)=0,\"\",VLOOKUP($E151,'مخزن 111'!$D$7:$I$249,MATCH(J$6,'مخزن 111'!$D$6:$I$6,0),0))","v":""}]
[null,null,null,{"$f":"IF($F152=\"\",\"\",MAX($D$6:D151)+1)","v":""},520507101,{"$f":"IF(COUNTIF('مخزن 111'!$D$7:$D$249,$E152)=0,\"\",VLOOKUP($E152,'مخزن 111'!$D$7:$I$249,MATCH(F$6,'مخزن 111'!$D$6:$I$6,0),0))","v":""},{"$f":"IF(COUNTIF('مخزن 111'!$D$7:$D$249,$E152)=0,\"\",VLOOKUP($E152,'مخزن 111'!$D$7:$I$249,MATCH(G$6,'مخزن 111'!$D$6:$I$6,0),0))","v":""},{"$f":"IF(COUNTIF('مخزن 111'!$D$7:$D$249,$E152)=0,\"\",VLOOKUP($E152,'مخزن 111'!$D$7:$I$249,MATCH(H$6,'مخزن 111'!$D$6:$I$6,0),0))","v":""},{"$f":"IF(COUNTIF('مخزن 111'!$D$7:$D$249,$E152)=0,\"\",VLOOKUP($E152,'مخزن 111'!$D$7:$I$249,MATCH(I$6,'مخزن 111'!$D$6:$I$6,0),0))","v":""},{"$f":"IF(COUNTIF('مخزن 111'!$D$7:$D$249,$E152)=0,\"\",VLOOKUP($E152,'مخزن 111'!$D$7:$I$249,MATCH(J$6,'مخزن 111'!$D$6:$I$6,0),0))","v":""}]
[null,null,null,{"$f":"IF($F153=\"\",\"\",MAX($D$6:D152)+1)","v":""},520507103,{"$f":"IF(COUNTIF('مخزن 111'!$D$7:$D$249,$E153)=0,\"\",VLOOKUP($E153,'مخزن 111'!$D$7:$I$249,MATCH(F$6,'مخزن 111'!$D$6:$I$6,0),0))","v":""},{"$f":"IF(COUNTIF('مخزن 111'!$D$7:$D$249,$E153)=0,\"\",VLOOKUP($E153,'مخزن 111'!$D$7:$I$249,MATCH(G$6,'مخزن 111'!$D$6:$I$6,0),0))","v":""},{"$f":"IF(COUNTIF('مخزن 111'!$D$7:$D$249,$E153)=0,\"\",VLOOKUP($E153,'مخزن 111'!$D$7:$I$249,MATCH(H$6,'مخزن 111'!$D$6:$I$6,0),0))","v":""},{"$f":"IF(COUNTIF('مخزن 111'!$D$7:$D$249,$E153)=0,\"\",VLOOKUP($E153,'مخزن 111'!$D$7:$I$249,MATCH(I$6,'مخزن 111'!$D$6:$I$6,0),0))","v":""},{"$f":"IF(COUNTIF('مخزن 111'!$D$7:$D$249,$E153)=0,\"\",VLOOKUP($E153,'مخزن 111'!$D$7:$I$249,MATCH(J$6,'مخزن 111'!$D$6:$I$6,0),0))","v":""}]
[null,null,null,{"$f":"IF($F154=\"\",\"\",MAX($D$6:D153)+1)","v":""},520507105,{"$f":"IF(COUNTIF('مخزن 111'!$D$7:$D$249,$E154)=0,\"\",VLOOKUP($E154,'مخزن 111'!$D$7:$I$249,MATCH(F$6,'مخزن 111'!$D$6:$I$6,0),0))","v":""},{"$f":"IF(COUNTIF('مخزن 111'!$D$7:$D$249,$E154)=0,\"\",VLOOKUP($E154,'مخزن 111'!$D$7:$I$249,MATCH(G$6,'مخزن 111'!$D$6:$I$6,0),0))","v":""},{"$f":"IF(COUNTIF('مخزن 111'!$D$7:$D$249,$E154)=0,\"\",VLOOKUP($E154,'مخزن 111'!$D$7:$I$249,MATCH(H$6,'مخزن 111'!$D$6:$I$6,0),0))","v":""},{"$f":"IF(COUNTIF('مخزن 111'!$D$7:$D$249,$E154)=0,\"\",VLOOKUP($E154,'مخزن 111'!$D$7:$I$249,MATCH(I$6,'مخزن 111'!$D$6:$I$6,0),0))","v":""},{"$f":"IF(COUNTIF('مخزن 111'!$D$7:$D$249,$E154)=0,\"\",VLOOKUP($E154,'مخزن 111'!$D$7:$I$249,MATCH(J$6,'مخزن 111'!$D$6:$I$6,0),0))","v":""}]
[null,null,null,{"$f":"IF($F155=\"\",\"\",MAX($D$6:D154)+1)","v":""},520508119,{"$f":"IF(COUNTIF('مخزن 111'!$D$7:$D$249,$E155)=0,\"\",VLOOKUP($E155,'مخزن 111'!$D$7:$I$249,MATCH(F$6,'مخزن 111'!$D$6:$I$6,0),0))","v":""},{"$f":"IF(COUNTIF('مخزن 111'!$D$7:$D$249,$E155)=0,\"\",VLOOKUP($E155,'مخزن 111'!$D$7:$I$249,MATCH(G$6,'مخزن 111'!$D$6:$I$6,0),0))","v":""},{"$f":"IF(COUNTIF('مخزن 111'!$D$7:$D$249,$E155)=0,\"\",VLOOKUP($E155,'مخزن 111'!$D$7:$I$249,MATCH(H$6,'مخزن 111'!$D$6:$I$6,0),0))","v":""},{"$f":"IF(COUNTIF('مخزن 111'!$D$7:$D$249,$E155)=0,\"\",VLOOKUP($E155,'مخزن 111'!$D$7:$I$249,MATCH(I$6,'مخزن 111'!$D$6:$I$6,0),0))","v":""},{"$f":"IF(COUNTIF('مخزن 111'!$D$7:$D$249,$E155)=0,\"\",VLOOKUP($E155,'مخزن 111'!$D$7:$I$249,MATCH(J$6,'مخزن 111'!$D$6:$I$6,0),0))","v":""}]
[null,null,null,{"$f":"IF($F156=\"\",\"\",MAX($D$6:D155)+1)","v":""},520509106,{"$f":"IF(COUNTIF('مخزن 111'!$D$7:$D$249,$E156)=0,\"\",VLOOKUP($E156,'مخزن 111'!$D$7:$I$249,MATCH(F$6,'مخزن 111'!$D$6:$I$6,0),0))","v":""},{"$f":"IF(COUNTIF('مخزن 111'!$D$7:$D$249,$E156)=0,\"\",VLOOKUP($E156,'مخزن 111'!$D$7:$I$249,MATCH(G$6,'مخزن 111'!$D$6:$I$6,0),0))","v":""},{"$f":"IF(COUNTIF('مخزن 111'!$D$7:$D$249,$E156)=0,\"\",VLOOKUP($E156,'مخزن 111'!$D$7:$I$249,MATCH(H$6,'مخزن 111'!$D$6:$I$6,0),0))","v":""},{"$f":"IF(COUNTIF('مخزن 111'!$D$7:$D$249,$E156)=0,\"\",VLOOKUP($E156,'مخزن 111'!$D$7:$I$249,MATCH(I$6,'مخزن 111'!$D$6:$I$6,0),0))","v":""},{"$f":"IF(COUNTIF('مخزن 111'!$D$7:$D$249,$E156)=0,\"\",VLOOKUP($E156,'مخزن 111'!$D$7:$I$249,MATCH(J$6,'مخزن 111'!$D$6:$I$6,0),0))","v":""}]
[null,null,null,{"$f":"IF($F157=\"\",\"\",MAX($D$6:D156)+1)","v":""},520509118,{"$f":"IF(COUNTIF('مخزن 111'!$D$7:$D$249,$E157)=0,\"\",VLOOKUP($E157,'مخزن 111'!$D$7:$I$249,MATCH(F$6,'مخزن 111'!$D$6:$I$6,0),0))","v":""},{"$f":"IF(COUNTIF('مخزن 111'!$D$7:$D$249,$E157)=0,\"\",VLOOKUP($E157,'مخزن 111'!$D$7:$I$249,MATCH(G$6,'مخزن 111'!$D$6:$I$6,0),0))","v":""},{"$f":"IF(COUNTIF('مخزن 111'!$D$7:$D$249,$E157)=0,\"\",VLOOKUP($E157,'مخزن 111'!$D$7:$I$249,MATCH(H$6,'مخزن 111'!$D$6:$I$6,0),0))","v":""},{"$f":"IF(COUNTIF('مخزن 111'!$D$7:$D$249,$E157)=0,\"\",VLOOKUP($E157,'مخزن 111'!$D$7:$I$249,MATCH(I$6,'مخزن 111'!$D$6:$I$6,0),0))","v":""},{"$f":"IF(COUNTIF('مخزن 111'!$D$7:$D$249,$E157)=0,\"\",VLOOKUP($E157,'مخزن 111'!$D$7:$I$249,MATCH(J$6,'مخزن 111'!$D$6:$I$6,0),0))","v":""}]
[null,null,null,{"$f":"IF($F158=\"\",\"\",MAX($D$6:D157)+1)","v":""},520509121,{"$f":"IF(COUNTIF('مخزن 111'!$D$7:$D$249,$E158)=0,\"\",VLOOKUP($E158,'مخزن 111'!$D$7:$I$249,MATCH(F$6,'مخزن 111'!$D$6:$I$6,0),0))","v":""},{"$f":"IF(COUNTIF('مخزن 111'!$D$7:$D$249,$E158)=0,\"\",VLOOKUP($E158,'مخزن 111'!$D$7:$I$249,MATCH(G$6,'مخزن 111'!$D$6:$I$6,0),0))","v":""},{"$f":"IF(COUNTIF('مخزن 111'!$D$7:$D$249,$E158)=0,\"\",VLOOKUP($E158,'مخزن 111'!$D$7:$I$249,MATCH(H$6,'مخزن 111'!$D$6:$I$6,0),0))","v":""},{"$f":"IF(COUNTIF('مخزن 111'!$D$7:$D$249,$E158)=0,\"\",VLOOKUP($E158,'مخزن 111'!$D$7:$I$249,MATCH(I$6,'مخزن 111'!$D$6:$I$6,0),0))","v":""},{"$f":"IF(COUNTIF('مخزن 111'!$D$7:$D$249,$E158)=0,\"\",VLOOKUP($E158,'مخزن 111'!$D$7:$I$249,MATCH(J$6,'مخزن 111'!$D$6:$I$6,0),0))","v":""}]
[null,null,null,{"$f":"IF($F159=\"\",\"\",MAX($D$6:D158)+1)","v":""},520509124,{"$f":"IF(COUNTIF('مخزن 111'!$D$7:$D$249,$E159)=0,\"\",VLOOKUP($E159,'مخزن 111'!$D$7:$I$249,MATCH(F$6,'مخزن 111'!$D$6:$I$6,0),0))","v":""},{"$f":"IF(COUNTIF('مخزن 111'!$D$7:$D$249,$E159)=0,\"\",VLOOKUP($E159,'مخزن 111'!$D$7:$I$249,MATCH(G$6,'مخزن 111'!$D$6:$I$6,0),0))","v":""},{"$f":"IF(COUNTIF('مخزن 111'!$D$7:$D$249,$E159)=0,\"\",VLOOKUP($E159,'مخزن 111'!$D$7:$I$249,MATCH(H$6,'مخزن 111'!$D$6:$I$6,0),0))","v":""},{"$f":"IF(COUNTIF('مخزن 111'!$D$7:$D$249,$E159)=0,\"\",VLOOKUP($E159,'مخزن 111'!$D$7:$I$249,MATCH(I$6,'مخزن 111'!$D$6:$I$6,0),0))","v":""},{"$f":"IF(COUNTIF('مخزن 111'!$D$7:$D$249,$E159)=0,\"\",VLOOKUP($E159,'مخزن 111'!$D$7:$I$249,MATCH(J$6,'مخزن 111'!$D$6:$I$6,0),0))","v":""}]
[null,null,null,{"$f":"IF($F160=\"\",\"\",MAX($D$6:D159)+1)","v":""},520509125,{"$f":"IF(COUNTIF('مخزن 111'!$D$7:$D$249,$E160)=0,\"\",VLOOKUP($E160,'مخزن 111'!$D$7:$I$249,MATCH(F$6,'مخزن 111'!$D$6:$I$6,0),0))","v":""},{"$f":"IF(COUNTIF('مخزن 111'!$D$7:$D$249,$E160)=0,\"\",VLOOKUP($E160,'مخزن 111'!$D$7:$I$249,MATCH(G$6,'مخزن 111'!$D$6:$I$6,0),0))","v":""},{"$f":"IF(COUNTIF('مخزن 111'!$D$7:$D$249,$E160)=0,\"\",VLOOKUP($E160,'مخزن 111'!$D$7:$I$249,MATCH(H$6,'مخزن 111'!$D$6:$I$6,0),0))","v":""},{"$f":"IF(COUNTIF('مخزن 111'!$D$7:$D$249,$E160)=0,\"\",VLOOKUP($E160,'مخزن 111'!$D$7:$I$249,MATCH(I$6,'مخزن 111'!$D$6:$I$6,0),0))","v":""},{"$f":"IF(COUNTIF('مخزن 111'!$D$7:$D$249,$E160)=0,\"\",VLOOKUP($E160,'مخزن 111'!$D$7:$I$249,MATCH(J$6,'مخزن 111'!$D$6:$I$6,0),0))","v":""}]
[null,null,null,{"$f":"IF($F161=\"\",\"\",MAX($D$6:D160)+1)","v":""},721202102,{"$f":"IF(COUNTIF('مخزن 111'!$D$7:$D$249,$E161)=0,\"\",VLOOKUP($E161,'مخزن 111'!$D$7:$I$249,MATCH(F$6,'مخزن 111'!$D$6:$I$6,0),0))","v":""},{"$f":"IF(COUNTIF('مخزن 111'!$D$7:$D$249,$E161)=0,\"\",VLOOKUP($E161,'مخزن 111'!$D$7:$I$249,MATCH(G$6,'مخزن 111'!$D$6:$I$6,0),0))","v":""},{"$f":"IF(COUNTIF('مخزن 111'!$D$7:$D$249,$E161)=0,\"\",VLOOKUP($E161,'مخزن 111'!$D$7:$I$249,MATCH(H$6,'مخزن 111'!$D$6:$I$6,0),0))","v":""},{"$f":"IF(COUNTIF('مخزن 111'!$D$7:$D$249,$E161)=0,\"\",VLOOKUP($E161,'مخزن 111'!$D$7:$I$249,MATCH(I$6,'مخزن 111'!$D$6:$I$6,0),0))","v":""},{"$f":"IF(COUNTIF('مخزن 111'!$D$7:$D$249,$E161)=0,\"\",VLOOKUP($E161,'مخزن 111'!$D$7:$I$249,MATCH(J$6,'مخزن 111'!$D$6:$I$6,0),0))","v":""}]
[null,null,null,{"$f":"IF($F162=\"\",\"\",MAX($D$6:D161)+1)","v":73},40521,{"$f":"IF(COUNTIF('مخزن 111'!$D$7:$D$249,$E162)=0,\"\",VLOOKUP($E162,'مخزن 111'!$D$7:$I$249,MATCH(F$6,'مخزن 111'!$D$6:$I$6,0),0))","v":"احمد عزم"},{"$f":"IF(COUNTIF('مخزن 111'!$D$7:$D$249,$E162)=0,\"\",VLOOKUP($E162,'مخزن 111'!$D$7:$I$249,MATCH(G$6,'مخزن 111'!$D$6:$I$6,0),0))","v":0},{"$f":"IF(COUNTIF('مخزن 111'!$D$7:$D$249,$E162)=0,\"\",VLOOKUP($E162,'مخزن 111'!$D$7:$I$249,MATCH(H$6,'مخزن 111'!$D$6:$I$6,0),0))","v":0},{"$f":"IF(COUNTIF('مخزن 111'!$D$7:$D$249,$E162)=0,\"\",VLOOKUP($E162,'مخزن 111'!$D$7:$I$249,MATCH(I$6,'مخزن 111'!$D$6:$I$6,0),0))","v":0},{"$f":"IF(COUNTIF('مخزن 111'!$D$7:$D$249,$E162)=0,\"\",VLOOKUP($E162,'مخزن 111'!$D$7:$I$249,MATCH(J$6,'مخزن 111'!$D$6:$I$6,0),0))","v":0}]