{"text_format":"1","workbook":"xlsx","n_sheets":3,"sheets":["Sheet1","mtn","الطباعة"],"not_rendered":{"charts":0,"images":3,"macros":1,"external_links":0,"defined_names":1,"comments":0,"pivot_tables":0},"unopened":[],"bounds":{"document_bytes":16777216,"sheet_cells":100000,"rows_first":2000,"rows_last":500,"rows_between":2000,"halvings":0,"cell_chars":16384,"cell_head_chars":4096},"cells_cut":0,"cells_raw":0,"read":"whole","date_system":"1900"}

{"sheet":"Sheet1","index":0,"n_rows":1,"n_cols":9,"rows_kept":1,"cut":false,"hidden":false,"merged":[[0,0,0,3]]}
[null,null,null,null,88,88,0,0,0]

{"sheet":"mtn","index":1,"n_rows":2,"n_cols":19,"rows_kept":2,"cut":false,"hidden":false,"merged":[]}
["رقم الجوال ","رقم الوثيقة ","كود المجموعة ","رقم الشريحة","اسم المالك / الجهة","اسم المستفيد","مبلغ التامين","المتبقي","رقم السند","نوع الهوية ","رقم الهوية ","الاصدار ","تاريخ الميلاد","مكان الميلاد","عنوان المستفيد ","المهنة","مكان العمل","نوع الشريحة","نوع العميل "]
[733781557,121,564654,115987,"اسم المالك / الجهة","اسم المستفيد",5000,"نوع الهوية ","رقم الهوية ",7,1,2,4,5,7,8,8,9,"نوع العميل "]

{"sheet":"الطباعة","index":2,"n_rows":44,"n_cols":6,"rows_kept":44,"cut":false,"hidden":false,"merged":[[21,0,21,6],[23,0,23,6],[25,0,25,6],[4,0,4,6],[10,2,10,6],[12,1,12,6],[14,0,14,6],[17,0,17,6],[19,0,19,6]]}
[]
[]
[]
[null,"التاريخ :",{"$f":"NOW()","v":"2020-04-14T07:31:28.270"}]
[]
[null,"رقم الوثيقة :",{"$f":"VLOOKUP(F8,mtn!$A:$S,2,0)","v":{"$error":"#N/A"}},null,"كود المجموعة :",{"$f":"VLOOKUP(F8,mtn!$A:$S,3,0)","v":{"$error":"#N/A"}}]
[]
[null,"رقم الشريحة :",{"$f":"VLOOKUP(F8,mtn!$A:$S,4,0)","v":{"$error":"#N/A"}},null,"رقــــم الـــجـــوال :",12]
[]
[null,null,null,null,"بيانات المالك / الجهة "]
[]
[null,"اســــــم  المالك :",{"$f":"VLOOKUP(F8,mtn!$A:$S,5,0)","v":{"$error":"#N/A"}}]
[]
[null,"اســم  المستفيد :",{"$f":"VLOOKUP(F8,mtn!$A:$S,6,0)","v":{"$error":"#N/A"}},null,"نوع العميل :",{"$f":"VLOOKUP(F8,mtn!$A:$S,19,0)","v":{"$error":"#N/A"}}]
[]
[null,"عنوان المستفيد :",{"$f":"VLOOKUP(F8,mtn!$A:$S,15,0)","v":{"$error":"#N/A"}}]
[]
[]
[null,null,null,null,"بيانات هوية المستفيد "]
[]
[null,"نــوع الهوية :",{"$f":"VLOOKUP(F8,mtn!$A:$S,10,0)","v":{"$error":"#N/A"}},null,"مـكان الميلاد :",{"$f":"VLOOKUP(F8,mtn!$A:$S,14,0)","v":{"$error":"#N/A"}}]
[]
[null,"رقـــم الهوية :",{"$f":"VLOOKUP(F8,mtn!$A:$S,11,0)","v":{"$error":"#N/A"}},null,"مــكان العمل :",{"$f":"VLOOKUP(F8,mtn!$A:$S,17,0)","v":{"$error":"#N/A"}}]
[]
[null,"مكان الاصدار:",{"$f":"VLOOKUP(F8,mtn!$A:$S,12,0)","v":{"$error":"#N/A"}},null,"المــــــهـــنة  :",{"$f":"VLOOKUP(F8,mtn!$A:$S,16,0)","v":{"$error":"#N/A"}}]
[]
[null,"تاريخ الــميلاد :",{"$f":"VLOOKUP(F8,mtn!$A:$S,13,0)","v":{"$error":"#N/A"}},null,"نوع الشـــريحة : ",{"$f":"VLOOKUP(F8,mtn!$A:$S,18,0)","v":{"$error":"#N/A"}}]
[]
[null,"اســــم المــــالك   : ",".....................................................",null,"البصمة / الختم : ","........................................................."]
[null,"الموافقه الخطية :","..........................................................................................................................................................................................................................................."]
[null,"شروط المجموعة  : "]
[]
[]
[]
[]
[]
[]
[]
[]
[]
[]
[]
[null,"اسم المستفيد : ",".....................................................",null,"البـــــصـــــمة :","....................................................."]
[null,"ختم المجموعة :",".....................................................",null,"توقيع المشرف :","....................................................."]