{"text_format":"1","workbook":"xlsx","n_sheets":2,"sheets":["ورقة1","ورقة2"],"not_rendered":{"charts":0,"images":0,"macros":1,"external_links":0,"defined_names":0,"comments":0,"pivot_tables":0},"unopened":[],"bounds":{"document_bytes":16777216,"sheet_cells":100000,"rows_first":2000,"rows_last":500,"rows_between":2000,"halvings":0,"cell_chars":16384,"cell_head_chars":4096},"cells_cut":0,"cells_raw":0,"read":"whole","date_system":"1900"}

{"sheet":"ورقة1","index":0,"n_rows":17,"n_cols":8,"rows_kept":17,"cut":false,"hidden":false,"merged":[]}
[]
["الرقم","الحصة","الفصل","اسم المعلم الغائب","اسم المعلم الأحتياط","التاريخ","العدد","اليوم"]
[1,"الأولى","1 / 1","معلم 1","معلم 3","2020-01-01",{"$f":"IF(AND(E3=ورقة2!$C$3,MONTH(ورقة1!F3)=ورقة2!$AD$3),MAX($G$2:G2)+1,\"\")","v":1},{"$f":"F3","v":"2020-01-01"}]
[2,"السابعة","5 / 1","معلم 5","معلم 44","2020-01-02",{"$f":"IF(AND(E4=ورقة2!$C$3,MONTH(ورقة1!F4)=ورقة2!$AD$3),MAX($G$2:G3)+1,\"\")","v":""},{"$f":"F4","v":"2020-01-02"}]
[3,"الرابعة","3 / 2","معلم 11","معلم 6","2020-01-03",{"$f":"IF(AND(E5=ورقة2!$C$3,MONTH(ورقة1!F5)=ورقة2!$AD$3),MAX($G$2:G4)+1,\"\")","v":""},"2020-01-03"]
[4,"الثامنة","4 / 1","معلم 14","معلم 12","2020-01-11",{"$f":"IF(AND(E6=ورقة2!$C$3,MONTH(ورقة1!F6)=ورقة2!$AD$3),MAX($G$2:G5)+1,\"\")","v":""},"2020-01-11"]
[5,"الأولى","3 / 3","معلم 20","معلم 21","2020-04-25",{"$f":"IF(AND(E7=ورقة2!$C$3,MONTH(ورقة1!F7)=ورقة2!$AD$3),MAX($G$2:G6)+1,\"\")","v":""},"2020-04-25"]
[null,"الرابعة","3 / 2","معلم 11","معلم 3","2020-01-02",{"$f":"IF(AND(E8=ورقة2!$C$3,MONTH(ورقة1!F8)=ورقة2!$AD$3),MAX($G$2:G7)+1,\"\")","v":2}]
[null,"الثامنة","5 / 1","معلم 20","معلم 12","2020-01-21",{"$f":"IF(AND(E9=ورقة2!$C$3,MONTH(ورقة1!F9)=ورقة2!$AD$3),MAX($G$2:G8)+1,\"\")","v":""}]
[null,"السابعة","5 / 1","معلم 14","معلم 3","2020-01-03",{"$f":"IF(AND(E10=ورقة2!$C$3,MONTH(ورقة1!F10)=ورقة2!$AD$3),MAX($G$2:G9)+1,\"\")","v":3}]
{"$rows_left_out":8}
{"sheet":"ورقة2","index":1,"n_rows":32,"n_cols":42,"rows_kept":32,"cut":false,"hidden":false,"merged":[[4,1,6,1],[5,36,5,37],[2,16,2,17],[2,2,2,12],[2,22,2,23],[4,2,4,32],[4,33,6,33],[17,40,17,41],[11,40,11,41],[12,40,12,41],[13,40,13,41],[14,40,14,41],[15,40,15,41],[16,40,16,41],[10,40,10,41],[5,40,5,41],[6,40,6,41],[7,40,7,41],[8,40,8,41],[9,40,9,41]]}
[]
[]
[null,"اسم المعلم ","معلم 3",null,null,null,null,null,null,null,null,null,null,null,"عن شهر",null,"يناير",null,null,null,"عن عام",null,2020,null,null,null,null,null,null,{"$f":"MATCH(Q3,AO7:AO18,0)","v":1},null,null,null,null,null,null,"اختر اسم المعلم من القائمة المنسدلة حتى ياتى ببياناته"]
[]
[null,"الحصص اليومية","اسم الفصل الذى شغله المعلم",null,null,null,null,null,null,null,null,null,null,null,null,null,null,null,null,null,null,null,null,null,null,null,null,null,null,null,null,null,null,"مجموع \nعدد الحصص"]
[null,null,{"$f":"IF(C7=\"\",\"\",INDEX($AN$7:$AN$13,WEEKDAY(C7,16)))","v":"الأربعاء"},{"$f":"IF(D7=\"\",\"\",INDEX($AN$7:$AN$13,WEEKDAY(D7,16)))","v":"الخميس"},"الجمعة","السبت","الأحد","الإثنين","الثلاثاء","الأربعاء","الخميس","الجمعة","السبت","الأحد","الإثنين","الثلاثاء","الأربعاء","الخميس","الجمعة","السبت","الأحد","الإثنين","الثلاثاء","الأربعاء","الخميس","الجمعة","السبت","الأحد","الإثنين","الثلاثاء","الأربعاء","الخميس","الجمعة",null,null,null,"حصص الاحتياط وعددها",null,null,"الأيام","الشهور"]
[null,null,{"$f":"IF(COLUMNS($C$1:C1)>DAY(DATE($W$3,INDEX(ROW($B$1:$B$12),MATCH($Q$3,$AO$7:$AO$18,0)),COLUMNS($C$1:C1))),\"\",DATE($W$3,INDEX(ROW($B$1:$B$12),MATCH($Q$3,$AO$7:$AO$18,0)),COLUMNS($C$1:C1)))","v":"2020-01-01"},{"$f":"IF(COLUMNS($C$1:D1)>DAY(DATE($W$3,INDEX(ROW($B$1:$B$12),MATCH($Q$3,$AO$7:$AO$18,0)),COLUMNS($C$1:D1))),\"\",DATE($W$3,INDEX(ROW($B$1:$B$12),MATCH($Q$3,$AO$7:$AO$18,0)),COLUMNS($C$1:D1)))","v":"2020-01-02"},{"$f":"IF(COLUMNS($C$1:E1)>DAY(DATE($W$3,INDEX(ROW($B$1:$B$12),MATCH($Q$3,$AO$7:$AO$18,0)),COLUMNS($C$1:E1))),\"\",DATE($W$3,INDEX(ROW($B$1:$B$12),MATCH($Q$3,$AO$7:$AO$18,0)),COLUMNS($C$1:E1)))","v":"2020-01-03"},{"$f":"IF(COLUMNS($C$1:F1)>DAY(DATE($W$3,INDEX(ROW($B$1:$B$12),MATCH($Q$3,$AO$7:$AO$18,0)),COLUMNS($C$1:F1))),\"\",DATE($W$3,INDEX(ROW($B$1:$B$12),MATCH($Q$3,$AO$7:$AO$18,0)),COLUMNS($C$1:F1)))","v":"2020-01-04"},{"$f":"IF(COLUMNS($C$1:G1)>DAY(DATE($W$3,INDEX(ROW($B$1:$B$12),MATCH($Q$3,$AO$7:$AO$18,0)),COLUMNS($C$1:G1))),\"\",DATE($W$3,INDEX(ROW($B$1:$B$12),MATCH($Q$3,$AO$7:$AO$18,0)),COLUMNS($C$1:G1)))","v":"2020-01-05"},{"$f":"IF(COLUMNS($C$1:H1)>DAY(DATE($W$3,INDEX(ROW($B$1:$B$12),MATCH($Q$3,$AO$7:$AO$18,0)),COLUMNS($C$1:H1))),\"\",DATE($W$3,INDEX(ROW($B$1:$B$12),MATCH($Q$3,$AO$7:$AO$18,0)),COLUMNS($C$1:H1)))","v":"2020-01-06"},{"$f":"IF(COLUMNS($C$1:I1)>DAY(DATE($W$3,INDEX(ROW($B$1:$B$12),MATCH($Q$3,$AO$7:$AO$18,0)),COLUMNS($C$1:I1))),\"\",DATE($W$3,INDEX(ROW($B$1:$B$12),MATCH($Q$3,$AO$7:$AO$18,0)),COLUMNS($C$1:I1)))","v":"2020-01-07"},{"$f":"IF(COLUMNS($C$1:J1)>DAY(DATE($W$3,INDEX(ROW($B$1:$B$12),MATCH($Q$3,$AO$7:$AO$18,0)),COLUMNS($C$1:J1))),\"\",DATE($W$3,INDEX(ROW($B$1:$B$12),MATCH($Q$3,$AO$7:$AO$18,0)),COLUMNS($C$1:J1)))","v":"2020-01-08"},{"$f":"IF(COLUMNS($C$1:K1)>DAY(DATE($W$3,INDEX(ROW($B$1:$B$12),MATCH($Q$3,$AO$7:$AO$18,0)),COLUMNS($C$1:K1))),\"\",DATE($W$3,INDEX(ROW($B$1:$B$12),MATCH($Q$3,$AO$7:$AO$18,0)),COLUMNS($C$1:K1)))","v":"2020-01-09"},{"$f":"IF(COLUMNS($C$1:L1)>DAY(DATE($W$3,INDEX(ROW($B$1:$B$12),MATCH($Q$3,$AO$7:$AO$18,0)),COLUMNS($C$1:L1))),\"\",DATE($W$3,INDEX(ROW($B$1:$B$12),MATCH($Q$3,$AO$7:$AO$18,0)),COLUMNS($C$1:L1)))","v":"2020-01-10"},{"$f":"IF(COLUMNS($C$1:M1)>DAY(DATE($W$3,INDEX(ROW($B$1:$B$12),MATCH($Q$3,$AO$7:$AO$18,0)),COLUMNS($C$1:M1))),\"\",DATE($W$3,INDEX(ROW($B$1:$B$12),MATCH($Q$3,$AO$7:$AO$18,0)),COLUMNS($C$1:M1)))","v":"2020-01-11"},{"$f":"IF(COLUMNS($C$1:N1)>DAY(DATE($W$3,INDEX(ROW($B$1:$B$12),MATCH($Q$3,$AO$7:$AO$18,0)),COLUMNS($C$1:N1))),\"\",DATE($W$3,INDEX(ROW($B$1:$B$12),MATCH($Q$3,$AO$7:$AO$18,0)),COLUMNS($C$1:N1)))","v":"2020-01-12"},{"$f":"IF(COLUMNS($C$1:O1)>DAY(DATE($W$3,INDEX(ROW($B$1:$B$12),MATCH($Q$3,$AO$7:$AO$18,0)),COLUMNS($C$1:O1))),\"\",DATE($W$3,INDEX(ROW($B$1:$B$12),MATCH($Q$3,$AO$7:$AO$18,0)),COLUMNS($C$1:O1)))","v":"2020-01-13"},{"$f":"IF(COLUMNS($C$1:P1)>DAY(DATE($W$3,INDEX(ROW($B$1:$B$12),MATCH($Q$3,$AO$7:$AO$18,0)),COLUMNS($C$1:P1))),\"\",DATE($W$3,INDEX(ROW($B$1:$B$12),MATCH($Q$3,$AO$7:$AO$18,0)),COLUMNS($C$1:P1)))","v":"2020-01-14"},{"$f":"IF(COLUMNS($C$1:Q1)>DAY(DATE($W$3,INDEX(ROW($B$1:$B$12),MATCH($Q$3,$AO$7:$AO$18,0)),COLUMNS($C$1:Q1))),\"\",DATE($W$3,INDEX(ROW($B$1:$B$12),MATCH($Q$3,$AO$7:$AO$18,0)),COLUMNS($C$1:Q1)))","v":"2020-01-15"},{"$f":"IF(COLUMNS($C$1:R1)>DAY(DATE($W$3,INDEX(ROW($B$1:$B$12),MATCH($Q$3,$AO$7:$AO$18,0)),COLUMNS($C$1:R1))),\"\",DATE($W$3,INDEX(ROW($B$1:$B$12),MATCH($Q$3,$AO$7:$AO$18,0)),COLUMNS($C$1:R1)))","v":"2020-01-16"},{"$f":"IF(COLUMNS($C$1:S1)>DAY(DATE($W$3,INDEX(ROW($B$1:$B$12),MATCH($Q$3,$AO$7:$AO$18,0)),COLUMNS($C$1:S1))),\"\",DATE($W$3,INDEX(ROW($B$1:$B$12),MATCH($Q$3,$AO$7:$AO$18,0)),COLUMNS($C$1:S1)))","v":"2020-01-17"},{"$f":"IF(COLUMNS($C$1:T1)>DAY(DATE($W$3,INDEX(ROW($B$1:$B$12),MATCH($Q$3,$AO$7:$AO$18,0)),COLUMNS($C$1:T1))),\"\",DATE($W$3,INDEX(ROW($B$1:$B$12),MATCH($Q$3,$AO$7:$AO$18,0)),COLUMNS($C$1:T1)))","v":"2020-01-18"},{"$f":"IF(COLUMNS($C$1:U1)>DAY(DATE($W$3,INDEX(ROW($B$1:$B$12),MATCH($Q$3,$AO$7:$AO$18,0)),COLUMNS($C$1:U1))),\"\",DATE($W$3,INDEX(ROW($B$1:$B$12),MATCH($Q$3,$AO$7:$AO$18,0)),COLUMNS($C$1:U1)))","v":"2020-01-19"},{"$f":"IF(COLUMNS($C$1:V1)>DAY(DATE($W$3,INDEX(ROW($B$1:$B$12),MATCH($Q$3,$AO$7:$AO$18,0)),COLUMNS($C$1:V1))),\"\",DATE($W$3,INDEX(ROW($B$1:$B$12),MATCH($Q$3,$AO$7:$AO$18,0)),COLUMNS($C$1:V1)))","v":"2020-01-20"},{"$f":"IF(COLUMNS($C$1:W1)>DAY(DATE($W$3,INDEX(ROW($B$1:$B$12),MATCH($Q$3,$AO$7:$AO$18,0)),COLUMNS($C$1:W1))),\"\",DATE($W$3,INDEX(ROW($B$1:$B$12),MATCH($Q$3,$AO$7:$AO$18,0)),COLUMNS($C$1:W1)))","v":"2020-01-21"},{"$f":"IF(COLUMNS($C$1:X1)>DAY(DATE($W$3,INDEX(ROW($B$1:$B$12),MATCH($Q$3,$AO$7:$AO$18,0)),COLUMNS($C$1:X1))),\"\",DATE($W$3,INDEX(ROW($B$1:$B$12),MATCH($Q$3,$AO$7:$AO$18,0)),COLUMNS($C$1:X1)))","v":"2020-01-22"},{"$f":"IF(COLUMNS($C$1:Y1)>DAY(DATE($W$3,INDEX(ROW($B$1:$B$12),MATCH($Q$3,$AO$7:$AO$18,0)),COLUMNS($C$1:Y1))),\"\",DATE($W$3,INDEX(ROW($B$1:$B$12),MATCH($Q$3,$AO$7:$AO$18,0)),COLUMNS($C$1:Y1)))","v":"2020-01-23"},{"$f":"IF(COLUMNS($C$1:Z1)>DAY(DATE($W$3,INDEX(ROW($B$1:$B$12),MATCH($Q$3,$AO$7:$AO$18,0)),COLUMNS($C$1:Z1))),\"\",DATE($W$3,INDEX(ROW($B$1:$B$12),MATCH($Q$3,$AO$7:$AO$18,0)),COLUMNS($C$1:Z1)))","v":"2020-01-24"},{"$f":"IF(COLUMNS($C$1:AA1)>DAY(DATE($W$3,INDEX(ROW($B$1:$B$12),MATCH($Q$3,$AO$7:$AO$18,0)),COLUMNS($C$1:AA1))),\"\",DATE($W$3,INDEX(ROW($B$1:$B$12),MATCH($Q$3,$AO$7:$AO$18,0)),COLUMNS($C$1:AA1)))","v":"2020-01-25"},{"$f":"IF(COLUMNS($C$1:AB1)>DAY(DATE($W$3,INDEX(ROW($B$1:$B$12),MATCH($Q$3,$AO$7:$AO$18,0)),COLUMNS($C$1:AB1))),\"\",DATE($W$3,INDEX(ROW($B$1:$B$12),MATCH($Q$3,$AO$7:$AO$18,0)),COLUMNS($C$1:AB1)))","v":"2020-01-26"},{"$f":"IF(COLUMNS($C$1:AC1)>DAY(DATE($W$3,INDEX(ROW($B$1:$B$12),MATCH($Q$3,$AO$7:$AO$18,0)),COLUMNS($C$1:AC1))),\"\",DATE($W$3,INDEX(ROW($B$1:$B$12),MATCH($Q$3,$AO$7:$AO$18,0)),COLUMNS($C$1:AC1)))","v":"2020-01-27"},{"$f":"IF(COLUMNS($C$1:AD1)>DAY(DATE($W$3,INDEX(ROW($B$1:$B$12),MATCH($Q$3,$AO$7:$AO$18,0)),COLUMNS($C$1:AD1))),\"\",DATE($W$3,INDEX(ROW($B$1:$B$12),MATCH($Q$3,$AO$7:$AO$18,0)),COLUMNS($C$1:AD1)))","v":"2020-01-28"},{"$f":"IF(COLUMNS($C$1:AE1)>DAY(DATE($W$3,INDEX(ROW($B$1:$B$12),MATCH($Q$3,$AO$7:$AO$18,0)),COLUMNS($C$1:AE1))),\"\",DATE($W$3,INDEX(ROW($B$1:$B$12),MATCH($Q$3,$AO$7:$AO$18,0)),COLUMNS($C$1:AE1)))","v":"2020-01-29"},{"$f":"IF(COLUMNS($C$1:AF1)>DAY(DATE($W$3,INDEX(ROW($B$1:$B$12),MATCH($Q$3,$AO$7:$AO$18,0)),COLUMNS($C$1:AF1))),\"\",DATE($W$3,INDEX(ROW($B$1:$B$12),MATCH($Q$3,$AO$7:$AO$18,0)),COLUMNS($C$1:AF1)))","v":"2020-01-30"},{"$f":"IF(COLUMNS($C$1:AG1)>DAY(DATE($W$3,INDEX(ROW($B$1:$B$12),MATCH($Q$3,$AO$7:$AO$18,0)),COLUMNS($C$1:AG1))),\"\",DATE($W$3,INDEX(ROW($B$1:$B$12),MATCH($Q$3,$AO$7:$AO$18,0)),COLUMNS($C$1:AG1)))","v":"2020-01-31"},null,null,null,"الحصة","الفصل","التاريخ","السبت","يناير"]
[null,"الحصة الأولى",{"$f":"IFERROR(INDEX($AL$8:$AL$50,MATCH($B8&C$7,$AK$8:$AK$50&$AM$8:$AM$50,0)),\"\")","v":"1 / 1"},{"$f":"IFERROR(INDEX($AL$8:$AL$50,MATCH($B8&D$7,$AK$8:$AK$50&$AM$8:$AM$50,0)),\"\")","v":""},{"$f":"IFERROR(INDEX($AL$8:$AL$50,MATCH($B8&E$7,$AK$8:$AK$50&$AM$8:$AM$50,0)),\"\")","v":""},{"$f":"IFERROR(INDEX($AL$8:$AL$50,MATCH($B8&F$7,$AK$8:$AK$50&$AM$8:$AM$50,0)),\"\")","v":""},{"$f":"IFERROR(INDEX($AL$8:$AL$50,MATCH($B8&G$7,$AK$8:$AK$50&$AM$8:$AM$50,0)),\"\")","v":""},{"$f":"IFERROR(INDEX($AL$8:$AL$50,MATCH($B8&H$7,$AK$8:$AK$50&$AM$8:$AM$50,0)),\"\")","v":""},{"$f":"IFERROR(INDEX($AL$8:$AL$50,MATCH($B8&I$7,$AK$8:$AK$50&$AM$8:$AM$50,0)),\"\")","v":""},{"$f":"IFERROR(INDEX($AL$8:$AL$50,MATCH($B8&J$7,$AK$8:$AK$50&$AM$8:$AM$50,0)),\"\")","v":""},{"$f":"IFERROR(INDEX($AL$8:$AL$50,MATCH($B8&K$7,$AK$8:$AK$50&$AM$8:$AM$50,0)),\"\")","v":""},{"$f":"IFERROR(INDEX($AL$8:$AL$50,MATCH($B8&L$7,$AK$8:$AK$50&$AM$8:$AM$50,0)),\"\")","v":""},{"$f":"IFERROR(INDEX($AL$8:$AL$50,MATCH($B8&M$7,$AK$8:$AK$50&$AM$8:$AM$50,0)),\"\")","v":""},{"$f":"IFERROR(INDEX($AL$8:$AL$50,MATCH($B8&N$7,$AK$8:$AK$50&$AM$8:$AM$50,0)),\"\")","v":""},{"$f":"IFERROR(INDEX($AL$8:$AL$50,MATCH($B8&O$7,$AK$8:$AK$50&$AM$8:$AM$50,0)),\"\")","v":""},{"$f":"IFERROR(INDEX($AL$8:$AL$50,MATCH($B8&P$7,$AK$8:$AK$50&$AM$8:$AM$50,0)),\"\")","v":""},{"$f":"IFERROR(INDEX($AL$8:$AL$50,MATCH($B8&Q$7,$AK$8:$AK$50&$AM$8:$AM$50,0)),\"\")","v":""},{"$f":"IFERROR(INDEX($AL$8:$AL$50,MATCH($B8&R$7,$AK$8:$AK$50&$AM$8:$AM$50,0)),\"\")","v":""},{"$f":"IFERROR(INDEX($AL$8:$AL$50,MATCH($B8&S$7,$AK$8:$AK$50&$AM$8:$AM$50,0)),\"\")","v":""},{"$f":"IFERROR(INDEX($AL$8:$AL$50,MATCH($B8&T$7,$AK$8:$AK$50&$AM$8:$AM$50,0)),\"\")","v":""},{"$f":"IFERROR(INDEX($AL$8:$AL$50,MATCH($B8&U$7,$AK$8:$AK$50&$AM$8:$AM$50,0)),\"\")","v":""},{"$f":"IFERROR(INDEX($AL$8:$AL$50,MATCH($B8&V$7,$AK$8:$AK$50&$AM$8:$AM$50,0)),\"\")","v":""},{"$f":"IFERROR(INDEX($AL$8:$AL$50,MATCH($B8&W$7,$AK$8:$AK$50&$AM$8:$AM$50,0)),\"\")","v":""},{"$f":"IFERROR(INDEX($AL$8:$AL$50,MATCH($B8&X$7,$AK$8:$AK$50&$AM$8:$AM$50,0)),\"\")","v":""},{"$f":"IFERROR(INDEX($AL$8:$AL$50,MATCH($B8&Y$7,$AK$8:$AK$50&$AM$8:$AM$50,0)),\"\")","v":""},{"$f":"IFERROR(INDEX($AL$8:$AL$50,MATCH($B8&Z$7,$AK$8:$AK$50&$AM$8:$AM$50,0)),\"\")","v":""},{"$f":"IFERROR(INDEX($AL$8:$AL$50,MATCH($B8&AA$7,$AK$8:$AK$50&$AM$8:$AM$50,0)),\"\")","v":""},{"$f":"IFERROR(INDEX($AL$8:$AL$50,MATCH($B8&AB$7,$AK$8:$AK$50&$AM$8:$AM$50,0)),\"\")","v":""},{"$f":"IFERROR(INDEX($AL$8:$AL$50,MATCH($B8&AC$7,$AK$8:$AK$50&$AM$8:$AM$50,0)),\"\")","v":""},{"$f":"IFERROR(INDEX($AL$8:$AL$50,MATCH($B8&AD$7,$AK$8:$AK$50&$AM$8:$AM$50,0)),\"\")","v":""},{"$f":"IFERROR(INDEX($AL$8:$AL$50,MATCH($B8&AE$7,$AK$8:$AK$50&$AM$8:$AM$50,0)),\"\")","v":""},{"$f":"IFERROR(INDEX($AL$8:$AL$50,MATCH($B8&AF$7,$AK$8:$AK$50&$AM$8:$AM$50,0)),\"\")","v":""},{"$f":"IFERROR(INDEX($AL$8:$AL$50,MATCH($B8&AG$7,$AK$8:$AK$50&$AM$8:$AM$50,0)),\"\")","v":""},null,null,null,{"$f":"IFERROR(\"الحصة\"&\" \"&OFFSET(ورقة1!B$1,MATCH(ROW($B1),ورقة1!$G:$G,0)-1,),\"\")","v":"الحصة الأولى"},{"$f":"IFERROR(OFFSET(ورقة1!C$1,MATCH(ROW($B1),ورقة1!$G:$G,0)-1,),\"\")","v":"1 / 1"},{"$f":"IFERROR(OFFSET(ورقة1!$F$1,MATCH(ROW($B1),ورقة1!$G:$G,0)-1,),\"\")","v":"2020-01-01"},"الأحد","فبراير"]
[null,"الحصة الثانية",{"$f":"IFERROR(INDEX($AL$8:$AL$50,MATCH($B9&C$7,$AK$8:$AK$50&$AM$8:$AM$50,0)),\"\")","v":""},{"$f":"IFERROR(INDEX($AL$8:$AL$50,MATCH($B9&D$7,$AK$8:$AK$50&$AM$8:$AM$50,0)),\"\")","v":""},{"$f":"IFERROR(INDEX($AL$8:$AL$50,MATCH($B9&E$7,$AK$8:$AK$50&$AM$8:$AM$50,0)),\"\")","v":""},{"$f":"IFERROR(INDEX($AL$8:$AL$50,MATCH($B9&F$7,$AK$8:$AK$50&$AM$8:$AM$50,0)),\"\")","v":""},{"$f":"IFERROR(INDEX($AL$8:$AL$50,MATCH($B9&G$7,$AK$8:$AK$50&$AM$8:$AM$50,0)),\"\")","v":""},{"$f":"IFERROR(INDEX($AL$8:$AL$50,MATCH($B9&H$7,$AK$8:$AK$50&$AM$8:$AM$50,0)),\"\")","v":""},{"$f":"IFERROR(INDEX($AL$8:$AL$50,MATCH($B9&I$7,$AK$8:$AK$50&$AM$8:$AM$50,0)),\"\")","v":""},{"$f":"IFERROR(INDEX($AL$8:$AL$50,MATCH($B9&J$7,$AK$8:$AK$50&$AM$8:$AM$50,0)),\"\")","v":""},{"$f":"IFERROR(INDEX($AL$8:$AL$50,MATCH($B9&K$7,$AK$8:$AK$50&$AM$8:$AM$50,0)),\"\")","v":""},{"$f":"IFERROR(INDEX($AL$8:$AL$50,MATCH($B9&L$7,$AK$8:$AK$50&$AM$8:$AM$50,0)),\"\")","v":""},{"$f":"IFERROR(INDEX($AL$8:$AL$50,MATCH($B9&M$7,$AK$8:$AK$50&$AM$8:$AM$50,0)),\"\")","v":""},{"$f":"IFERROR(INDEX($AL$8:$AL$50,MATCH($B9&N$7,$AK$8:$AK$50&$AM$8:$AM$50,0)),\"\")","v":""},{"$f":"IFERROR(INDEX($AL$8:$AL$50,MATCH($B9&O$7,$AK$8:$AK$50&$AM$8:$AM$50,0)),\"\")","v":""},{"$f":"IFERROR(INDEX($AL$8:$AL$50,MATCH($B9&P$7,$AK$8:$AK$50&$AM$8:$AM$50,0)),\"\")","v":""},{"$f":"IFERROR(INDEX($AL$8:$AL$50,MATCH($B9&Q$7,$AK$8:$AK$50&$AM$8:$AM$50,0)),\"\")","v":""},{"$f":"IFERROR(INDEX($AL$8:$AL$50,MATCH($B9&R$7,$AK$8:$AK$50&$AM$8:$AM$50,0)),\"\")","v":""},{"$f":"IFERROR(INDEX($AL$8:$AL$50,MATCH($B9&S$7,$AK$8:$AK$50&$AM$8:$AM$50,0)),\"\")","v":""},{"$f":"IFERROR(INDEX($AL$8:$AL$50,MATCH($B9&T$7,$AK$8:$AK$50&$AM$8:$AM$50,0)),\"\")","v":""},{"$f":"IFERROR(INDEX($AL$8:$AL$50,MATCH($B9&U$7,$AK$8:$AK$50&$AM$8:$AM$50,0)),\"\")","v":""},{"$f":"IFERROR(INDEX($AL$8:$AL$50,MATCH($B9&V$7,$AK$8:$AK$50&$AM$8:$AM$50,0)),\"\")","v":""},{"$f":"IFERROR(INDEX($AL$8:$AL$50,MATCH($B9&W$7,$AK$8:$AK$50&$AM$8:$AM$50,0)),\"\")","v":""},{"$f":"IFERROR(INDEX($AL$8:$AL$50,MATCH($B9&X$7,$AK$8:$AK$50&$AM$8:$AM$50,0)),\"\")","v":""},{"$f":"IFERROR(INDEX($AL$8:$AL$50,MATCH($B9&Y$7,$AK$8:$AK$50&$AM$8:$AM$50,0)),\"\")","v":""},{"$f":"IFERROR(INDEX($AL$8:$AL$50,MATCH($B9&Z$7,$AK$8:$AK$50&$AM$8:$AM$50,0)),\"\")","v":""},{"$f":"IFERROR(INDEX($AL$8:$AL$50,MATCH($B9&AA$7,$AK$8:$AK$50&$AM$8:$AM$50,0)),\"\")","v":""},{"$f":"IFERROR(INDEX($AL$8:$AL$50,MATCH($B9&AB$7,$AK$8:$AK$50&$AM$8:$AM$50,0)),\"\")","v":""},{"$f":"IFERROR(INDEX($AL$8:$AL$50,MATCH($B9&AC$7,$AK$8:$AK$50&$AM$8:$AM$50,0)),\"\")","v":""},{"$f":"IFERROR(INDEX($AL$8:$AL$50,MATCH($B9&AD$7,$AK$8:$AK$50&$AM$8:$AM$50,0)),\"\")","v":""},{"$f":"IFERROR(INDEX($AL$8:$AL$50,MATCH($B9&AE$7,$AK$8:$AK$50&$AM$8:$AM$50,0)),\"\")","v":""},{"$f":"IFERROR(INDEX($AL$8:$AL$50,MATCH($B9&AF$7,$AK$8:$AK$50&$AM$8:$AM$50,0)),\"\")","v":""},{"$f":"IFERROR(INDEX($AL$8:$AL$50,MATCH($B9&AG$7,$AK$8:$AK$50&$AM$8:$AM$50,0)),\"\")","v":""},null,null,null,{"$f":"IFERROR(\"الحصة\"&\" \"&OFFSET(ورقة1!B$1,MATCH(ROW($B2),ورقة1!$G:$G,0)-1,),\"\")","v":"الحصة الرابعة"},{"$f":"IFERROR(OFFSET(ورقة1!C$1,MATCH(ROW($B2),ورقة1!$G:$G,0)-1,),\"\")","v":"3 / 2"},{"$f":"IFERROR(OFFSET(ورقة1!$F$1,MATCH(ROW($B2),ورقة1!$G:$G,0)-1,),\"\")","v":"2020-01-02"},"الإثنين","مارس"]
[null,"الحصة الثالثة",{"$f":"IFERROR(INDEX($AL$8:$AL$50,MATCH($B10&C$7,$AK$8:$AK$50&$AM$8:$AM$50,0)),\"\")","v":""},{"$f":"IFERROR(INDEX($AL$8:$AL$50,MATCH($B10&D$7,$AK$8:$AK$50&$AM$8:$AM$50,0)),\"\")","v":""},{"$f":"IFERROR(INDEX($AL$8:$AL$50,MATCH($B10&E$7,$AK$8:$AK$50&$AM$8:$AM$50,0)),\"\")","v":""},{"$f":"IFERROR(INDEX($AL$8:$AL$50,MATCH($B10&F$7,$AK$8:$AK$50&$AM$8:$AM$50,0)),\"\")","v":""},{"$f":"IFERROR(INDEX($AL$8:$AL$50,MATCH($B10&G$7,$AK$8:$AK$50&$AM$8:$AM$50,0)),\"\")","v":""},{"$f":"IFERROR(INDEX($AL$8:$AL$50,MATCH($B10&H$7,$AK$8:$AK$50&$AM$8:$AM$50,0)),\"\")","v":""},{"$f":"IFERROR(INDEX($AL$8:$AL$50,MATCH($B10&I$7,$AK$8:$AK$50&$AM$8:$AM$50,0)),\"\")","v":""},{"$f":"IFERROR(INDEX($AL$8:$AL$50,MATCH($B10&J$7,$AK$8:$AK$50&$AM$8:$AM$50,0)),\"\")","v":""},{"$f":"IFERROR(INDEX($AL$8:$AL$50,MATCH($B10&K$7,$AK$8:$AK$50&$AM$8:$AM$50,0)),\"\")","v":""},{"$f":"IFERROR(INDEX($AL$8:$AL$50,MATCH($B10&L$7,$AK$8:$AK$50&$AM$8:$AM$50,0)),\"\")","v":""},{"$f":"IFERROR(INDEX($AL$8:$AL$50,MATCH($B10&M$7,$AK$8:$AK$50&$AM$8:$AM$50,0)),\"\")","v":""},{"$f":"IFERROR(INDEX($AL$8:$AL$50,MATCH($B10&N$7,$AK$8:$AK$50&$AM$8:$AM$50,0)),\"\")","v":""},{"$f":"IFERROR(INDEX($AL$8:$AL$50,MATCH($B10&O$7,$AK$8:$AK$50&$AM$8:$AM$50,0)),\"\")","v":""},{"$f":"IFERROR(INDEX($AL$8:$AL$50,MATCH($B10&P$7,$AK$8:$AK$50&$AM$8:$AM$50,0)),\"\")","v":""},{"$f":"IFERROR(INDEX($AL$8:$AL$50,MATCH($B10&Q$7,$AK$8:$AK$50&$AM$8:$AM$50,0)),\"\")","v":""},{"$f":"IFERROR(INDEX($AL$8:$AL$50,MATCH($B10&R$7,$AK$8:$AK$50&$AM$8:$AM$50,0)),\"\")","v":""},{"$f":"IFERROR(INDEX($AL$8:$AL$50,MATCH($B10&S$7,$AK$8:$AK$50&$AM$8:$AM$50,0)),\"\")","v":""},{"$f":"IFERROR(INDEX($AL$8:$AL$50,MATCH($B10&T$7,$AK$8:$AK$50&$AM$8:$AM$50,0)),\"\")","v":""},{"$f":"IFERROR(INDEX($AL$8:$AL$50,MATCH($B10&U$7,$AK$8:$AK$50&$AM$8:$AM$50,0)),\"\")","v":""},{"$f":"IFERROR(INDEX($AL$8:$AL$50,MATCH($B10&V$7,$AK$8:$AK$50&$AM$8:$AM$50,0)),\"\")","v":""},{"$f":"IFERROR(INDEX($AL$8:$AL$50,MATCH($B10&W$7,$AK$8:$AK$50&$AM$8:$AM$50,0)),\"\")","v":""},{"$f":"IFERROR(INDEX($AL$8:$AL$50,MATCH($B10&X$7,$AK$8:$AK$50&$AM$8:$AM$50,0)),\"\")","v":""},{"$f":"IFERROR(INDEX($AL$8:$AL$50,MATCH($B10&Y$7,$AK$8:$AK$50&$AM$8:$AM$50,0)),\"\")","v":""},{"$f":"IFERROR(INDEX($AL$8:$AL$50,MATCH($B10&Z$7,$AK$8:$AK$50&$AM$8:$AM$50,0)),\"\")","v":""},{"$f":"IFERROR(INDEX($AL$8:$AL$50,MATCH($B10&AA$7,$AK$8:$AK$50&$AM$8:$AM$50,0)),\"\")","v":""},{"$f":"IFERROR(INDEX($AL$8:$AL$50,MATCH($B10&AB$7,$AK$8:$AK$50&$AM$8:$AM$50,0)),\"\")","v":""},{"$f":"IFERROR(INDEX($AL$8:$AL$50,MATCH($B10&AC$7,$AK$8:$AK$50&$AM$8:$AM$50,0)),\"\")","v":""},{"$f":"IFERROR(INDEX($AL$8:$AL$50,MATCH($B10&AD$7,$AK$8:$AK$50&$AM$8:$AM$50,0)),\"\")","v":""},{"$f":"IFERROR(INDEX($AL$8:$AL$50,MATCH($B10&AE$7,$AK$8:$AK$50&$AM$8:$AM$50,0)),\"\")","v":""},{"$f":"IFERROR(INDEX($AL$8:$AL$50,MATCH($B10&AF$7,$AK$8:$AK$50&$AM$8:$AM$50,0)),\"\")","v":""},{"$f":"IFERROR(INDEX($AL$8:$AL$50,MATCH($B10&AG$7,$AK$8:$AK$50&$AM$8:$AM$50,0)),\"\")","v":""},null,null,null,{"$f":"IFERROR(\"الحصة\"&\" \"&OFFSET(ورقة1!B$1,MATCH(ROW($B3),ورقة1!$G:$G,0)-1,),\"\")","v":"الحصة السابعة"},{"$f":"IFERROR(OFFSET(ورقة1!C$1,MATCH(ROW($B3),ورقة1!$G:$G,0)-1,),\"\")","v":"5 / 1"},{"$f":"IFERROR(OFFSET(ورقة1!$F$1,MATCH(ROW($B3),ورقة1!$G:$G,0)-1,),\"\")","v":"2020-01-03"},"الثلاثاء","ابريل"]
{"$rows_left_out":22}