{"text_format":"1","workbook":"xlsx","n_sheets":3,"sheets":["Macro1","Sheet1","Index"],"not_rendered":{"charts":2,"images":0,"macros":1,"external_links":1,"defined_names":3,"comments":0,"pivot_tables":0},"unopened":[],"bounds":{"document_bytes":16777216,"sheet_cells":100000,"rows_first":2000,"rows_last":500,"rows_between":2000,"halvings":0,"cell_chars":16384,"cell_head_chars":4096},"cells_cut":0,"cells_raw":0,"read":"whole","date_system":"1900"}

{"sheet":"Macro1","index":0,"n_rows":0,"n_cols":0,"rows_kept":0,"cut":false,"hidden":false,"merged":[]}

{"sheet":"Sheet1","index":1,"n_rows":70,"n_cols":88,"rows_kept":70,"cut":false,"hidden":false,"merged":[[1,38,1,40],[2,38,2,40],[3,38,3,40],[4,38,4,40],[5,5,8,36],[5,38,5,40],[13,8,13,12],[13,14,13,18],[13,20,13,24],[13,26,13,30],[13,33,14,33],[13,34,14,34],[27,0,33,0],[28,6,28,30],[30,1,30,3],[8,2,10,4],[9,0,15,0],[10,6,10,30],[12,2,12,6],[12,8,12,12],[12,14,12,18],[12,20,12,24],[12,26,12,30],[13,2,13,6],[14,26,14,30],[15,2,15,6],[22,2,22,3],[22,5,22,6],[22,8,22,9],[22,11,22,12],[22,14,22,15],[24,33,27,33],[24,34,27,34],[26,2,28,4],[18,0,24,0],[21,2,21,3],[21,8,21,9],[21,11,21,12],[21,14,21,15],[14,2,14,6],[14,8,14,12],[14,14,14,18],[14,20,14,24],[15,34,18,34],[15,35,16,35],[21,17,21,18],[21,20,21,21],[21,23,21,24],[21,26,21,27],[21,29,21,30],[17,2,19,4],[17,35,18,35],[22,72,22,84],[23,2,23,3],[23,5,23,6],[23,8,23,9],[23,11,23,12],[23,14,23,15],[23,17,23,18],[23,20,23,21],[23,23,23,24],[23,26,23,27],[22,34,23,34],[22,45,22,49],[22,50,22,59],[22,60,22,67],[22,68,22,69],[22,70,22,71],[22,17,22,18],[22,20,22,21],[22,23,22,24],[22,26,22,27],[22,29,22,30],[22,33,23,33],[23,29,23,30],[32,1,32,3],[32,5,32,7],[32,9,32,11],[32,13,32,15],[32,17,32,19],[32,21,32,23],[32,25,32,27],[32,29,32,31],[30,5,30,7],[30,9,30,11],[30,13,30,15],[30,17,30,19],[30,21,30,23],[30,25,30,27],[30,29,30,31],[31,1,31,3],[31,5,31,7],[31,9,31,11],[31,13,31,15],[31,17,31,19],[31,21,31,23],[31,25,31,27],[31,29,31,31],[35,2,37,4],[36,0,42,0],[37,6,37,30],[39,4,39,14],[39,18,39,28],[40,4,40,14],[40,18,40,28],[41,4,41,14],[41,18,41,28],[42,4,42,14],[44,2,46,4],[45,0,51,0],[46,6,46,30],[48,4,48,14],[48,18,48,28],[49,4,49,14],[49,18,49,28],[50,4,50,14],[50,18,50,28],[53,2,55,4],[54,0,60,0],[55,6,55,30],[58,4,58,5],[58,6,58,7],[58,8,58,9],[58,10,58,11],[58,12,58,13],[69,0,69,5],[69,6,69,30],[59,20,59,21],[59,22,59,23],[59,24,59,25],[59,26,59,27],[59,28,59,29],[63,3,66,9],[58,26,58,27],[58,28,58,29],[59,4,59,5],[59,6,59,7],[59,8,59,9],[59,10,59,11],[59,12,59,13],[59,14,59,15],[59,16,59,17],[59,18,59,19],[58,14,58,15],[58,16,58,17],[58,18,58,19],[58,20,58,21],[58,22,58,23],[58,24,58,25],[9,43,9,47],[34,33,37,33],[34,34,37,34],[31,33,33,33],[31,34,33,34],[18,45,18,84],[19,6,19,30],[19,33,21,33],[19,45,19,49],[19,50,19,59],[19,60,19,67],[19,68,19,69],[19,70,19,71],[19,72,19,84],[21,5,21,6],[15,33,18,33]]}
[null,null,null,null,null,null,null,null,null,null,null,null,null,null,null,null,null,null,null,null,null,null,null,null,null,null,null,null,null,null,null,null,null,null,null,null,null,null,"Kadhem Ali",null,null,null,null,null,null,null,{"$f":"AV1-1","v":"2020-04-25"},"2020-04-26","April",{"$f":"IF(AT1=\"None\",\"\",AZ1&\" \"&AY1&\", \"&BA1)","v":"Apr 25, 2020"},{"$f":"DAY(AU1)","v":25},"Apr",{"$f":"YEAR(AV1)","v":2020},null,"all","Ahmed Ali","Yosef Mahmoud","Hassan Zaki","Zainab Akash","Murad nabaui","Ali Saleh","Fouad halabi","Ahmed naser","Eraj nasr","Fathi Ali","Hind Qasem","Maher zaki",null,null,null,null,"","","Uhod Ahmed","Kadhem Ali",null,"","","",""]
[null,null,null,null,null,null,null,null,null,null,null,null,null,null,null,null,null,null,null,null,null,null,null,null,null,null,null,null,null,null,null,null,null,null,null,null,null,null,2020,null,null,null,{"$f":"\"Full Year Report Up to \"&AU4","v":"Full Year Report Up to \"Apr 25, 2020\""},null,null,null,null,null,2,null,null,null,null,"Subermarkit",{"$f":"SUM(BD2:CB2)","v":73},2,8,5,6,0,null,4,5,4,7,9,12,null,null,null,null,null,null,4,7,null,null,null,null,null,{"$f":"BC2","v":73}]
[null,null,null,null,null,null,null,null,null,null,null,null,null,null,null,null,null,null,null,null,null,null,null,null,null,null,null,null,null,null,null,null,null,null,null,null,null,null,"Q1st",null,null,{"$f":"IF(AM3=\"None\",\"\",AM3)","v":"Q1st"},{"$f":"IF(AT3=AW2,\"Quarter \"&AT3&\" report During \"&AR3&\" - \"&AU4,\"Quarter \"&AT3&\" report during \"&AR3&\" - \"&AS3)","v":"Quarter 1 report during \"Jan 01, 2020\" - \"Mar 31, 2020\""},"\"Jan 01, 2020\"","\"Mar 31, 2020\"",1,null,null,null,null,null,null,null,"Grosery",61,1,0,6,4,4,null,7,4,3,9,2,9,null,null,null,null,null,null,3,9,null,null,null,null,null,61]
[null,null,null,null,null,null,null,null,null,null,null,null,null,null,null,null,null,null,null,null,null,null,null,null,null,null,null,null,null,null,null,null,null,null,null,null,null,null,"February",null,null,{"$f":"IF(AM4=\"None\",\"\",AM4)","v":"February"},{"$f":"IF(AW1=AP4,AP4&\" reprt during \"&AR4&\" - \"&AU4,AP4&\" report during \"&AR4&\" - \"&AS4)","v":"February report during \"Feb 01, 2020\" - \"Feb 29, 2020\""},"\"Feb 01, 2020\"","\"Feb 29, 2020\"",null,{"$f":"AV4&AX1&AV4","v":"\"Apr 25, 2020\""},"\"",null,null,null,null,null,"PRODUCING",68,5,4,3,5,5,null,9,3,5,9,1,5,null,null,null,null,null,null,5,9,null,null,null,null,null,68]
[null,null,null,null,null,null,null,null,null,null,null,null,null,null,null,null,null,null,null,null,null,null,null,null,null,null,null,null,null,null,null,null,null,null,null,null,null,null,"WK# 6 Feb 1 - Feb 7",null,null,"Wek6_",{"$f":"IF(AM5=\"None\",\"\",AM5)","v":"WK# 6 Feb 1 - Feb 7"},null,null,null,null,null,null,null,null,null,null,"electronic",94,4,7,9,9,16,null,9,5,5,16,1,5,null,null,null,null,null,null,5,3,null,null,null,null,null,94]
[null,null,null,null,null,{"$f":"TitQ","v":"Kadhem Ali Invoice for Feb 2, 2020"},null,null,null,null,null,null,null,null,null,null,null,null,null,null,null,null,null,null,null,null,null,null,null,null,null,null,null,null,null,null,null,null,"2020-02-02",null,null,{"$f":"AM6","v":"2020-02-02"},{"$f":"IF(AM6=\"None\",\"\",\"Invoice for \"&AS6&\" \"&AR6&\", \"&AT6)","v":"Invoice for Feb 2, 2020"},{"$f":"DAY(AM6)","v":2},"Feb",{"$f":"YEAR(AM6)","v":2020},null,null,null,null,null,null,null,"MAINTENANCE",77,9,2,1,1,8,null,16,5,3,0,8,9,null,null,null,null,null,null,3,12,null,null,null,null,null,77]
[null,null,null,null,null,null,null,null,null,null,null,null,null,null,null,null,null,null,null,null,null,null,null,null,null,null,null,null,null,null,null,null,null,null,null,null,null,null,null,null,null,null,{"$f":"IF(AM6=\"None\",\"\",\"Daily Dashboared for \"&AS6&\" \"&AR6&\", \"&AT6)","v":"Daily Dashboared for Feb 2, 2020"},null,null,{"$f":"IF(AND(AM3=\"None\",AM4=\"None\",AM5=\"None\",AM6=\"None\"),\"Y\",IF(AND(AM4=\"None\",AM5=\"None\",AM6=\"None\"),\"Q\",IF(AND(AM5=\"None\",AM6=\"None\"),\"M\",IF(AM6=\"None\",\"W\",\"D\"))))","v":"D"},32,null,null,null,null,null,null,"Frout",114,15,0,0,5,6,null,5,17,12,7,9,12,null,null,null,null,null,null,17,9,null,null,null,null,null,114]
[null,null,null,null,null,null,null,null,null,null,null,null,null,null,null,null,null,null,null,null,null,null,null,null,null,null,null,null,null,null,null,null,null,null,null,null,null,null,{"$f":"BB2","v":"Subermarkit"},{"$f":"_xlfn.IFNA(VLOOKUP(BB2,$BB$2:$CC$7,VLOOKUP($AM$1,Index!$B$1:$G$26,2,FALSE),FALSE),0)","v":7},null,null,null,null,null,null,null,null,null,null,null,null,null,"Total",487,{"$f":"SUM(BD2:BD7)","v":36},21,24,30,39,0,50,39,32,48,30,52,0,0,0,0,0,0,37,49,0,0,0,0,0,487]
[null,null,{"$f":"C14+I14+O14+U14+AA14","v":0},null,null,null,null,null,null,null,null,null,null,null,null,null,null,null,null,null,null,null,null,null,null,null,null,null,null,null,null,null,null,null,null,null,null,null,"Grosery",{"$f":"_xlfn.IFNA(VLOOKUP(BB3,$BB$2:$CC$7,VLOOKUP($AM$1,Index!$B$1:$G$26,2,FALSE),FALSE),0)","v":9},null,null,null,null,null,null,null,null,null,null,null,null,null,null,"ALL","B1","B2","B3","B4","B5","B6","B7","B8","B9","B10","B11","B12","B13","B14","B15","B16","B17","B18","B19","B20","B21","B22","B23","B24","B25",{"$f":"BC9","v":"ALL"}]
[null,null,null,null,null,null,null,null,null,null,null,null,null,null,null,null,null,null,null,null,null,null,null,null,null,null,null,null,null,null,null,null,null,null,null,null,null,null,"PRODUCING",{"$f":"_xlfn.IFNA(VLOOKUP(BB4,$BB$2:$CC$7,VLOOKUP($AM$1,Index!$B$1:$G$26,2,FALSE),FALSE),0)","v":9},null,null,null,{"$f":"IF(AM1=\"all\",(IF(AT7=\"D\",AQ6,IF(AT7=\"W\",AQ5,IF(AT7=\"M\",AQ4,IF(AT7=\"Q\",AQ3,IF(AT7=\"Y\",AQ2,\"Check Drop list\")))))),IF(AT7=\"D\",AM1&\" \"&AQ6,IF(AT7=\"W\",AM1&\" \"&AQ5,IF(AT7=\"M\",AM1&\" \"&AQ4,IF(AT7=\"Q\",AM1&\" \"&AQ3,IF(AT7=\"Y\",AM1&\" \"&AQ2,\"Check Drop list\"))))))","v":"Kadhem Ali Invoice for Feb 2, 2020"},null,null,null,null,null,null,null,null,null,null,"ALL"]
[null,null,null,null,null,null,{"$f":"IFERROR((C15+I15+O15+U15+AA15),\"\")","v":0},null,null,null,null,null,null,null,null,null,null,null,null,null,null,null,null,null,null,null,null,null,null,null,null,null,null,{"$f":"IF(AN14=0,\"Not Active\",\"Active On\")","v":"Active On"},{"$f":"IF(OR(AM1=\"\",AM1=\" \",AM1=0),\"On selected\",IF(VLOOKUP(\"Total\",$BB$2:$CC$8,VLOOKUP($AM$1,Index!$B$1:$G$26,2,FALSE),FALSE)=0,\"On selected\",VLOOKUP(\"Total\",$BB$2:$CC$8,VLOOKUP($AM$1,Index!$B$1:$G$26,2,FALSE),FALSE)*105))","v":5145},{"$f":"IF(OR(AI11=0,AI11=\"On selected\"),\"Date\",\"$\")","v":"$"},null,null,"electronic",{"$f":"_xlfn.IFNA(VLOOKUP(BB5,$BB$2:$CC$7,VLOOKUP($AM$1,Index!$B$1:$G$26,2,FALSE),FALSE),0)","v":3},null,null,null,{"$f":"IF(AT7=\"D\",AQ7,IF(AT7=\"W\",AQ5,IF(AT7=\"M\",AQ4,IF(AT7=\"Q\",AQ3,IF(AT7=\"Y\",AQ2,\"Check Drop list\")))))","v":"Daily Dashboared for Feb 2, 2020"}]
[null,null,null,null,null,null,null,null,null,null,null,null,null,null,null,null,null,null,null,null,null,null,null,null,null,null,null,null,null,null,null,null,null,null,null,null,null,null,"MAINTENANCE",{"$f":"_xlfn.IFNA(VLOOKUP(BB6,$BB$2:$CC$7,VLOOKUP($AM$1,Index!$B$1:$G$26,2,FALSE),FALSE),0)","v":12},null,null,null,null,null,null,null,null,null,null,null,null,null,null,-1.1158838124572208,1,1,1,1,1,"",1,1,1,1,1,1,"","","","","","",1,1,"","","","",""]
[null,null,null,null,null,null,null,null,null,null,null,null,null,null,null,null,null,null,null,null,null,null,null,null,null,null,null,null,null,null,null,null,null,{"$f":"BB5","v":"electronic"},{"$f":"BB2","v":"Subermarkit"},null,null,null,"Frout",{"$f":"_xlfn.IFNA(VLOOKUP(BB7,$BB$2:$CC$7,VLOOKUP($AM$1,Index!$B$1:$G$26,2,FALSE),FALSE),0)","v":9},null,null,null,null,null,null,null,null,null,null,null,null,null,null,null,"(BD8*24)"]
[null,null,{"$f":"AT22","v":0},null,null,null,null,null,{"$f":"AU22","v":0},null,null,null,null,null,{"$f":"AV22","v":0},null,null,null,null,null,{"$f":"AW22","v":0},null,null,null,null,null,{"$f":"AX22","v":0},null,null,null,null,null,null,{"$f":"AN11","v":3},{"$f":"AN8","v":7},null,null,null,null,{"$f":"IF(OR(AM1=\"\",AM1=\" \",AM1=0),0,(AN8+AN9+AN10+AN11+AN12+AN13))","v":49},null,null,null,null,null,null,null,null,null,null,null,null,null,null,null,false]
[null,null,{"$f":"AT21","v":0},null,null,null,null,null,{"$f":"AU21","v":0},null,null,null,null,null,{"$f":"AV21","v":0},null,null,null,null,null,{"$f":"AW21","v":0},null,null,null,null,null,{"$f":"AX21","v":0}]
[null,null,null,null,null,null,null,null,null,null,null,null,null,null,null,null,null,null,null,null,null,null,null,null,null,null,null,null,null,null,null,null,null,{"$f":"IF(AH14=0,\"\",IF(AH14=1,\"Day\",\"Days\"))","v":"Days"},{"$f":"IF(AI14=0,\"\",IF(AI14=1,\"Day\",\"Days\"))","v":"Days"},null,null,null,null,null,null,null,null,null,null,null,null,null,null,null,null,null,null,null,null,null,null,null,null,null,null,null,null,null,null,null,null,null,null,null,null,null,null,null,null,null,null,null,null,null,null,null,null,null,null,{"$f":"100%-AT19","v":1}]
[]
[null,null,{"$f":"C23+F23+I23+L23+O23+R23+U23+X23+AA23+AD23","v":0}]
[null,null,null,null,null,null,null,null,null,null,null,null,null,null,null,null,null,null,null,null,null,null,null,null,null,null,null,null,null,null,null,null,null,null,null,null,null,null,null,null,null,null,null,null,null,{"$f":"AT21+AU21+AV21+AW21+AX21+AY21+AZ21+BA21+BB21+BC21+BD21+BE21+BF21+BG21+BH21+BI21+BJ21+BK21+BL21+BM21+BN21+BO21+BP21+BQ21+BR21+BS21+BT21+BU21+BV21+BW21+BX21+BY21+BZ21+CA21+CB21+CC21+CD21+CE21+CF21+CG21","v":0},null,null,null,null,null,null,null,null,null,null,null,null,null,null,null,null,null,null,null,null,null,null,null,null,null,null,null,null,null,null,null,null,null,null,null,null,null,null,null,{"$f":"SUM(AT20:CG20)","v":0},null,{"$f":"IF(CJ20=0.1,1,CJ20*24)","v":1176}]
[null,null,null,null,null,null,{"$f":"IFERROR((C24+F24+I24+L24+O24+R24+U24+X24+AA24+AD24),\"\")","v":0},null,null,null,null,null,null,null,null,null,null,null,null,null,null,null,null,null,null,null,null,null,null,null,null,null,null,{"$f":"BB6","v":"MAINTENANCE"},null,null,null,null,null,null,null,null,null,null,null,{"$f":"AT21+AU21+AV21+AW21+AX21","v":0},null,null,null,null,{"$f":"AY21+AZ21+BA21+BB21+BC21+BD21+BE21+BF21+BG21+BH21","v":0},null,null,null,null,null,null,null,null,null,{"$f":"BI21+BJ21+BK21+BL21+BM21+BN21+BO21+BP21","v":0},null,null,null,null,null,null,null,{"$f":"BQ21+BR21","v":0},null,{"$f":"BS21+BT21","v":0},null,{"$f":"BU21+BV21+BW21+BX21+BY21+BZ21+CA21+CB21+CC21+CD21+CE21+CF21+CG21","v":0},null,null,null,null,null,null,null,null,null,null,null,null,{"$f":"SUM(AT21:CG21)","v":0},{"$f":"CH25","v":0},{"$f":"HLOOKUP(AM1,BC1:CB8,8,FALSE)","v":49}]
[null,null,null,null,null,null,null,null,null,null,null,null,null,null,null,null,null,null,null,null,null,null,null,null,null,null,null,null,null,null,null,null,null,null,null,null,null,null,null,null,null,null,null,null,null,{"$f":"_xlfn.IFNA(IF($CJ$19=0,0,AT22/$CJ$19),\"\")","v":0},{"$f":"_xlfn.IFNA(IF($CJ$19=0,0,AU22/$CJ$19),\"\")","v":0},0,0,0,0,0,0,0,0,0,0,0,0,0,0,0,0,0,0,0,0,0,0,0,0,0,0,0,0,0,0,0,0,0,0,0,0,0,0,null,null,{"$f":"CJ19-CI20","v":1176}]
[null,null,null,null,null,null,null,null,null,null,null,null,null,null,null,null,null,null,null,null,null,null,null,null,null,null,null,null,null,null,null,null,null,null,{"$f":"BB3","v":"Grosery"},null,null,null,null,null,null,null,null,null,null,{"$f":"SUM(AT25:AT810)","v":0},{"$f":"SUM(AU25:AU810)","v":0},0,0,0,0,0,0,0,0,0,0,0,0,0,0,0,0,0,0,0,0,0,0,0,0,0,0,0,0,0,0,0,0,0,0,0,0,0,0]
[null,null,{"$f":"AY22","v":0},null,null,{"$f":"AZ22","v":0},null,null,{"$f":"BA22","v":0},null,null,{"$f":"BB22","v":0},null,null,{"$f":"BC22","v":0},null,null,{"$f":"BD22","v":0},null,null,{"$f":"BE22","v":0},null,null,{"$f":"BF22","v":0},null,null,{"$f":"BG22","v":0},null,null,{"$f":"BH22","v":0},null,null,null,{"$f":"AN12","v":12},{"$f":"AN9","v":9}]
[null,null,{"$f":"AY21","v":0},null,null,{"$f":"AZ21","v":0},null,null,{"$f":"BA21","v":0},null,null,{"$f":"BB21","v":0},null,null,{"$f":"BC21","v":0},null,null,{"$f":"BD21","v":0},null,null,{"$f":"BE21","v":0},null,null,{"$f":"BF21","v":0},null,null,{"$f":"BG21","v":0},null,null,{"$f":"BH21","v":0}]
[null,null,null,null,null,null,null,null,null,null,null,null,null,null,null,null,null,null,null,null,null,null,null,null,null,null,null,null,null,null,null,null,null,{"$f":"IF(AH23=0,\"\",IF(AH23=1,\"Day\",\"Days\"))","v":"Days"},{"$f":"IF(AI23=0,\"\",IF(AI23=1,\"Day\",\"Days\"))","v":"Days"},null,null,null,null,null,null,null,null,null,null,0,0,0,0,0,0,0,0,0,0,0,0,0,0,0,0,0,0,0,0,0,0,0,0,0,0,0,0,0,0,0,0,0,0,0,0,0,0,0,0,{"$f":"SUM(AT25:CG25)","v":0}]
[]
[null,null,{"$f":"B32+F32+J32+N32+R32+V32+Z32+AD32","v":0}]
[]
[null,null,null,null,null,null,{"$f":"IFERROR((B33+F33+J33+N33+R33+V33+Z33+AD33),\"\")","v":0}]
[]
[null,null,null,null,null,null,null,null,null,null,null,null,null,null,null,null,null,null,null,null,null,null,null,null,null,null,null,null,null,null,null,null,null,{"$f":"BB7","v":"Frout"},{"$f":"BB4","v":"PRODUCING"}]
[null,{"$f":"BI22","v":0},null,null,null,{"$f":"BJ22","v":0},null,null,null,{"$f":"BK22","v":0},null,null,null,{"$f":"BL22","v":0},null,null,null,{"$f":"BM22","v":0},null,null,null,{"$f":"BN22","v":0},null,null,null,{"$f":"BO22","v":0},null,null,null,{"$f":"BP22","v":0},null,null,null,{"$f":"AN13","v":9},{"$f":"AN10","v":9}]
[null,{"$f":"BI21","v":0},null,null,null,{"$f":"BJ21","v":0},null,null,null,{"$f":"BK21","v":0},null,null,null,{"$f":"BL21","v":0},null,null,null,{"$f":"BM21","v":0},null,null,null,{"$f":"BN21","v":0},null,null,null,{"$f":"BO21","v":0},null,null,null,{"$f":"BP21","v":0}]
[]
[null,null,null,null,null,null,null,null,null,null,null,null,null,null,null,null,null,null,null,null,null,null,null,null,null,null,null,null,null,null,null,null,null,{"$f":"IF(AH32=0,\"\",IF(AH32=1,\"Day\",\"Days\"))","v":"Days"},{"$f":"IF(AI32=0,\"\",IF(AI32=1,\"Day\",\"Days\"))","v":"Days"}]
[null,null,{"$f":"E41+S41","v":0}]
[]
[null,null,null,null,null,null,{"$f":"IFERROR((E42+S42),\"\")","v":0}]
[]
[]
[null,null,null,null,{"$f":"BQ22","v":0},null,null,null,null,null,null,null,null,null,null,null,null,null,{"$f":"BR22","v":0}]
[null,null,null,null,{"$f":"BQ21","v":0},null,null,null,null,null,null,null,null,null,null,null,null,null,{"$f":"BR21","v":0}]
[]
[]
[null,null,{"$f":"E50+S50","v":0}]
[]
[null,null,null,null,null,null,{"$f":"IFERROR((E51+S51),\"\")","v":0}]
[]
[]
[null,null,null,null,{"$f":"BS22","v":0},null,null,null,null,null,null,null,null,null,null,null,null,null,{"$f":"BT22","v":0}]
[null,null,null,null,{"$f":"BS21","v":0},null,null,null,null,null,null,null,null,null,null,null,null,null,{"$f":"BT21","v":0}]
[]
[]
[null,null,{"$f":"E59+G59+I59+K59+M59+O59+Q59+S59+U59+W59+Y59+AA59+AC59","v":0}]
[]
[null,null,null,null,null,null,{"$f":"IFERROR((E60+G60+I60+K60+M60+O60+Q60+S60+U60+W60+Y60+AA60),\"\")","v":0}]
[]
[]
[null,null,null,null,{"$f":"BU22","v":0},null,{"$f":"BV22","v":0},null,{"$f":"BW22","v":0},null,{"$f":"BX22","v":0},null,{"$f":"BY22","v":0},null,{"$f":"BZ22","v":0},null,{"$f":"CA22","v":0},null,{"$f":"CB22","v":0},null,{"$f":"CC22","v":0},null,{"$f":"CD22","v":0},null,{"$f":"CE22","v":0},null,{"$f":"CF22","v":0},null,{"$f":"CG22","v":0}]
[null,null,null,null,{"$f":"BU21","v":0},null,{"$f":"BV21","v":0},null,{"$f":"BW21","v":0},null,{"$f":"BX21","v":0},null,{"$f":"BY21","v":0},null,{"$f":"BZ21","v":0},null,{"$f":"CA21","v":0},null,{"$f":"CB21","v":0},null,{"$f":"CC21","v":0},null,{"$f":"CD21","v":0},null,{"$f":"CE21","v":0},null,{"$f":"CF21","v":0},null,{"$f":"CG21","v":0}]
[]
[]
[]
[null,null,null,{"$f":"C54+C45+C36+C27+C18+C9","v":0}]
[]
[]
[]
[]
[]
["Over all Sub total",null,null,null,null,null,{"$f":"IFERROR((G56+G47+G38+G29+G20+G11),\"\")","v":0}]

{"sheet":"Index","index":2,"n_rows":26,"n_cols":3,"rows_kept":26,"cut":false,"hidden":false,"merged":[]}
[null,"Custumer"]
[null,"Ahmed Ali",3]
[null,"Yosef Mahmoud",4]
[null,"Hassan Zaki",5]
[null,"Zainab Akash",6]
[null,"Murad nabaui",7]
[null,"Ali Saleh",8]
[null,"Fouad halabi",9]
[null,"Ahmed naser",10]
[null,"Eraj nasr",11]
[null,"Fathi Ali",12]
[null,"Hind Qasem",13]
[null,"Maher zaki",14]
[null,null,15]
[null,null,16]
[null,null,17]
[null,null,18]
[null,null,19]
[null,null,20]
[null,"Uhod Ahmed",21]
[null,"Kadhem Ali",22]
[null,null,23]
[null,null,24]
[null,null,25]
[null,null,26]
[null,null,27]