{"text_format":"1","workbook":"xlsx","n_sheets":3,"sheets":["ورقة1","ورقة2","ورقة3"],"not_rendered":{"charts":0,"images":0,"macros":1,"external_links":0,"defined_names":0,"comments":0,"pivot_tables":0},"unopened":[],"bounds":{"document_bytes":16777216,"sheet_cells":100000,"rows_first":2000,"rows_last":500,"rows_between":2000,"halvings":0,"cell_chars":16384,"cell_head_chars":4096},"cells_cut":0,"cells_raw":0,"read":"whole","date_system":"1900"}

{"sheet":"ورقة1","index":0,"n_rows":59,"n_cols":7,"rows_kept":59,"cut":false,"hidden":false,"merged":[[6,6,20,12]]}
[5,{"$f":"IF(A1<>\"\",\"basic\",IFERROR(IF(OFFSET(B1,-1,0)<>\"\",IF(ROW()-LOOKUP(2,1/(A$1:A1<>\"\"),ROW(A$1:A1))>LOOKUP(2,1/(A$1:A1),A$1:A1)-1,\"\",\"sub\"),\"\"),\"\"))","v":"basic"}]
[null,{"$f":"IF(A2<>\"\",\"basic\",IFERROR(IF(OFFSET(B2,-1,0)<>\"\",IF(ROW()-LOOKUP(2,1/(A$1:A2<>\"\"),ROW(A$1:A2))>LOOKUP(2,1/(A$1:A2),A$1:A2)-1,\"\",\"sub\"),\"\"),\"\"))","v":"sub"}]
[null,{"$f":"IF(A3<>\"\",\"basic\",IFERROR(IF(OFFSET(B3,-1,0)<>\"\",IF(ROW()-LOOKUP(2,1/(A$1:A3<>\"\"),ROW(A$1:A3))>LOOKUP(2,1/(A$1:A3),A$1:A3)-1,\"\",\"sub\"),\"\"),\"\"))","v":"sub"}]
[null,{"$f":"IF(A4<>\"\",\"basic\",IFERROR(IF(OFFSET(B4,-1,0)<>\"\",IF(ROW()-LOOKUP(2,1/(A$1:A4<>\"\"),ROW(A$1:A4))>LOOKUP(2,1/(A$1:A4),A$1:A4)-1,\"\",\"sub\"),\"\"),\"\"))","v":"sub"}]
[null,{"$f":"IF(A5<>\"\",\"basic\",IFERROR(IF(OFFSET(B5,-1,0)<>\"\",IF(ROW()-LOOKUP(2,1/(A$1:A5<>\"\"),ROW(A$1:A5))>LOOKUP(2,1/(A$1:A5),A$1:A5)-1,\"\",\"sub\"),\"\"),\"\"))","v":"sub"}]
[5,{"$f":"IF(A6<>\"\",\"basic\",IFERROR(IF(OFFSET(B6,-1,0)<>\"\",IF(ROW()-LOOKUP(2,1/(A$1:A6<>\"\"),ROW(A$1:A6))>LOOKUP(2,1/(A$1:A6),A$1:A6)-1,\"\",\"sub\"),\"\"),\"\"))","v":"basic"}]
[null,{"$f":"IF(A7<>\"\",\"basic\",IFERROR(IF(OFFSET(B7,-1,0)<>\"\",IF(ROW()-LOOKUP(2,1/(A$1:A7<>\"\"),ROW(A$1:A7))>LOOKUP(2,1/(A$1:A7),A$1:A7)-1,\"\",\"sub\"),\"\"),\"\"))","v":"sub"},null,null,null,null,"  لو a1 تساوى 5 عاوز الخلية b1  يتكتب فيها اساسى والاربع خلايا اللى تحتها يتكتب فيهم فرعى ولو a1 مكتوب فيها  4   تبقى  b1  مكتوب فيها اساسى  والثلاث خلايا اللى تحتها مكتوب فيهم فرعى لو a1 تساوى 3 عاوز الخلية b1  يتكتب فيها اساسى والخليتين اللى تحتها يتكتب فيهم فرعى  وهكذا  "]
[null,{"$f":"IF(A8<>\"\",\"basic\",IFERROR(IF(OFFSET(B8,-1,0)<>\"\",IF(ROW()-LOOKUP(2,1/(A$1:A8<>\"\"),ROW(A$1:A8))>LOOKUP(2,1/(A$1:A8),A$1:A8)-1,\"\",\"sub\"),\"\"),\"\"))","v":"sub"}]
[null,{"$f":"IF(A9<>\"\",\"basic\",IFERROR(IF(OFFSET(B9,-1,0)<>\"\",IF(ROW()-LOOKUP(2,1/(A$1:A9<>\"\"),ROW(A$1:A9))>LOOKUP(2,1/(A$1:A9),A$1:A9)-1,\"\",\"sub\"),\"\"),\"\"))","v":"sub"}]
[null,{"$f":"IF(A10<>\"\",\"basic\",IFERROR(IF(OFFSET(B10,-1,0)<>\"\",IF(ROW()-LOOKUP(2,1/(A$1:A10<>\"\"),ROW(A$1:A10))>LOOKUP(2,1/(A$1:A10),A$1:A10)-1,\"\",\"sub\"),\"\"),\"\"))","v":"sub"}]
[3,{"$f":"IF(A11<>\"\",\"basic\",IFERROR(IF(OFFSET(B11,-1,0)<>\"\",IF(ROW()-LOOKUP(2,1/(A$1:A11<>\"\"),ROW(A$1:A11))>LOOKUP(2,1/(A$1:A11),A$1:A11)-1,\"\",\"sub\"),\"\"),\"\"))","v":"basic"}]
[null,{"$f":"IF(A12<>\"\",\"basic\",IFERROR(IF(OFFSET(B12,-1,0)<>\"\",IF(ROW()-LOOKUP(2,1/(A$1:A12<>\"\"),ROW(A$1:A12))>LOOKUP(2,1/(A$1:A12),A$1:A12)-1,\"\",\"sub\"),\"\"),\"\"))","v":"sub"}]
[null,{"$f":"IF(A13<>\"\",\"basic\",IFERROR(IF(OFFSET(B13,-1,0)<>\"\",IF(ROW()-LOOKUP(2,1/(A$1:A13<>\"\"),ROW(A$1:A13))>LOOKUP(2,1/(A$1:A13),A$1:A13)-1,\"\",\"sub\"),\"\"),\"\"))","v":"sub"}]
[4,{"$f":"IF(A14<>\"\",\"basic\",IFERROR(IF(OFFSET(B14,-1,0)<>\"\",IF(ROW()-LOOKUP(2,1/(A$1:A14<>\"\"),ROW(A$1:A14))>LOOKUP(2,1/(A$1:A14),A$1:A14)-1,\"\",\"sub\"),\"\"),\"\"))","v":"basic"}]
[null,{"$f":"IF(A15<>\"\",\"basic\",IFERROR(IF(OFFSET(B15,-1,0)<>\"\",IF(ROW()-LOOKUP(2,1/(A$1:A15<>\"\"),ROW(A$1:A15))>LOOKUP(2,1/(A$1:A15),A$1:A15)-1,\"\",\"sub\"),\"\"),\"\"))","v":"sub"}]
[null,{"$f":"IF(A16<>\"\",\"basic\",IFERROR(IF(OFFSET(B16,-1,0)<>\"\",IF(ROW()-LOOKUP(2,1/(A$1:A16<>\"\"),ROW(A$1:A16))>LOOKUP(2,1/(A$1:A16),A$1:A16)-1,\"\",\"sub\"),\"\"),\"\"))","v":"sub"}]
[null,{"$f":"IF(A17<>\"\",\"basic\",IFERROR(IF(OFFSET(B17,-1,0)<>\"\",IF(ROW()-LOOKUP(2,1/(A$1:A17<>\"\"),ROW(A$1:A17))>LOOKUP(2,1/(A$1:A17),A$1:A17)-1,\"\",\"sub\"),\"\"),\"\"))","v":"sub"}]
[null,{"$f":"IF(A18<>\"\",\"basic\",IFERROR(IF(OFFSET(B18,-1,0)<>\"\",IF(ROW()-LOOKUP(2,1/(A$1:A18<>\"\"),ROW(A$1:A18))>LOOKUP(2,1/(A$1:A18),A$1:A18)-1,\"\",\"sub\"),\"\"),\"\"))","v":""}]
[null,{"$f":"IF(A19<>\"\",\"basic\",IFERROR(IF(OFFSET(B19,-1,0)<>\"\",IF(ROW()-LOOKUP(2,1/(A$1:A19<>\"\"),ROW(A$1:A19))>LOOKUP(2,1/(A$1:A19),A$1:A19)-1,\"\",\"sub\"),\"\"),\"\"))","v":""}]
[null,{"$f":"IF(A20<>\"\",\"basic\",IFERROR(IF(OFFSET(B20,-1,0)<>\"\",IF(ROW()-LOOKUP(2,1/(A$1:A20<>\"\"),ROW(A$1:A20))>LOOKUP(2,1/(A$1:A20),A$1:A20)-1,\"\",\"sub\"),\"\"),\"\"))","v":""}]
[null,{"$f":"IF(A21<>\"\",\"basic\",IFERROR(IF(OFFSET(B21,-1,0)<>\"\",IF(ROW()-LOOKUP(2,1/(A$1:A21<>\"\"),ROW(A$1:A21))>LOOKUP(2,1/(A$1:A21),A$1:A21)-1,\"\",\"sub\"),\"\"),\"\"))","v":""}]
[null,{"$f":"IF(A22<>\"\",\"basic\",IFERROR(IF(OFFSET(B22,-1,0)<>\"\",IF(ROW()-LOOKUP(2,1/(A$1:A22<>\"\"),ROW(A$1:A22))>LOOKUP(2,1/(A$1:A22),A$1:A22)-1,\"\",\"sub\"),\"\"),\"\"))","v":""}]
[null,{"$f":"IF(A23<>\"\",\"basic\",IFERROR(IF(OFFSET(B23,-1,0)<>\"\",IF(ROW()-LOOKUP(2,1/(A$1:A23<>\"\"),ROW(A$1:A23))>LOOKUP(2,1/(A$1:A23),A$1:A23)-1,\"\",\"sub\"),\"\"),\"\"))","v":""}]
[null,{"$f":"IF(A24<>\"\",\"basic\",IFERROR(IF(OFFSET(B24,-1,0)<>\"\",IF(ROW()-LOOKUP(2,1/(A$1:A24<>\"\"),ROW(A$1:A24))>LOOKUP(2,1/(A$1:A24),A$1:A24)-1,\"\",\"sub\"),\"\"),\"\"))","v":""}]
[null,{"$f":"IF(A25<>\"\",\"basic\",IFERROR(IF(OFFSET(B25,-1,0)<>\"\",IF(ROW()-LOOKUP(2,1/(A$1:A25<>\"\"),ROW(A$1:A25))>LOOKUP(2,1/(A$1:A25),A$1:A25)-1,\"\",\"sub\"),\"\"),\"\"))","v":""}]
[null,{"$f":"IF(A26<>\"\",\"basic\",IFERROR(IF(OFFSET(B26,-1,0)<>\"\",IF(ROW()-LOOKUP(2,1/(A$1:A26<>\"\"),ROW(A$1:A26))>LOOKUP(2,1/(A$1:A26),A$1:A26)-1,\"\",\"sub\"),\"\"),\"\"))","v":""}]
[null,{"$f":"IF(A27<>\"\",\"basic\",IFERROR(IF(OFFSET(B27,-1,0)<>\"\",IF(ROW()-LOOKUP(2,1/(A$1:A27<>\"\"),ROW(A$1:A27))>LOOKUP(2,1/(A$1:A27),A$1:A27)-1,\"\",\"sub\"),\"\"),\"\"))","v":""}]
[null,{"$f":"IF(A28<>\"\",\"basic\",IFERROR(IF(OFFSET(B28,-1,0)<>\"\",IF(ROW()-LOOKUP(2,1/(A$1:A28<>\"\"),ROW(A$1:A28))>LOOKUP(2,1/(A$1:A28),A$1:A28)-1,\"\",\"sub\"),\"\"),\"\"))","v":""}]
[null,{"$f":"IF(A29<>\"\",\"basic\",IFERROR(IF(OFFSET(B29,-1,0)<>\"\",IF(ROW()-LOOKUP(2,1/(A$1:A29<>\"\"),ROW(A$1:A29))>LOOKUP(2,1/(A$1:A29),A$1:A29)-1,\"\",\"sub\"),\"\"),\"\"))","v":""}]
[null,{"$f":"IF(A30<>\"\",\"basic\",IFERROR(IF(OFFSET(B30,-1,0)<>\"\",IF(ROW()-LOOKUP(2,1/(A$1:A30<>\"\"),ROW(A$1:A30))>LOOKUP(2,1/(A$1:A30),A$1:A30)-1,\"\",\"sub\"),\"\"),\"\"))","v":""}]
[null,{"$f":"IF(A31<>\"\",\"basic\",IFERROR(IF(OFFSET(B31,-1,0)<>\"\",IF(ROW()-LOOKUP(2,1/(A$1:A31<>\"\"),ROW(A$1:A31))>LOOKUP(2,1/(A$1:A31),A$1:A31)-1,\"\",\"sub\"),\"\"),\"\"))","v":""}]
[null,{"$f":"IF(A32<>\"\",\"basic\",IFERROR(IF(OFFSET(B32,-1,0)<>\"\",IF(ROW()-LOOKUP(2,1/(A$1:A32<>\"\"),ROW(A$1:A32))>LOOKUP(2,1/(A$1:A32),A$1:A32)-1,\"\",\"sub\"),\"\"),\"\"))","v":""}]
[null,{"$f":"IF(A33<>\"\",\"basic\",IFERROR(IF(OFFSET(B33,-1,0)<>\"\",IF(ROW()-LOOKUP(2,1/(A$1:A33<>\"\"),ROW(A$1:A33))>LOOKUP(2,1/(A$1:A33),A$1:A33)-1,\"\",\"sub\"),\"\"),\"\"))","v":""}]
[null,{"$f":"IF(A34<>\"\",\"basic\",IFERROR(IF(OFFSET(B34,-1,0)<>\"\",IF(ROW()-LOOKUP(2,1/(A$1:A34<>\"\"),ROW(A$1:A34))>LOOKUP(2,1/(A$1:A34),A$1:A34)-1,\"\",\"sub\"),\"\"),\"\"))","v":""}]
[null,{"$f":"IF(A35<>\"\",\"basic\",IFERROR(IF(OFFSET(B35,-1,0)<>\"\",IF(ROW()-LOOKUP(2,1/(A$1:A35<>\"\"),ROW(A$1:A35))>LOOKUP(2,1/(A$1:A35),A$1:A35)-1,\"\",\"sub\"),\"\"),\"\"))","v":""}]
[null,{"$f":"IF(A36<>\"\",\"basic\",IFERROR(IF(OFFSET(B36,-1,0)<>\"\",IF(ROW()-LOOKUP(2,1/(A$1:A36<>\"\"),ROW(A$1:A36))>LOOKUP(2,1/(A$1:A36),A$1:A36)-1,\"\",\"sub\"),\"\"),\"\"))","v":""}]
[null,{"$f":"IF(A37<>\"\",\"basic\",IFERROR(IF(OFFSET(B37,-1,0)<>\"\",IF(ROW()-LOOKUP(2,1/(A$1:A37<>\"\"),ROW(A$1:A37))>LOOKUP(2,1/(A$1:A37),A$1:A37)-1,\"\",\"sub\"),\"\"),\"\"))","v":""}]
[null,{"$f":"IF(A38<>\"\",\"basic\",IFERROR(IF(OFFSET(B38,-1,0)<>\"\",IF(ROW()-LOOKUP(2,1/(A$1:A38<>\"\"),ROW(A$1:A38))>LOOKUP(2,1/(A$1:A38),A$1:A38)-1,\"\",\"sub\"),\"\"),\"\"))","v":""}]
[null,{"$f":"IF(A39<>\"\",\"basic\",IFERROR(IF(OFFSET(B39,-1,0)<>\"\",IF(ROW()-LOOKUP(2,1/(A$1:A39<>\"\"),ROW(A$1:A39))>LOOKUP(2,1/(A$1:A39),A$1:A39)-1,\"\",\"sub\"),\"\"),\"\"))","v":""}]
[null,{"$f":"IF(A40<>\"\",\"basic\",IFERROR(IF(OFFSET(B40,-1,0)<>\"\",IF(ROW()-LOOKUP(2,1/(A$1:A40<>\"\"),ROW(A$1:A40))>LOOKUP(2,1/(A$1:A40),A$1:A40)-1,\"\",\"sub\"),\"\"),\"\"))","v":""}]
[null,{"$f":"IF(A41<>\"\",\"basic\",IFERROR(IF(OFFSET(B41,-1,0)<>\"\",IF(ROW()-LOOKUP(2,1/(A$1:A41<>\"\"),ROW(A$1:A41))>LOOKUP(2,1/(A$1:A41),A$1:A41)-1,\"\",\"sub\"),\"\"),\"\"))","v":""}]
[null,{"$f":"IF(A42<>\"\",\"basic\",IFERROR(IF(OFFSET(B42,-1,0)<>\"\",IF(ROW()-LOOKUP(2,1/(A$1:A42<>\"\"),ROW(A$1:A42))>LOOKUP(2,1/(A$1:A42),A$1:A42)-1,\"\",\"sub\"),\"\"),\"\"))","v":""}]
[null,{"$f":"IF(A43<>\"\",\"basic\",IFERROR(IF(OFFSET(B43,-1,0)<>\"\",IF(ROW()-LOOKUP(2,1/(A$1:A43<>\"\"),ROW(A$1:A43))>LOOKUP(2,1/(A$1:A43),A$1:A43)-1,\"\",\"sub\"),\"\"),\"\"))","v":""}]
[null,{"$f":"IF(A44<>\"\",\"basic\",IFERROR(IF(OFFSET(B44,-1,0)<>\"\",IF(ROW()-LOOKUP(2,1/(A$1:A44<>\"\"),ROW(A$1:A44))>LOOKUP(2,1/(A$1:A44),A$1:A44)-1,\"\",\"sub\"),\"\"),\"\"))","v":""}]
[null,{"$f":"IF(A45<>\"\",\"basic\",IFERROR(IF(OFFSET(B45,-1,0)<>\"\",IF(ROW()-LOOKUP(2,1/(A$1:A45<>\"\"),ROW(A$1:A45))>LOOKUP(2,1/(A$1:A45),A$1:A45)-1,\"\",\"sub\"),\"\"),\"\"))","v":""}]
[null,{"$f":"IF(A46<>\"\",\"basic\",IFERROR(IF(OFFSET(B46,-1,0)<>\"\",IF(ROW()-LOOKUP(2,1/(A$1:A46<>\"\"),ROW(A$1:A46))>LOOKUP(2,1/(A$1:A46),A$1:A46)-1,\"\",\"sub\"),\"\"),\"\"))","v":""}]
[null,{"$f":"IF(A47<>\"\",\"basic\",IFERROR(IF(OFFSET(B47,-1,0)<>\"\",IF(ROW()-LOOKUP(2,1/(A$1:A47<>\"\"),ROW(A$1:A47))>LOOKUP(2,1/(A$1:A47),A$1:A47)-1,\"\",\"sub\"),\"\"),\"\"))","v":""}]
[null,{"$f":"IF(A48<>\"\",\"basic\",IFERROR(IF(OFFSET(B48,-1,0)<>\"\",IF(ROW()-LOOKUP(2,1/(A$1:A48<>\"\"),ROW(A$1:A48))>LOOKUP(2,1/(A$1:A48),A$1:A48)-1,\"\",\"sub\"),\"\"),\"\"))","v":""}]
[null,{"$f":"IF(A49<>\"\",\"basic\",IFERROR(IF(OFFSET(B49,-1,0)<>\"\",IF(ROW()-LOOKUP(2,1/(A$1:A49<>\"\"),ROW(A$1:A49))>LOOKUP(2,1/(A$1:A49),A$1:A49)-1,\"\",\"sub\"),\"\"),\"\"))","v":""}]
[null,{"$f":"IF(A50<>\"\",\"basic\",IFERROR(IF(OFFSET(B50,-1,0)<>\"\",IF(ROW()-LOOKUP(2,1/(A$1:A50<>\"\"),ROW(A$1:A50))>LOOKUP(2,1/(A$1:A50),A$1:A50)-1,\"\",\"sub\"),\"\"),\"\"))","v":""}]
[null,{"$f":"IF(A51<>\"\",\"basic\",IFERROR(IF(OFFSET(B51,-1,0)<>\"\",IF(ROW()-LOOKUP(2,1/(A$1:A51<>\"\"),ROW(A$1:A51))>LOOKUP(2,1/(A$1:A51),A$1:A51)-1,\"\",\"sub\"),\"\"),\"\"))","v":""}]
[null,{"$f":"IF(A52<>\"\",\"basic\",IFERROR(IF(OFFSET(B52,-1,0)<>\"\",IF(ROW()-LOOKUP(2,1/(A$1:A52<>\"\"),ROW(A$1:A52))>LOOKUP(2,1/(A$1:A52),A$1:A52)-1,\"\",\"sub\"),\"\"),\"\"))","v":""}]
[null,{"$f":"IF(A53<>\"\",\"basic\",IFERROR(IF(OFFSET(B53,-1,0)<>\"\",IF(ROW()-LOOKUP(2,1/(A$1:A53<>\"\"),ROW(A$1:A53))>LOOKUP(2,1/(A$1:A53),A$1:A53)-1,\"\",\"sub\"),\"\"),\"\"))","v":""}]
[null,{"$f":"IF(A54<>\"\",\"basic\",IFERROR(IF(OFFSET(B54,-1,0)<>\"\",IF(ROW()-LOOKUP(2,1/(A$1:A54<>\"\"),ROW(A$1:A54))>LOOKUP(2,1/(A$1:A54),A$1:A54)-1,\"\",\"sub\"),\"\"),\"\"))","v":""}]
[null,{"$f":"IF(A55<>\"\",\"basic\",IFERROR(IF(OFFSET(B55,-1,0)<>\"\",IF(ROW()-LOOKUP(2,1/(A$1:A55<>\"\"),ROW(A$1:A55))>LOOKUP(2,1/(A$1:A55),A$1:A55)-1,\"\",\"sub\"),\"\"),\"\"))","v":""}]
[null,{"$f":"IF(A56<>\"\",\"basic\",IFERROR(IF(OFFSET(B56,-1,0)<>\"\",IF(ROW()-LOOKUP(2,1/(A$1:A56<>\"\"),ROW(A$1:A56))>LOOKUP(2,1/(A$1:A56),A$1:A56)-1,\"\",\"sub\"),\"\"),\"\"))","v":""}]
[null,{"$f":"IF(A57<>\"\",\"basic\",IFERROR(IF(OFFSET(B57,-1,0)<>\"\",IF(ROW()-LOOKUP(2,1/(A$1:A57<>\"\"),ROW(A$1:A57))>LOOKUP(2,1/(A$1:A57),A$1:A57)-1,\"\",\"sub\"),\"\"),\"\"))","v":""}]
[null,{"$f":"IF(A58<>\"\",\"basic\",IFERROR(IF(OFFSET(B58,-1,0)<>\"\",IF(ROW()-LOOKUP(2,1/(A$1:A58<>\"\"),ROW(A$1:A58))>LOOKUP(2,1/(A$1:A58),A$1:A58)-1,\"\",\"sub\"),\"\"),\"\"))","v":""}]
[null,{"$f":"IF(A59<>\"\",\"basic\",IFERROR(IF(OFFSET(B59,-1,0)<>\"\",IF(ROW()-LOOKUP(2,1/(A$1:A59<>\"\"),ROW(A$1:A59))>LOOKUP(2,1/(A$1:A59),A$1:A59)-1,\"\",\"sub\"),\"\"),\"\"))","v":""}]

{"sheet":"ورقة2","index":1,"n_rows":0,"n_cols":0,"rows_kept":0,"cut":false,"hidden":false,"merged":[]}

{"sheet":"ورقة3","index":2,"n_rows":0,"n_cols":0,"rows_kept":0,"cut":false,"hidden":false,"merged":[]}