{"text_format":"1","workbook":"xlsx","n_sheets":3,"sheets":["Data","Target_sh","Salim"],"not_rendered":{"charts":0,"images":0,"macros":1,"external_links":0,"defined_names":3,"comments":2,"pivot_tables":0},"unopened":[],"bounds":{"document_bytes":16777216,"sheet_cells":100000,"rows_first":2000,"rows_last":500,"rows_between":2000,"halvings":0,"cell_chars":16384,"cell_head_chars":4096},"cells_cut":0,"cells_raw":0,"read":"whole","date_system":"1900"}

{"sheet":"Data","index":0,"n_rows":21,"n_cols":26,"rows_kept":21,"cut":false,"hidden":false,"merged":[[14,11,14,13],[15,11,15,13]]}
[null,null,null,null,null,null,null,null,null,null,null,null,null,null,null,null,null,null,null,null,null,null,null,null,null,"اجل"]
[null,null,null,null,null,null,null,null,null,null,"اسم العميل","الحركة",null,null,null,null,null,null,null,null,null,null,null,null,null,"نقدا"]
[null,null,null,null,null,null,null,null,null,null,null,"اجل"]
["م","رقم الفاتورة","الحركة","اسم العميل","المنتج","السعر","العدد","القيمة "]
[1,3001,"نقدا","علي","كراسي",2500,20,{"$f":"F5*G5","v":50000},null,null,{"$f":"SUMPRODUCT($H$5:$H$100,--($D$5:$D$100=$L$16),--($C$5:$C$100=$L$3))","v":150000}]
[2,3001,"اجل","علي","ماسات",4000,20,{"$f":"F6*G6","v":80000}]
[3,3001,"اجل","علي","كنب",15000,3,45000,null,"اجل"]
[4,3002,"نقدا","خالد","ماسات",4000,5,20000,null,"نقدا"]
[5,3003,"نقدا","salim","كراسي",2500,50,125000]
[6,3003,"اجل","عبدالوهاب","ماسات",4000,40,160000]
[7,3004,"اجل","علي","كراسي",2500,10,25000]
[8,3004,"اجل","salim","ماسات",4000,10,40000]
[9,3005,"اجل","صفوان","كنب",15000,5,75000]
[10,3006,"نقدا","علي","أبواب",20000,2,40000]
[11,3006,"نقدا","علي","نوافذ",6000,6,36000,null,null,null,"كشف حساب عميل"]
[12,3007,"نقدا","عبدالوهاب","كومدينه",4500,15,67500,null,null,null,"علي"]
[13,3007,"اجل","عبدالوهاب","سرير",12000,15,180000,null,null,null,"رقم الفاتورة","مدين","دائن"]
[14,3006,"اجل","A1","أبواب",20000,2,{"$f":"F18*G18","v":40000},null,null,null,3001,175000]
[15,3006,"نقدا","A2","نوافذ",6000,6,36000,null,null,null,3004,null,65000]
[16,3007,"نقدا","A1","كومدينه",4500,15,67500,null,null,null,3006,76000]
[17,3007,"اجل","A3","سرير",12000,15,180000,null,null,null,"اجمالي",{"$f":"SUM(M18:M20)","v":251000},{"$f":"SUM(N18:N20)","v":65000}]

{"sheet":"Target_sh","index":1,"n_rows":21,"n_cols":26,"rows_kept":21,"cut":false,"hidden":false,"merged":[[14,11,14,13],[15,11,15,13]]}
[null,null,null,null,null,null,null,null,null,null,null,null,null,null,null,null,null,null,null,null,null,null,null,null,null,"اجل"]
[null,null,null,null,null,null,null,null,null,null,"اسم العميل",null,null,null,null,null,null,null,null,null,null,null,null,null,null,"نقدا"]
["رقم الفاتورة","اجل","رقم الفاتورة","نقدا",null,null,null,null,null,null,"علي"]
[3001,80000,3001,50000]
[3001,45000,3006,40000]
[3004,25000,3006,36000]
["المجموع:",150000,"المجموع:",126000]
[]
[]
[]
[]
[]
[]
[]
[null,null,null,null,null,null,null,null,null,null,null,"كشف حساب عميل"]
[null,null,null,null,null,null,null,null,null,null,null,"علي"]
[null,null,null,null,null,null,null,null,null,null,null,"رقم الفاتورة","مدين","دائن"]
[null,null,null,null,null,null,null,null,null,null,null,3001,175000]
[null,null,null,null,null,null,null,null,null,null,null,3004,null,65000]
[null,null,null,null,null,null,null,null,null,null,null,3006,76000]
[null,null,null,null,null,null,null,null,null,null,null,"اجمالي",{"$f":"SUM(M18:M20)","v":251000},{"$f":"SUM(N18:N20)","v":65000}]

{"sheet":"Salim","index":2,"n_rows":1000,"n_cols":5,"rows_kept":1000,"cut":false,"hidden":true,"merged":[]}
[{"$f":"IF(ROWS($A$1:A1)>SUM(IF(FREQUENCY(IF(Data!$D$5:$D$1003<>\"\",MATCH(\"~\"&Data!$D$5:$D$1003,Data!$D$5:$D$1003&\"\",0)),ROW($A$2:$A$1000)-ROW($A$2)+1),1)),\"\",INDEX(Data!$D$5:$D$1003,SMALL(IF(FREQUENCY(IF(Data!$D$5:$D$1003<>\"\",MATCH(\"~\"&Data!$D$5:$D$1003,Data!$D$5:$D$1003&\"\",0)),ROW($A$2:$A$1000)-ROW($A$2)+1),ROW($A$2:$A$1000)-ROW($A$2)+1),ROWS($A$1:A1))))","v":"علي"},null,{"$f":"COUNTIF($A$1:$A$1000,\"?*\")","v":8},null,{"$f":"$A$1:INDEX($A$1:$A$1000,COUNTIF($A$1:$A$1000,\"?*\"))","v":"علي"}]
[{"$f":"IF(ROWS($A$1:A2)>SUM(IF(FREQUENCY(IF(Data!$D$5:$D$1003<>\"\",MATCH(\"~\"&Data!$D$5:$D$1003,Data!$D$5:$D$1003&\"\",0)),ROW($A$2:$A$1000)-ROW($A$2)+1),1)),\"\",INDEX(Data!$D$5:$D$1003,SMALL(IF(FREQUENCY(IF(Data!$D$5:$D$1003<>\"\",MATCH(\"~\"&Data!$D$5:$D$1003,Data!$D$5:$D$1003&\"\",0)),ROW($A$2:$A$1000)-ROW($A$2)+1),ROW($A$2:$A$1000)-ROW($A$2)+1),ROWS($A$1:A2))))","v":"خالد"}]
[{"$f":"IF(ROWS($A$1:A3)>SUM(IF(FREQUENCY(IF(Data!$D$5:$D$1003<>\"\",MATCH(\"~\"&Data!$D$5:$D$1003,Data!$D$5:$D$1003&\"\",0)),ROW($A$2:$A$1000)-ROW($A$2)+1),1)),\"\",INDEX(Data!$D$5:$D$1003,SMALL(IF(FREQUENCY(IF(Data!$D$5:$D$1003<>\"\",MATCH(\"~\"&Data!$D$5:$D$1003,Data!$D$5:$D$1003&\"\",0)),ROW($A$2:$A$1000)-ROW($A$2)+1),ROW($A$2:$A$1000)-ROW($A$2)+1),ROWS($A$1:A3))))","v":"salim"}]
[{"$f":"IF(ROWS($A$1:A4)>SUM(IF(FREQUENCY(IF(Data!$D$5:$D$1003<>\"\",MATCH(\"~\"&Data!$D$5:$D$1003,Data!$D$5:$D$1003&\"\",0)),ROW($A$2:$A$1000)-ROW($A$2)+1),1)),\"\",INDEX(Data!$D$5:$D$1003,SMALL(IF(FREQUENCY(IF(Data!$D$5:$D$1003<>\"\",MATCH(\"~\"&Data!$D$5:$D$1003,Data!$D$5:$D$1003&\"\",0)),ROW($A$2:$A$1000)-ROW($A$2)+1),ROW($A$2:$A$1000)-ROW($A$2)+1),ROWS($A$1:A4))))","v":"عبدالوهاب"}]
[{"$f":"IF(ROWS($A$1:A5)>SUM(IF(FREQUENCY(IF(Data!$D$5:$D$1003<>\"\",MATCH(\"~\"&Data!$D$5:$D$1003,Data!$D$5:$D$1003&\"\",0)),ROW($A$2:$A$1000)-ROW($A$2)+1),1)),\"\",INDEX(Data!$D$5:$D$1003,SMALL(IF(FREQUENCY(IF(Data!$D$5:$D$1003<>\"\",MATCH(\"~\"&Data!$D$5:$D$1003,Data!$D$5:$D$1003&\"\",0)),ROW($A$2:$A$1000)-ROW($A$2)+1),ROW($A$2:$A$1000)-ROW($A$2)+1),ROWS($A$1:A5))))","v":"صفوان"}]
[{"$f":"IF(ROWS($A$1:A6)>SUM(IF(FREQUENCY(IF(Data!$D$5:$D$1003<>\"\",MATCH(\"~\"&Data!$D$5:$D$1003,Data!$D$5:$D$1003&\"\",0)),ROW($A$2:$A$1000)-ROW($A$2)+1),1)),\"\",INDEX(Data!$D$5:$D$1003,SMALL(IF(FREQUENCY(IF(Data!$D$5:$D$1003<>\"\",MATCH(\"~\"&Data!$D$5:$D$1003,Data!$D$5:$D$1003&\"\",0)),ROW($A$2:$A$1000)-ROW($A$2)+1),ROW($A$2:$A$1000)-ROW($A$2)+1),ROWS($A$1:A6))))","v":"A1"}]
[{"$f":"IF(ROWS($A$1:A7)>SUM(IF(FREQUENCY(IF(Data!$D$5:$D$1003<>\"\",MATCH(\"~\"&Data!$D$5:$D$1003,Data!$D$5:$D$1003&\"\",0)),ROW($A$2:$A$1000)-ROW($A$2)+1),1)),\"\",INDEX(Data!$D$5:$D$1003,SMALL(IF(FREQUENCY(IF(Data!$D$5:$D$1003<>\"\",MATCH(\"~\"&Data!$D$5:$D$1003,Data!$D$5:$D$1003&\"\",0)),ROW($A$2:$A$1000)-ROW($A$2)+1),ROW($A$2:$A$1000)-ROW($A$2)+1),ROWS($A$1:A7))))","v":"A2"}]
[{"$f":"IF(ROWS($A$1:A8)>SUM(IF(FREQUENCY(IF(Data!$D$5:$D$1003<>\"\",MATCH(\"~\"&Data!$D$5:$D$1003,Data!$D$5:$D$1003&\"\",0)),ROW($A$2:$A$1000)-ROW($A$2)+1),1)),\"\",INDEX(Data!$D$5:$D$1003,SMALL(IF(FREQUENCY(IF(Data!$D$5:$D$1003<>\"\",MATCH(\"~\"&Data!$D$5:$D$1003,Data!$D$5:$D$1003&\"\",0)),ROW($A$2:$A$1000)-ROW($A$2)+1),ROW($A$2:$A$1000)-ROW($A$2)+1),ROWS($A$1:A8))))","v":"A3"}]
[{"$f":"IF(ROWS($A$1:A9)>SUM(IF(FREQUENCY(IF(Data!$D$5:$D$1003<>\"\",MATCH(\"~\"&Data!$D$5:$D$1003,Data!$D$5:$D$1003&\"\",0)),ROW($A$2:$A$1000)-ROW($A$2)+1),1)),\"\",INDEX(Data!$D$5:$D$1003,SMALL(IF(FREQUENCY(IF(Data!$D$5:$D$1003<>\"\",MATCH(\"~\"&Data!$D$5:$D$1003,Data!$D$5:$D$1003&\"\",0)),ROW($A$2:$A$1000)-ROW($A$2)+1),ROW($A$2:$A$1000)-ROW($A$2)+1),ROWS($A$1:A9))))","v":""}]
[{"$f":"IF(ROWS($A$1:A10)>SUM(IF(FREQUENCY(IF(Data!$D$5:$D$1003<>\"\",MATCH(\"~\"&Data!$D$5:$D$1003,Data!$D$5:$D$1003&\"\",0)),ROW($A$2:$A$1000)-ROW($A$2)+1),1)),\"\",INDEX(Data!$D$5:$D$1003,SMALL(IF(FREQUENCY(IF(Data!$D$5:$D$1003<>\"\",MATCH(\"~\"&Data!$D$5:$D$1003,Data!$D$5:$D$1003&\"\",0)),ROW($A$2:$A$1000)-ROW($A$2)+1),ROW($A$2:$A$1000)-ROW($A$2)+1),ROWS($A$1:A10))))","v":""}]
[{"$f":"IF(ROWS($A$1:A11)>SUM(IF(FREQUENCY(IF(Data!$D$5:$D$1003<>\"\",MATCH(\"~\"&Data!$D$5:$D$1003,Data!$D$5:$D$1003&\"\",0)),ROW($A$2:$A$1000)-ROW($A$2)+1),1)),\"\",INDEX(Data!$D$5:$D$1003,SMALL(IF(FREQUENCY(IF(Data!$D$5:$D$1003<>\"\",MATCH(\"~\"&Data!$D$5:$D$1003,Data!$D$5:$D$1003&\"\",0)),ROW($A$2:$A$1000)-ROW($A$2)+1),ROW($A$2:$A$1000)-ROW($A$2)+1),ROWS($A$1:A11))))","v":""}]
[{"$f":"IF(ROWS($A$1:A12)>SUM(IF(FREQUENCY(IF(Data!$D$5:$D$1003<>\"\",MATCH(\"~\"&Data!$D$5:$D$1003,Data!$D$5:$D$1003&\"\",0)),ROW($A$2:$A$1000)-ROW($A$2)+1),1)),\"\",INDEX(Data!$D$5:$D$1003,SMALL(IF(FREQUENCY(IF(Data!$D$5:$D$1003<>\"\",MATCH(\"~\"&Data!$D$5:$D$1003,Data!$D$5:$D$1003&\"\",0)),ROW($A$2:$A$1000)-ROW($A$2)+1),ROW($A$2:$A$1000)-ROW($A$2)+1),ROWS($A$1:A12))))","v":""}]
[{"$f":"IF(ROWS($A$1:A13)>SUM(IF(FREQUENCY(IF(Data!$D$5:$D$1003<>\"\",MATCH(\"~\"&Data!$D$5:$D$1003,Data!$D$5:$D$1003&\"\",0)),ROW($A$2:$A$1000)-ROW($A$2)+1),1)),\"\",INDEX(Data!$D$5:$D$1003,SMALL(IF(FREQUENCY(IF(Data!$D$5:$D$1003<>\"\",MATCH(\"~\"&Data!$D$5:$D$1003,Data!$D$5:$D$1003&\"\",0)),ROW($A$2:$A$1000)-ROW($A$2)+1),ROW($A$2:$A$1000)-ROW($A$2)+1),ROWS($A$1:A13))))","v":""}]
[{"$f":"IF(ROWS($A$1:A14)>SUM(IF(FREQUENCY(IF(Data!$D$5:$D$1003<>\"\",MATCH(\"~\"&Data!$D$5:$D$1003,Data!$D$5:$D$1003&\"\",0)),ROW($A$2:$A$1000)-ROW($A$2)+1),1)),\"\",INDEX(Data!$D$5:$D$1003,SMALL(IF(FREQUENCY(IF(Data!$D$5:$D$1003<>\"\",MATCH(\"~\"&Data!$D$5:$D$1003,Data!$D$5:$D$1003&\"\",0)),ROW($A$2:$A$1000)-ROW($A$2)+1),ROW($A$2:$A$1000)-ROW($A$2)+1),ROWS($A$1:A14))))","v":""}]
[{"$f":"IF(ROWS($A$1:A15)>SUM(IF(FREQUENCY(IF(Data!$D$5:$D$1003<>\"\",MATCH(\"~\"&Data!$D$5:$D$1003,Data!$D$5:$D$1003&\"\",0)),ROW($A$2:$A$1000)-ROW($A$2)+1),1)),\"\",INDEX(Data!$D$5:$D$1003,SMALL(IF(FREQUENCY(IF(Data!$D$5:$D$1003<>\"\",MATCH(\"~\"&Data!$D$5:$D$1003,Data!$D$5:$D$1003&\"\",0)),ROW($A$2:$A$1000)-ROW($A$2)+1),ROW($A$2:$A$1000)-ROW($A$2)+1),ROWS($A$1:A15))))","v":""}]
[{"$f":"IF(ROWS($A$1:A16)>SUM(IF(FREQUENCY(IF(Data!$D$5:$D$1003<>\"\",MATCH(\"~\"&Data!$D$5:$D$1003,Data!$D$5:$D$1003&\"\",0)),ROW($A$2:$A$1000)-ROW($A$2)+1),1)),\"\",INDEX(Data!$D$5:$D$1003,SMALL(IF(FREQUENCY(IF(Data!$D$5:$D$1003<>\"\",MATCH(\"~\"&Data!$D$5:$D$1003,Data!$D$5:$D$1003&\"\",0)),ROW($A$2:$A$1000)-ROW($A$2)+1),ROW($A$2:$A$1000)-ROW($A$2)+1),ROWS($A$1:A16))))","v":""}]
[{"$f":"IF(ROWS($A$1:A17)>SUM(IF(FREQUENCY(IF(Data!$D$5:$D$1003<>\"\",MATCH(\"~\"&Data!$D$5:$D$1003,Data!$D$5:$D$1003&\"\",0)),ROW($A$2:$A$1000)-ROW($A$2)+1),1)),\"\",INDEX(Data!$D$5:$D$1003,SMALL(IF(FREQUENCY(IF(Data!$D$5:$D$1003<>\"\",MATCH(\"~\"&Data!$D$5:$D$1003,Data!$D$5:$D$1003&\"\",0)),ROW($A$2:$A$1000)-ROW($A$2)+1),ROW($A$2:$A$1000)-ROW($A$2)+1),ROWS($A$1:A17))))","v":""}]
[{"$f":"IF(ROWS($A$1:A18)>SUM(IF(FREQUENCY(IF(Data!$D$5:$D$1003<>\"\",MATCH(\"~\"&Data!$D$5:$D$1003,Data!$D$5:$D$1003&\"\",0)),ROW($A$2:$A$1000)-ROW($A$2)+1),1)),\"\",INDEX(Data!$D$5:$D$1003,SMALL(IF(FREQUENCY(IF(Data!$D$5:$D$1003<>\"\",MATCH(\"~\"&Data!$D$5:$D$1003,Data!$D$5:$D$1003&\"\",0)),ROW($A$2:$A$1000)-ROW($A$2)+1),ROW($A$2:$A$1000)-ROW($A$2)+1),ROWS($A$1:A18))))","v":""}]
[{"$f":"IF(ROWS($A$1:A19)>SUM(IF(FREQUENCY(IF(Data!$D$5:$D$1003<>\"\",MATCH(\"~\"&Data!$D$5:$D$1003,Data!$D$5:$D$1003&\"\",0)),ROW($A$2:$A$1000)-ROW($A$2)+1),1)),\"\",INDEX(Data!$D$5:$D$1003,SMALL(IF(FREQUENCY(IF(Data!$D$5:$D$1003<>\"\",MATCH(\"~\"&Data!$D$5:$D$1003,Data!$D$5:$D$1003&\"\",0)),ROW($A$2:$A$1000)-ROW($A$2)+1),ROW($A$2:$A$1000)-ROW($A$2)+1),ROWS($A$1:A19))))","v":""}]
[{"$f":"IF(ROWS($A$1:A20)>SUM(IF(FREQUENCY(IF(Data!$D$5:$D$1003<>\"\",MATCH(\"~\"&Data!$D$5:$D$1003,Data!$D$5:$D$1003&\"\",0)),ROW($A$2:$A$1000)-ROW($A$2)+1),1)),\"\",INDEX(Data!$D$5:$D$1003,SMALL(IF(FREQUENCY(IF(Data!$D$5:$D$1003<>\"\",MATCH(\"~\"&Data!$D$5:$D$1003,Data!$D$5:$D$1003&\"\",0)),ROW($A$2:$A$1000)-ROW($A$2)+1),ROW($A$2:$A$1000)-ROW($A$2)+1),ROWS($A$1:A20))))","v":""}]
[{"$f":"IF(ROWS($A$1:A21)>SUM(IF(FREQUENCY(IF(Data!$D$5:$D$1003<>\"\",MATCH(\"~\"&Data!$D$5:$D$1003,Data!$D$5:$D$1003&\"\",0)),ROW($A$2:$A$1000)-ROW($A$2)+1),1)),\"\",INDEX(Data!$D$5:$D$1003,SMALL(IF(FREQUENCY(IF(Data!$D$5:$D$1003<>\"\",MATCH(\"~\"&Data!$D$5:$D$1003,Data!$D$5:$D$1003&\"\",0)),ROW($A$2:$A$1000)-ROW($A$2)+1),ROW($A$2:$A$1000)-ROW($A$2)+1),ROWS($A$1:A21))))","v":""}]
[{"$f":"IF(ROWS($A$1:A22)>SUM(IF(FREQUENCY(IF(Data!$D$5:$D$1003<>\"\",MATCH(\"~\"&Data!$D$5:$D$1003,Data!$D$5:$D$1003&\"\",0)),ROW($A$2:$A$1000)-ROW($A$2)+1),1)),\"\",INDEX(Data!$D$5:$D$1003,SMALL(IF(FREQUENCY(IF(Data!$D$5:$D$1003<>\"\",MATCH(\"~\"&Data!$D$5:$D$1003,Data!$D$5:$D$1003&\"\",0)),ROW($A$2:$A$1000)-ROW($A$2)+1),ROW($A$2:$A$1000)-ROW($A$2)+1),ROWS($A$1:A22))))","v":""}]
[{"$f":"IF(ROWS($A$1:A23)>SUM(IF(FREQUENCY(IF(Data!$D$5:$D$1003<>\"\",MATCH(\"~\"&Data!$D$5:$D$1003,Data!$D$5:$D$1003&\"\",0)),ROW($A$2:$A$1000)-ROW($A$2)+1),1)),\"\",INDEX(Data!$D$5:$D$1003,SMALL(IF(FREQUENCY(IF(Data!$D$5:$D$1003<>\"\",MATCH(\"~\"&Data!$D$5:$D$1003,Data!$D$5:$D$1003&\"\",0)),ROW($A$2:$A$1000)-ROW($A$2)+1),ROW($A$2:$A$1000)-ROW($A$2)+1),ROWS($A$1:A23))))","v":""}]
[{"$f":"IF(ROWS($A$1:A24)>SUM(IF(FREQUENCY(IF(Data!$D$5:$D$1003<>\"\",MATCH(\"~\"&Data!$D$5:$D$1003,Data!$D$5:$D$1003&\"\",0)),ROW($A$2:$A$1000)-ROW($A$2)+1),1)),\"\",INDEX(Data!$D$5:$D$1003,SMALL(IF(FREQUENCY(IF(Data!$D$5:$D$1003<>\"\",MATCH(\"~\"&Data!$D$5:$D$1003,Data!$D$5:$D$1003&\"\",0)),ROW($A$2:$A$1000)-ROW($A$2)+1),ROW($A$2:$A$1000)-ROW($A$2)+1),ROWS($A$1:A24))))","v":""}]
[{"$f":"IF(ROWS($A$1:A25)>SUM(IF(FREQUENCY(IF(Data!$D$5:$D$1003<>\"\",MATCH(\"~\"&Data!$D$5:$D$1003,Data!$D$5:$D$1003&\"\",0)),ROW($A$2:$A$1000)-ROW($A$2)+1),1)),\"\",INDEX(Data!$D$5:$D$1003,SMALL(IF(FREQUENCY(IF(Data!$D$5:$D$1003<>\"\",MATCH(\"~\"&Data!$D$5:$D$1003,Data!$D$5:$D$1003&\"\",0)),ROW($A$2:$A$1000)-ROW($A$2)+1),ROW($A$2:$A$1000)-ROW($A$2)+1),ROWS($A$1:A25))))","v":""}]
[{"$f":"IF(ROWS($A$1:A26)>SUM(IF(FREQUENCY(IF(Data!$D$5:$D$1003<>\"\",MATCH(\"~\"&Data!$D$5:$D$1003,Data!$D$5:$D$1003&\"\",0)),ROW($A$2:$A$1000)-ROW($A$2)+1),1)),\"\",INDEX(Data!$D$5:$D$1003,SMALL(IF(FREQUENCY(IF(Data!$D$5:$D$1003<>\"\",MATCH(\"~\"&Data!$D$5:$D$1003,Data!$D$5:$D$1003&\"\",0)),ROW($A$2:$A$1000)-ROW($A$2)+1),ROW($A$2:$A$1000)-ROW($A$2)+1),ROWS($A$1:A26))))","v":""}]
[{"$f":"IF(ROWS($A$1:A27)>SUM(IF(FREQUENCY(IF(Data!$D$5:$D$1003<>\"\",MATCH(\"~\"&Data!$D$5:$D$1003,Data!$D$5:$D$1003&\"\",0)),ROW($A$2:$A$1000)-ROW($A$2)+1),1)),\"\",INDEX(Data!$D$5:$D$1003,SMALL(IF(FREQUENCY(IF(Data!$D$5:$D$1003<>\"\",MATCH(\"~\"&Data!$D$5:$D$1003,Data!$D$5:$D$1003&\"\",0)),ROW($A$2:$A$1000)-ROW($A$2)+1),ROW($A$2:$A$1000)-ROW($A$2)+1),ROWS($A$1:A27))))","v":""}]
[{"$f":"IF(ROWS($A$1:A28)>SUM(IF(FREQUENCY(IF(Data!$D$5:$D$1003<>\"\",MATCH(\"~\"&Data!$D$5:$D$1003,Data!$D$5:$D$1003&\"\",0)),ROW($A$2:$A$1000)-ROW($A$2)+1),1)),\"\",INDEX(Data!$D$5:$D$1003,SMALL(IF(FREQUENCY(IF(Data!$D$5:$D$1003<>\"\",MATCH(\"~\"&Data!$D$5:$D$1003,Data!$D$5:$D$1003&\"\",0)),ROW($A$2:$A$1000)-ROW($A$2)+1),ROW($A$2:$A$1000)-ROW($A$2)+1),ROWS($A$1:A28))))","v":""}]
[{"$f":"IF(ROWS($A$1:A29)>SUM(IF(FREQUENCY(IF(Data!$D$5:$D$1003<>\"\",MATCH(\"~\"&Data!$D$5:$D$1003,Data!$D$5:$D$1003&\"\",0)),ROW($A$2:$A$1000)-ROW($A$2)+1),1)),\"\",INDEX(Data!$D$5:$D$1003,SMALL(IF(FREQUENCY(IF(Data!$D$5:$D$1003<>\"\",MATCH(\"~\"&Data!$D$5:$D$1003,Data!$D$5:$D$1003&\"\",0)),ROW($A$2:$A$1000)-ROW($A$2)+1),ROW($A$2:$A$1000)-ROW($A$2)+1),ROWS($A$1:A29))))","v":""}]
[{"$f":"IF(ROWS($A$1:A30)>SUM(IF(FREQUENCY(IF(Data!$D$5:$D$1003<>\"\",MATCH(\"~\"&Data!$D$5:$D$1003,Data!$D$5:$D$1003&\"\",0)),ROW($A$2:$A$1000)-ROW($A$2)+1),1)),\"\",INDEX(Data!$D$5:$D$1003,SMALL(IF(FREQUENCY(IF(Data!$D$5:$D$1003<>\"\",MATCH(\"~\"&Data!$D$5:$D$1003,Data!$D$5:$D$1003&\"\",0)),ROW($A$2:$A$1000)-ROW($A$2)+1),ROW($A$2:$A$1000)-ROW($A$2)+1),ROWS($A$1:A30))))","v":""}]
[{"$f":"IF(ROWS($A$1:A31)>SUM(IF(FREQUENCY(IF(Data!$D$5:$D$1003<>\"\",MATCH(\"~\"&Data!$D$5:$D$1003,Data!$D$5:$D$1003&\"\",0)),ROW($A$2:$A$1000)-ROW($A$2)+1),1)),\"\",INDEX(Data!$D$5:$D$1003,SMALL(IF(FREQUENCY(IF(Data!$D$5:$D$1003<>\"\",MATCH(\"~\"&Data!$D$5:$D$1003,Data!$D$5:$D$1003&\"\",0)),ROW($A$2:$A$1000)-ROW($A$2)+1),ROW($A$2:$A$1000)-ROW($A$2)+1),ROWS($A$1:A31))))","v":""}]
[{"$f":"IF(ROWS($A$1:A32)>SUM(IF(FREQUENCY(IF(Data!$D$5:$D$1003<>\"\",MATCH(\"~\"&Data!$D$5:$D$1003,Data!$D$5:$D$1003&\"\",0)),ROW($A$2:$A$1000)-ROW($A$2)+1),1)),\"\",INDEX(Data!$D$5:$D$1003,SMALL(IF(FREQUENCY(IF(Data!$D$5:$D$1003<>\"\",MATCH(\"~\"&Data!$D$5:$D$1003,Data!$D$5:$D$1003&\"\",0)),ROW($A$2:$A$1000)-ROW($A$2)+1),ROW($A$2:$A$1000)-ROW($A$2)+1),ROWS($A$1:A32))))","v":""}]
[{"$f":"IF(ROWS($A$1:A33)>SUM(IF(FREQUENCY(IF(Data!$D$5:$D$1003<>\"\",MATCH(\"~\"&Data!$D$5:$D$1003,Data!$D$5:$D$1003&\"\",0)),ROW($A$2:$A$1000)-ROW($A$2)+1),1)),\"\",INDEX(Data!$D$5:$D$1003,SMALL(IF(FREQUENCY(IF(Data!$D$5:$D$1003<>\"\",MATCH(\"~\"&Data!$D$5:$D$1003,Data!$D$5:$D$1003&\"\",0)),ROW($A$2:$A$1000)-ROW($A$2)+1),ROW($A$2:$A$1000)-ROW($A$2)+1),ROWS($A$1:A33))))","v":""}]
[{"$f":"IF(ROWS($A$1:A34)>SUM(IF(FREQUENCY(IF(Data!$D$5:$D$1003<>\"\",MATCH(\"~\"&Data!$D$5:$D$1003,Data!$D$5:$D$1003&\"\",0)),ROW($A$2:$A$1000)-ROW($A$2)+1),1)),\"\",INDEX(Data!$D$5:$D$1003,SMALL(IF(FREQUENCY(IF(Data!$D$5:$D$1003<>\"\",MATCH(\"~\"&Data!$D$5:$D$1003,Data!$D$5:$D$1003&\"\",0)),ROW($A$2:$A$1000)-ROW($A$2)+1),ROW($A$2:$A$1000)-ROW($A$2)+1),ROWS($A$1:A34))))","v":""}]
[{"$f":"IF(ROWS($A$1:A35)>SUM(IF(FREQUENCY(IF(Data!$D$5:$D$1003<>\"\",MATCH(\"~\"&Data!$D$5:$D$1003,Data!$D$5:$D$1003&\"\",0)),ROW($A$2:$A$1000)-ROW($A$2)+1),1)),\"\",INDEX(Data!$D$5:$D$1003,SMALL(IF(FREQUENCY(IF(Data!$D$5:$D$1003<>\"\",MATCH(\"~\"&Data!$D$5:$D$1003,Data!$D$5:$D$1003&\"\",0)),ROW($A$2:$A$1000)-ROW($A$2)+1),ROW($A$2:$A$1000)-ROW($A$2)+1),ROWS($A$1:A35))))","v":""}]
[{"$f":"IF(ROWS($A$1:A36)>SUM(IF(FREQUENCY(IF(Data!$D$5:$D$1003<>\"\",MATCH(\"~\"&Data!$D$5:$D$1003,Data!$D$5:$D$1003&\"\",0)),ROW($A$2:$A$1000)-ROW($A$2)+1),1)),\"\",INDEX(Data!$D$5:$D$1003,SMALL(IF(FREQUENCY(IF(Data!$D$5:$D$1003<>\"\",MATCH(\"~\"&Data!$D$5:$D$1003,Data!$D$5:$D$1003&\"\",0)),ROW($A$2:$A$1000)-ROW($A$2)+1),ROW($A$2:$A$1000)-ROW($A$2)+1),ROWS($A$1:A36))))","v":""}]
[{"$f":"IF(ROWS($A$1:A37)>SUM(IF(FREQUENCY(IF(Data!$D$5:$D$1003<>\"\",MATCH(\"~\"&Data!$D$5:$D$1003,Data!$D$5:$D$1003&\"\",0)),ROW($A$2:$A$1000)-ROW($A$2)+1),1)),\"\",INDEX(Data!$D$5:$D$1003,SMALL(IF(FREQUENCY(IF(Data!$D$5:$D$1003<>\"\",MATCH(\"~\"&Data!$D$5:$D$1003,Data!$D$5:$D$1003&\"\",0)),ROW($A$2:$A$1000)-ROW($A$2)+1),ROW($A$2:$A$1000)-ROW($A$2)+1),ROWS($A$1:A37))))","v":""}]
[{"$f":"IF(ROWS($A$1:A38)>SUM(IF(FREQUENCY(IF(Data!$D$5:$D$1003<>\"\",MATCH(\"~\"&Data!$D$5:$D$1003,Data!$D$5:$D$1003&\"\",0)),ROW($A$2:$A$1000)-ROW($A$2)+1),1)),\"\",INDEX(Data!$D$5:$D$1003,SMALL(IF(FREQUENCY(IF(Data!$D$5:$D$1003<>\"\",MATCH(\"~\"&Data!$D$5:$D$1003,Data!$D$5:$D$1003&\"\",0)),ROW($A$2:$A$1000)-ROW($A$2)+1),ROW($A$2:$A$1000)-ROW($A$2)+1),ROWS($A$1:A38))))","v":""}]
[{"$f":"IF(ROWS($A$1:A39)>SUM(IF(FREQUENCY(IF(Data!$D$5:$D$1003<>\"\",MATCH(\"~\"&Data!$D$5:$D$1003,Data!$D$5:$D$1003&\"\",0)),ROW($A$2:$A$1000)-ROW($A$2)+1),1)),\"\",INDEX(Data!$D$5:$D$1003,SMALL(IF(FREQUENCY(IF(Data!$D$5:$D$1003<>\"\",MATCH(\"~\"&Data!$D$5:$D$1003,Data!$D$5:$D$1003&\"\",0)),ROW($A$2:$A$1000)-ROW($A$2)+1),ROW($A$2:$A$1000)-ROW($A$2)+1),ROWS($A$1:A39))))","v":""}]
[{"$f":"IF(ROWS($A$1:A40)>SUM(IF(FREQUENCY(IF(Data!$D$5:$D$1003<>\"\",MATCH(\"~\"&Data!$D$5:$D$1003,Data!$D$5:$D$1003&\"\",0)),ROW($A$2:$A$1000)-ROW($A$2)+1),1)),\"\",INDEX(Data!$D$5:$D$1003,SMALL(IF(FREQUENCY(IF(Data!$D$5:$D$1003<>\"\",MATCH(\"~\"&Data!$D$5:$D$1003,Data!$D$5:$D$1003&\"\",0)),ROW($A$2:$A$1000)-ROW($A$2)+1),ROW($A$2:$A$1000)-ROW($A$2)+1),ROWS($A$1:A40))))","v":""}]
{"$rows_left_out":960}