{"text_format":"1","workbook":"xlsx","n_sheets":3,"sheets":["Salim","Sheet3","Target_SH"],"not_rendered":{"charts":0,"images":0,"macros":1,"external_links":0,"defined_names":1,"comments":0,"pivot_tables":0},"unopened":[],"bounds":{"document_bytes":16777216,"sheet_cells":100000,"rows_first":2000,"rows_last":500,"rows_between":2000,"halvings":0,"cell_chars":16384,"cell_head_chars":4096},"cells_cut":0,"cells_raw":0,"read":"whole","date_system":"1900"}

{"sheet":"Salim","index":0,"n_rows":9,"n_cols":11,"rows_kept":9,"cut":false,"hidden":false,"merged":[]}
["ID CARD","company","NAME","JOB","NATIONALITY","Passport No.","PASS. EXPIRY","ID NUMBER","U.I.D NO.","Date of birth","MOB. NO."]
[17004,"A1","ABBAS ASANAR","CLEANER / PUBLIC BUILDINGS","INDIA","K2719359","2023-01-31",784199128620400,55361034,"1991-11-06"]
[8537,"A2","ABBAS ROWTHER MOHAMED","CLEANER / PUBLIC BUILDINGS","INDIA","S5787121","2028-06-06",784197046917916,1297024,"1970-09-15","050-2561752"]
[12896,"A3","ABDUL AJEEZ MUJEEBUR RAHMAN","CLEANER / PUBLIC BUILDINGS","INDIA","T2800404","2029-07-22",784198008408381,1747925,"1980-06-09","050-6723853"]
[8324,"A4","ABDUL AZIZ ABDUL RAHIM","CLEANER / PUBLIC BUILDINGS","BANGLADESH","EA0095046","2024-03-11",784197040607901,1260661,"1970-06-25","050-4727693"]
[13142,"A5","ABDUL HALIM KALA MIAH","CLEANER / PUBLIC BUILDINGS","BANGLADESH","EE0369586","2024-10-25",784197383140247,1757907,"1972-10-10","055-9912035"]
[12025,"A6","ABDUL HAMEED ABDUL SUBAHAN","CLEANER / PUBLIC BUILDINGS","INDIA","S5857509","2028-11-24",784197830368748,3624172,"1978-03-16","050-3180415"]
[]
[null,null,null,null,null,null,null,null,null,null,{"$f":"COLUMN()","v":11}]

{"sheet":"Sheet3","index":1,"n_rows":65,"n_cols":11,"rows_kept":65,"cut":false,"hidden":true,"merged":[]}
[]
[]
[]
["ID","company","NAME","JOB","NATIONALITY","Passport No.","PASS. EXPIRY","ID NUMBER","U.I.D NO.","Date of birth","MOB. NO."]
[17004,{"$f":"IF(COUNTIF(Salim!$A$2:$A$100,$A5)=0,\"\",INDEX(Salim!$B$2:$K$7,MATCH($A5,Salim!$A$2:$A$7,0),MATCH(B$4,Salim!$B$1:$K$1,0)))","v":"A1"},{"$f":"IF(COUNTIF(Salim!$A$2:$A$100,$A5)=0,\"\",INDEX(Salim!$B$2:$K$7,MATCH($A5,Salim!$A$2:$A$7,0),MATCH(C$4,Salim!$B$1:$K$1,0)))","v":"ABBAS ASANAR"},{"$f":"IF(COUNTIF(Salim!$A$2:$A$100,$A5)=0,\"\",INDEX(Salim!$B$2:$K$7,MATCH($A5,Salim!$A$2:$A$7,0),MATCH(D$4,Salim!$B$1:$K$1,0)))","v":"CLEANER / PUBLIC BUILDINGS"},{"$f":"IF(COUNTIF(Salim!$A$2:$A$100,$A5)=0,\"\",INDEX(Salim!$B$2:$K$7,MATCH($A5,Salim!$A$2:$A$7,0),MATCH(E$4,Salim!$B$1:$K$1,0)))","v":"INDIA"},{"$f":"IF(COUNTIF(Salim!$A$2:$A$100,$A5)=0,\"\",INDEX(Salim!$B$2:$K$7,MATCH($A5,Salim!$A$2:$A$7,0),MATCH(F$4,Salim!$B$1:$K$1,0)))","v":"K2719359"},{"$f":"IF(COUNTIF(Salim!$A$2:$A$100,$A5)=0,\"\",INDEX(Salim!$B$2:$K$7,MATCH($A5,Salim!$A$2:$A$7,0),MATCH(G$4,Salim!$B$1:$K$1,0)))","v":"2023-01-31"},{"$f":"IF(COUNTIF(Salim!$A$2:$A$100,$A5)=0,\"\",INDEX(Salim!$B$2:$K$7,MATCH($A5,Salim!$A$2:$A$7,0),MATCH(H$4,Salim!$B$1:$K$1,0)))","v":784199128620400},{"$f":"IF(COUNTIF(Salim!$A$2:$A$100,$A5)=0,\"\",INDEX(Salim!$B$2:$K$7,MATCH($A5,Salim!$A$2:$A$7,0),MATCH(I$4,Salim!$B$1:$K$1,0)))","v":55361034},{"$f":"IF(COUNTIF(Salim!$A$2:$A$100,$A5)=0,\"\",INDEX(Salim!$B$2:$K$7,MATCH($A5,Salim!$A$2:$A$7,0),MATCH(J$4,Salim!$B$1:$K$1,0)))","v":"1991-11-06"},{"$f":"IF(COUNTIF(Salim!$A$2:$A$100,$A5)=0,\"\",INDEX(Salim!$B$2:$K$7,MATCH($A5,Salim!$A$2:$A$7,0),MATCH(K$4,Salim!$B$1:$K$1,0)))","v":0}]
[8537,{"$f":"IF(COUNTIF(Salim!$A$2:$A$100,$A6)=0,\"\",INDEX(Salim!$B$2:$K$7,MATCH($A6,Salim!$A$2:$A$7,0),MATCH(B$4,Salim!$B$1:$K$1,0)))","v":"A2"},{"$f":"IF(COUNTIF(Salim!$A$2:$A$100,$A6)=0,\"\",INDEX(Salim!$B$2:$K$7,MATCH($A6,Salim!$A$2:$A$7,0),MATCH(C$4,Salim!$B$1:$K$1,0)))","v":"ABBAS ROWTHER MOHAMED"},{"$f":"IF(COUNTIF(Salim!$A$2:$A$100,$A6)=0,\"\",INDEX(Salim!$B$2:$K$7,MATCH($A6,Salim!$A$2:$A$7,0),MATCH(D$4,Salim!$B$1:$K$1,0)))","v":"CLEANER / PUBLIC BUILDINGS"},{"$f":"IF(COUNTIF(Salim!$A$2:$A$100,$A6)=0,\"\",INDEX(Salim!$B$2:$K$7,MATCH($A6,Salim!$A$2:$A$7,0),MATCH(E$4,Salim!$B$1:$K$1,0)))","v":"INDIA"},{"$f":"IF(COUNTIF(Salim!$A$2:$A$100,$A6)=0,\"\",INDEX(Salim!$B$2:$K$7,MATCH($A6,Salim!$A$2:$A$7,0),MATCH(F$4,Salim!$B$1:$K$1,0)))","v":"S5787121"},{"$f":"IF(COUNTIF(Salim!$A$2:$A$100,$A6)=0,\"\",INDEX(Salim!$B$2:$K$7,MATCH($A6,Salim!$A$2:$A$7,0),MATCH(G$4,Salim!$B$1:$K$1,0)))","v":"2028-06-06"},{"$f":"IF(COUNTIF(Salim!$A$2:$A$100,$A6)=0,\"\",INDEX(Salim!$B$2:$K$7,MATCH($A6,Salim!$A$2:$A$7,0),MATCH(H$4,Salim!$B$1:$K$1,0)))","v":784197046917916},{"$f":"IF(COUNTIF(Salim!$A$2:$A$100,$A6)=0,\"\",INDEX(Salim!$B$2:$K$7,MATCH($A6,Salim!$A$2:$A$7,0),MATCH(I$4,Salim!$B$1:$K$1,0)))","v":1297024},{"$f":"IF(COUNTIF(Salim!$A$2:$A$100,$A6)=0,\"\",INDEX(Salim!$B$2:$K$7,MATCH($A6,Salim!$A$2:$A$7,0),MATCH(J$4,Salim!$B$1:$K$1,0)))","v":"1970-09-15"},{"$f":"IF(COUNTIF(Salim!$A$2:$A$100,$A6)=0,\"\",INDEX(Salim!$B$2:$K$7,MATCH($A6,Salim!$A$2:$A$7,0),MATCH(K$4,Salim!$B$1:$K$1,0)))","v":"050-2561752"}]
[12025,{"$f":"IF(COUNTIF(Salim!$A$2:$A$100,$A7)=0,\"\",INDEX(Salim!$B$2:$K$7,MATCH($A7,Salim!$A$2:$A$7,0),MATCH(B$4,Salim!$B$1:$K$1,0)))","v":"A6"},{"$f":"IF(COUNTIF(Salim!$A$2:$A$100,$A7)=0,\"\",INDEX(Salim!$B$2:$K$7,MATCH($A7,Salim!$A$2:$A$7,0),MATCH(C$4,Salim!$B$1:$K$1,0)))","v":"ABDUL HAMEED ABDUL SUBAHAN"},{"$f":"IF(COUNTIF(Salim!$A$2:$A$100,$A7)=0,\"\",INDEX(Salim!$B$2:$K$7,MATCH($A7,Salim!$A$2:$A$7,0),MATCH(D$4,Salim!$B$1:$K$1,0)))","v":"CLEANER / PUBLIC BUILDINGS"},{"$f":"IF(COUNTIF(Salim!$A$2:$A$100,$A7)=0,\"\",INDEX(Salim!$B$2:$K$7,MATCH($A7,Salim!$A$2:$A$7,0),MATCH(E$4,Salim!$B$1:$K$1,0)))","v":"INDIA"},{"$f":"IF(COUNTIF(Salim!$A$2:$A$100,$A7)=0,\"\",INDEX(Salim!$B$2:$K$7,MATCH($A7,Salim!$A$2:$A$7,0),MATCH(F$4,Salim!$B$1:$K$1,0)))","v":"S5857509"},{"$f":"IF(COUNTIF(Salim!$A$2:$A$100,$A7)=0,\"\",INDEX(Salim!$B$2:$K$7,MATCH($A7,Salim!$A$2:$A$7,0),MATCH(G$4,Salim!$B$1:$K$1,0)))","v":"2028-11-24"},{"$f":"IF(COUNTIF(Salim!$A$2:$A$100,$A7)=0,\"\",INDEX(Salim!$B$2:$K$7,MATCH($A7,Salim!$A$2:$A$7,0),MATCH(H$4,Salim!$B$1:$K$1,0)))","v":784197830368748},{"$f":"IF(COUNTIF(Salim!$A$2:$A$100,$A7)=0,\"\",INDEX(Salim!$B$2:$K$7,MATCH($A7,Salim!$A$2:$A$7,0),MATCH(I$4,Salim!$B$1:$K$1,0)))","v":3624172},{"$f":"IF(COUNTIF(Salim!$A$2:$A$100,$A7)=0,\"\",INDEX(Salim!$B$2:$K$7,MATCH($A7,Salim!$A$2:$A$7,0),MATCH(J$4,Salim!$B$1:$K$1,0)))","v":"1978-03-16"},{"$f":"IF(COUNTIF(Salim!$A$2:$A$100,$A7)=0,\"\",INDEX(Salim!$B$2:$K$7,MATCH($A7,Salim!$A$2:$A$7,0),MATCH(K$4,Salim!$B$1:$K$1,0)))","v":"050-3180415"}]
[null,{"$f":"IF(COUNTIF(Salim!$A$2:$A$100,$A8)=0,\"\",INDEX(Salim!$B$2:$K$7,MATCH($A8,Salim!$A$2:$A$7,0),MATCH(B$4,Salim!$B$1:$K$1,0)))","v":""},{"$f":"IF(COUNTIF(Salim!$A$2:$A$100,$A8)=0,\"\",INDEX(Salim!$B$2:$K$7,MATCH($A8,Salim!$A$2:$A$7,0),MATCH(C$4,Salim!$B$1:$K$1,0)))","v":""},{"$f":"IF(COUNTIF(Salim!$A$2:$A$100,$A8)=0,\"\",INDEX(Salim!$B$2:$K$7,MATCH($A8,Salim!$A$2:$A$7,0),MATCH(D$4,Salim!$B$1:$K$1,0)))","v":""},{"$f":"IF(COUNTIF(Salim!$A$2:$A$100,$A8)=0,\"\",INDEX(Salim!$B$2:$K$7,MATCH($A8,Salim!$A$2:$A$7,0),MATCH(E$4,Salim!$B$1:$K$1,0)))","v":""},{"$f":"IF(COUNTIF(Salim!$A$2:$A$100,$A8)=0,\"\",INDEX(Salim!$B$2:$K$7,MATCH($A8,Salim!$A$2:$A$7,0),MATCH(F$4,Salim!$B$1:$K$1,0)))","v":""},{"$f":"IF(COUNTIF(Salim!$A$2:$A$100,$A8)=0,\"\",INDEX(Salim!$B$2:$K$7,MATCH($A8,Salim!$A$2:$A$7,0),MATCH(G$4,Salim!$B$1:$K$1,0)))","v":""},{"$f":"IF(COUNTIF(Salim!$A$2:$A$100,$A8)=0,\"\",INDEX(Salim!$B$2:$K$7,MATCH($A8,Salim!$A$2:$A$7,0),MATCH(H$4,Salim!$B$1:$K$1,0)))","v":""},{"$f":"IF(COUNTIF(Salim!$A$2:$A$100,$A8)=0,\"\",INDEX(Salim!$B$2:$K$7,MATCH($A8,Salim!$A$2:$A$7,0),MATCH(I$4,Salim!$B$1:$K$1,0)))","v":""},{"$f":"IF(COUNTIF(Salim!$A$2:$A$100,$A8)=0,\"\",INDEX(Salim!$B$2:$K$7,MATCH($A8,Salim!$A$2:$A$7,0),MATCH(J$4,Salim!$B$1:$K$1,0)))","v":""},{"$f":"IF(COUNTIF(Salim!$A$2:$A$100,$A8)=0,\"\",INDEX(Salim!$B$2:$K$7,MATCH($A8,Salim!$A$2:$A$7,0),MATCH(K$4,Salim!$B$1:$K$1,0)))","v":""}]
[17004,{"$f":"IF(COUNTIF(Salim!$A$2:$A$100,$A9)=0,\"\",INDEX(Salim!$B$2:$K$7,MATCH($A9,Salim!$A$2:$A$7,0),MATCH(B$4,Salim!$B$1:$K$1,0)))","v":"A1"},{"$f":"IF(COUNTIF(Salim!$A$2:$A$100,$A9)=0,\"\",INDEX(Salim!$B$2:$K$7,MATCH($A9,Salim!$A$2:$A$7,0),MATCH(C$4,Salim!$B$1:$K$1,0)))","v":"ABBAS ASANAR"},{"$f":"IF(COUNTIF(Salim!$A$2:$A$100,$A9)=0,\"\",INDEX(Salim!$B$2:$K$7,MATCH($A9,Salim!$A$2:$A$7,0),MATCH(D$4,Salim!$B$1:$K$1,0)))","v":"CLEANER / PUBLIC BUILDINGS"},{"$f":"IF(COUNTIF(Salim!$A$2:$A$100,$A9)=0,\"\",INDEX(Salim!$B$2:$K$7,MATCH($A9,Salim!$A$2:$A$7,0),MATCH(E$4,Salim!$B$1:$K$1,0)))","v":"INDIA"},{"$f":"IF(COUNTIF(Salim!$A$2:$A$100,$A9)=0,\"\",INDEX(Salim!$B$2:$K$7,MATCH($A9,Salim!$A$2:$A$7,0),MATCH(F$4,Salim!$B$1:$K$1,0)))","v":"K2719359"},{"$f":"IF(COUNTIF(Salim!$A$2:$A$100,$A9)=0,\"\",INDEX(Salim!$B$2:$K$7,MATCH($A9,Salim!$A$2:$A$7,0),MATCH(G$4,Salim!$B$1:$K$1,0)))","v":"2023-01-31"},{"$f":"IF(COUNTIF(Salim!$A$2:$A$100,$A9)=0,\"\",INDEX(Salim!$B$2:$K$7,MATCH($A9,Salim!$A$2:$A$7,0),MATCH(H$4,Salim!$B$1:$K$1,0)))","v":784199128620400},{"$f":"IF(COUNTIF(Salim!$A$2:$A$100,$A9)=0,\"\",INDEX(Salim!$B$2:$K$7,MATCH($A9,Salim!$A$2:$A$7,0),MATCH(I$4,Salim!$B$1:$K$1,0)))","v":55361034},{"$f":"IF(COUNTIF(Salim!$A$2:$A$100,$A9)=0,\"\",INDEX(Salim!$B$2:$K$7,MATCH($A9,Salim!$A$2:$A$7,0),MATCH(J$4,Salim!$B$1:$K$1,0)))","v":"1991-11-06"},{"$f":"IF(COUNTIF(Salim!$A$2:$A$100,$A9)=0,\"\",INDEX(Salim!$B$2:$K$7,MATCH($A9,Salim!$A$2:$A$7,0),MATCH(K$4,Salim!$B$1:$K$1,0)))","v":0}]
[null,{"$f":"IF(COUNTIF(Salim!$A$2:$A$100,$A10)=0,\"\",INDEX(Salim!$B$2:$K$7,MATCH($A10,Salim!$A$2:$A$7,0),MATCH(B$4,Salim!$B$1:$K$1,0)))","v":""},{"$f":"IF(COUNTIF(Salim!$A$2:$A$100,$A10)=0,\"\",INDEX(Salim!$B$2:$K$7,MATCH($A10,Salim!$A$2:$A$7,0),MATCH(C$4,Salim!$B$1:$K$1,0)))","v":""},{"$f":"IF(COUNTIF(Salim!$A$2:$A$100,$A10)=0,\"\",INDEX(Salim!$B$2:$K$7,MATCH($A10,Salim!$A$2:$A$7,0),MATCH(D$4,Salim!$B$1:$K$1,0)))","v":""},{"$f":"IF(COUNTIF(Salim!$A$2:$A$100,$A10)=0,\"\",INDEX(Salim!$B$2:$K$7,MATCH($A10,Salim!$A$2:$A$7,0),MATCH(E$4,Salim!$B$1:$K$1,0)))","v":""},{"$f":"IF(COUNTIF(Salim!$A$2:$A$100,$A10)=0,\"\",INDEX(Salim!$B$2:$K$7,MATCH($A10,Salim!$A$2:$A$7,0),MATCH(F$4,Salim!$B$1:$K$1,0)))","v":""},{"$f":"IF(COUNTIF(Salim!$A$2:$A$100,$A10)=0,\"\",INDEX(Salim!$B$2:$K$7,MATCH($A10,Salim!$A$2:$A$7,0),MATCH(G$4,Salim!$B$1:$K$1,0)))","v":""},{"$f":"IF(COUNTIF(Salim!$A$2:$A$100,$A10)=0,\"\",INDEX(Salim!$B$2:$K$7,MATCH($A10,Salim!$A$2:$A$7,0),MATCH(H$4,Salim!$B$1:$K$1,0)))","v":""},{"$f":"IF(COUNTIF(Salim!$A$2:$A$100,$A10)=0,\"\",INDEX(Salim!$B$2:$K$7,MATCH($A10,Salim!$A$2:$A$7,0),MATCH(I$4,Salim!$B$1:$K$1,0)))","v":""},{"$f":"IF(COUNTIF(Salim!$A$2:$A$100,$A10)=0,\"\",INDEX(Salim!$B$2:$K$7,MATCH($A10,Salim!$A$2:$A$7,0),MATCH(J$4,Salim!$B$1:$K$1,0)))","v":""},{"$f":"IF(COUNTIF(Salim!$A$2:$A$100,$A10)=0,\"\",INDEX(Salim!$B$2:$K$7,MATCH($A10,Salim!$A$2:$A$7,0),MATCH(K$4,Salim!$B$1:$K$1,0)))","v":""}]
[null,{"$f":"IF(COUNTIF(Salim!$A$2:$A$100,$A11)=0,\"\",INDEX(Salim!$B$2:$K$7,MATCH($A11,Salim!$A$2:$A$7,0),MATCH(B$4,Salim!$B$1:$K$1,0)))","v":""},{"$f":"IF(COUNTIF(Salim!$A$2:$A$100,$A11)=0,\"\",INDEX(Salim!$B$2:$K$7,MATCH($A11,Salim!$A$2:$A$7,0),MATCH(C$4,Salim!$B$1:$K$1,0)))","v":""},{"$f":"IF(COUNTIF(Salim!$A$2:$A$100,$A11)=0,\"\",INDEX(Salim!$B$2:$K$7,MATCH($A11,Salim!$A$2:$A$7,0),MATCH(D$4,Salim!$B$1:$K$1,0)))","v":""},{"$f":"IF(COUNTIF(Salim!$A$2:$A$100,$A11)=0,\"\",INDEX(Salim!$B$2:$K$7,MATCH($A11,Salim!$A$2:$A$7,0),MATCH(E$4,Salim!$B$1:$K$1,0)))","v":""},{"$f":"IF(COUNTIF(Salim!$A$2:$A$100,$A11)=0,\"\",INDEX(Salim!$B$2:$K$7,MATCH($A11,Salim!$A$2:$A$7,0),MATCH(F$4,Salim!$B$1:$K$1,0)))","v":""},{"$f":"IF(COUNTIF(Salim!$A$2:$A$100,$A11)=0,\"\",INDEX(Salim!$B$2:$K$7,MATCH($A11,Salim!$A$2:$A$7,0),MATCH(G$4,Salim!$B$1:$K$1,0)))","v":""},{"$f":"IF(COUNTIF(Salim!$A$2:$A$100,$A11)=0,\"\",INDEX(Salim!$B$2:$K$7,MATCH($A11,Salim!$A$2:$A$7,0),MATCH(H$4,Salim!$B$1:$K$1,0)))","v":""},{"$f":"IF(COUNTIF(Salim!$A$2:$A$100,$A11)=0,\"\",INDEX(Salim!$B$2:$K$7,MATCH($A11,Salim!$A$2:$A$7,0),MATCH(I$4,Salim!$B$1:$K$1,0)))","v":""},{"$f":"IF(COUNTIF(Salim!$A$2:$A$100,$A11)=0,\"\",INDEX(Salim!$B$2:$K$7,MATCH($A11,Salim!$A$2:$A$7,0),MATCH(J$4,Salim!$B$1:$K$1,0)))","v":""},{"$f":"IF(COUNTIF(Salim!$A$2:$A$100,$A11)=0,\"\",INDEX(Salim!$B$2:$K$7,MATCH($A11,Salim!$A$2:$A$7,0),MATCH(K$4,Salim!$B$1:$K$1,0)))","v":""}]
[null,{"$f":"IF(COUNTIF(Salim!$A$2:$A$100,$A12)=0,\"\",INDEX(Salim!$B$2:$K$7,MATCH($A12,Salim!$A$2:$A$7,0),MATCH(B$4,Salim!$B$1:$K$1,0)))","v":""},{"$f":"IF(COUNTIF(Salim!$A$2:$A$100,$A12)=0,\"\",INDEX(Salim!$B$2:$K$7,MATCH($A12,Salim!$A$2:$A$7,0),MATCH(C$4,Salim!$B$1:$K$1,0)))","v":""},{"$f":"IF(COUNTIF(Salim!$A$2:$A$100,$A12)=0,\"\",INDEX(Salim!$B$2:$K$7,MATCH($A12,Salim!$A$2:$A$7,0),MATCH(D$4,Salim!$B$1:$K$1,0)))","v":""},{"$f":"IF(COUNTIF(Salim!$A$2:$A$100,$A12)=0,\"\",INDEX(Salim!$B$2:$K$7,MATCH($A12,Salim!$A$2:$A$7,0),MATCH(E$4,Salim!$B$1:$K$1,0)))","v":""},{"$f":"IF(COUNTIF(Salim!$A$2:$A$100,$A12)=0,\"\",INDEX(Salim!$B$2:$K$7,MATCH($A12,Salim!$A$2:$A$7,0),MATCH(F$4,Salim!$B$1:$K$1,0)))","v":""},{"$f":"IF(COUNTIF(Salim!$A$2:$A$100,$A12)=0,\"\",INDEX(Salim!$B$2:$K$7,MATCH($A12,Salim!$A$2:$A$7,0),MATCH(G$4,Salim!$B$1:$K$1,0)))","v":""},{"$f":"IF(COUNTIF(Salim!$A$2:$A$100,$A12)=0,\"\",INDEX(Salim!$B$2:$K$7,MATCH($A12,Salim!$A$2:$A$7,0),MATCH(H$4,Salim!$B$1:$K$1,0)))","v":""},{"$f":"IF(COUNTIF(Salim!$A$2:$A$100,$A12)=0,\"\",INDEX(Salim!$B$2:$K$7,MATCH($A12,Salim!$A$2:$A$7,0),MATCH(I$4,Salim!$B$1:$K$1,0)))","v":""},{"$f":"IF(COUNTIF(Salim!$A$2:$A$100,$A12)=0,\"\",INDEX(Salim!$B$2:$K$7,MATCH($A12,Salim!$A$2:$A$7,0),MATCH(J$4,Salim!$B$1:$K$1,0)))","v":""},{"$f":"IF(COUNTIF(Salim!$A$2:$A$100,$A12)=0,\"\",INDEX(Salim!$B$2:$K$7,MATCH($A12,Salim!$A$2:$A$7,0),MATCH(K$4,Salim!$B$1:$K$1,0)))","v":""}]
[null,{"$f":"IF(COUNTIF(Salim!$A$2:$A$100,$A13)=0,\"\",INDEX(Salim!$B$2:$K$7,MATCH($A13,Salim!$A$2:$A$7,0),MATCH(B$4,Salim!$B$1:$K$1,0)))","v":""},{"$f":"IF(COUNTIF(Salim!$A$2:$A$100,$A13)=0,\"\",INDEX(Salim!$B$2:$K$7,MATCH($A13,Salim!$A$2:$A$7,0),MATCH(C$4,Salim!$B$1:$K$1,0)))","v":""},{"$f":"IF(COUNTIF(Salim!$A$2:$A$100,$A13)=0,\"\",INDEX(Salim!$B$2:$K$7,MATCH($A13,Salim!$A$2:$A$7,0),MATCH(D$4,Salim!$B$1:$K$1,0)))","v":""},{"$f":"IF(COUNTIF(Salim!$A$2:$A$100,$A13)=0,\"\",INDEX(Salim!$B$2:$K$7,MATCH($A13,Salim!$A$2:$A$7,0),MATCH(E$4,Salim!$B$1:$K$1,0)))","v":""},{"$f":"IF(COUNTIF(Salim!$A$2:$A$100,$A13)=0,\"\",INDEX(Salim!$B$2:$K$7,MATCH($A13,Salim!$A$2:$A$7,0),MATCH(F$4,Salim!$B$1:$K$1,0)))","v":""},{"$f":"IF(COUNTIF(Salim!$A$2:$A$100,$A13)=0,\"\",INDEX(Salim!$B$2:$K$7,MATCH($A13,Salim!$A$2:$A$7,0),MATCH(G$4,Salim!$B$1:$K$1,0)))","v":""},{"$f":"IF(COUNTIF(Salim!$A$2:$A$100,$A13)=0,\"\",INDEX(Salim!$B$2:$K$7,MATCH($A13,Salim!$A$2:$A$7,0),MATCH(H$4,Salim!$B$1:$K$1,0)))","v":""},{"$f":"IF(COUNTIF(Salim!$A$2:$A$100,$A13)=0,\"\",INDEX(Salim!$B$2:$K$7,MATCH($A13,Salim!$A$2:$A$7,0),MATCH(I$4,Salim!$B$1:$K$1,0)))","v":""},{"$f":"IF(COUNTIF(Salim!$A$2:$A$100,$A13)=0,\"\",INDEX(Salim!$B$2:$K$7,MATCH($A13,Salim!$A$2:$A$7,0),MATCH(J$4,Salim!$B$1:$K$1,0)))","v":""},{"$f":"IF(COUNTIF(Salim!$A$2:$A$100,$A13)=0,\"\",INDEX(Salim!$B$2:$K$7,MATCH($A13,Salim!$A$2:$A$7,0),MATCH(K$4,Salim!$B$1:$K$1,0)))","v":""}]
[null,{"$f":"IF(COUNTIF(Salim!$A$2:$A$100,$A14)=0,\"\",INDEX(Salim!$B$2:$K$7,MATCH($A14,Salim!$A$2:$A$7,0),MATCH(B$4,Salim!$B$1:$K$1,0)))","v":""},{"$f":"IF(COUNTIF(Salim!$A$2:$A$100,$A14)=0,\"\",INDEX(Salim!$B$2:$K$7,MATCH($A14,Salim!$A$2:$A$7,0),MATCH(C$4,Salim!$B$1:$K$1,0)))","v":""},{"$f":"IF(COUNTIF(Salim!$A$2:$A$100,$A14)=0,\"\",INDEX(Salim!$B$2:$K$7,MATCH($A14,Salim!$A$2:$A$7,0),MATCH(D$4,Salim!$B$1:$K$1,0)))","v":""},{"$f":"IF(COUNTIF(Salim!$A$2:$A$100,$A14)=0,\"\",INDEX(Salim!$B$2:$K$7,MATCH($A14,Salim!$A$2:$A$7,0),MATCH(E$4,Salim!$B$1:$K$1,0)))","v":""},{"$f":"IF(COUNTIF(Salim!$A$2:$A$100,$A14)=0,\"\",INDEX(Salim!$B$2:$K$7,MATCH($A14,Salim!$A$2:$A$7,0),MATCH(F$4,Salim!$B$1:$K$1,0)))","v":""},{"$f":"IF(COUNTIF(Salim!$A$2:$A$100,$A14)=0,\"\",INDEX(Salim!$B$2:$K$7,MATCH($A14,Salim!$A$2:$A$7,0),MATCH(G$4,Salim!$B$1:$K$1,0)))","v":""},{"$f":"IF(COUNTIF(Salim!$A$2:$A$100,$A14)=0,\"\",INDEX(Salim!$B$2:$K$7,MATCH($A14,Salim!$A$2:$A$7,0),MATCH(H$4,Salim!$B$1:$K$1,0)))","v":""},{"$f":"IF(COUNTIF(Salim!$A$2:$A$100,$A14)=0,\"\",INDEX(Salim!$B$2:$K$7,MATCH($A14,Salim!$A$2:$A$7,0),MATCH(I$4,Salim!$B$1:$K$1,0)))","v":""},{"$f":"IF(COUNTIF(Salim!$A$2:$A$100,$A14)=0,\"\",INDEX(Salim!$B$2:$K$7,MATCH($A14,Salim!$A$2:$A$7,0),MATCH(J$4,Salim!$B$1:$K$1,0)))","v":""},{"$f":"IF(COUNTIF(Salim!$A$2:$A$100,$A14)=0,\"\",INDEX(Salim!$B$2:$K$7,MATCH($A14,Salim!$A$2:$A$7,0),MATCH(K$4,Salim!$B$1:$K$1,0)))","v":""}]
[null,{"$f":"IF(COUNTIF(Salim!$A$2:$A$100,$A15)=0,\"\",INDEX(Salim!$B$2:$K$7,MATCH($A15,Salim!$A$2:$A$7,0),MATCH(B$4,Salim!$B$1:$K$1,0)))","v":""},{"$f":"IF(COUNTIF(Salim!$A$2:$A$100,$A15)=0,\"\",INDEX(Salim!$B$2:$K$7,MATCH($A15,Salim!$A$2:$A$7,0),MATCH(C$4,Salim!$B$1:$K$1,0)))","v":""},{"$f":"IF(COUNTIF(Salim!$A$2:$A$100,$A15)=0,\"\",INDEX(Salim!$B$2:$K$7,MATCH($A15,Salim!$A$2:$A$7,0),MATCH(D$4,Salim!$B$1:$K$1,0)))","v":""},{"$f":"IF(COUNTIF(Salim!$A$2:$A$100,$A15)=0,\"\",INDEX(Salim!$B$2:$K$7,MATCH($A15,Salim!$A$2:$A$7,0),MATCH(E$4,Salim!$B$1:$K$1,0)))","v":""},{"$f":"IF(COUNTIF(Salim!$A$2:$A$100,$A15)=0,\"\",INDEX(Salim!$B$2:$K$7,MATCH($A15,Salim!$A$2:$A$7,0),MATCH(F$4,Salim!$B$1:$K$1,0)))","v":""},{"$f":"IF(COUNTIF(Salim!$A$2:$A$100,$A15)=0,\"\",INDEX(Salim!$B$2:$K$7,MATCH($A15,Salim!$A$2:$A$7,0),MATCH(G$4,Salim!$B$1:$K$1,0)))","v":""},{"$f":"IF(COUNTIF(Salim!$A$2:$A$100,$A15)=0,\"\",INDEX(Salim!$B$2:$K$7,MATCH($A15,Salim!$A$2:$A$7,0),MATCH(H$4,Salim!$B$1:$K$1,0)))","v":""},{"$f":"IF(COUNTIF(Salim!$A$2:$A$100,$A15)=0,\"\",INDEX(Salim!$B$2:$K$7,MATCH($A15,Salim!$A$2:$A$7,0),MATCH(I$4,Salim!$B$1:$K$1,0)))","v":""},{"$f":"IF(COUNTIF(Salim!$A$2:$A$100,$A15)=0,\"\",INDEX(Salim!$B$2:$K$7,MATCH($A15,Salim!$A$2:$A$7,0),MATCH(J$4,Salim!$B$1:$K$1,0)))","v":""},{"$f":"IF(COUNTIF(Salim!$A$2:$A$100,$A15)=0,\"\",INDEX(Salim!$B$2:$K$7,MATCH($A15,Salim!$A$2:$A$7,0),MATCH(K$4,Salim!$B$1:$K$1,0)))","v":""}]
[null,{"$f":"IF(COUNTIF(Salim!$A$2:$A$100,$A16)=0,\"\",INDEX(Salim!$B$2:$K$7,MATCH($A16,Salim!$A$2:$A$7,0),MATCH(B$4,Salim!$B$1:$K$1,0)))","v":""},{"$f":"IF(COUNTIF(Salim!$A$2:$A$100,$A16)=0,\"\",INDEX(Salim!$B$2:$K$7,MATCH($A16,Salim!$A$2:$A$7,0),MATCH(C$4,Salim!$B$1:$K$1,0)))","v":""},{"$f":"IF(COUNTIF(Salim!$A$2:$A$100,$A16)=0,\"\",INDEX(Salim!$B$2:$K$7,MATCH($A16,Salim!$A$2:$A$7,0),MATCH(D$4,Salim!$B$1:$K$1,0)))","v":""},{"$f":"IF(COUNTIF(Salim!$A$2:$A$100,$A16)=0,\"\",INDEX(Salim!$B$2:$K$7,MATCH($A16,Salim!$A$2:$A$7,0),MATCH(E$4,Salim!$B$1:$K$1,0)))","v":""},{"$f":"IF(COUNTIF(Salim!$A$2:$A$100,$A16)=0,\"\",INDEX(Salim!$B$2:$K$7,MATCH($A16,Salim!$A$2:$A$7,0),MATCH(F$4,Salim!$B$1:$K$1,0)))","v":""},{"$f":"IF(COUNTIF(Salim!$A$2:$A$100,$A16)=0,\"\",INDEX(Salim!$B$2:$K$7,MATCH($A16,Salim!$A$2:$A$7,0),MATCH(G$4,Salim!$B$1:$K$1,0)))","v":""},{"$f":"IF(COUNTIF(Salim!$A$2:$A$100,$A16)=0,\"\",INDEX(Salim!$B$2:$K$7,MATCH($A16,Salim!$A$2:$A$7,0),MATCH(H$4,Salim!$B$1:$K$1,0)))","v":""},{"$f":"IF(COUNTIF(Salim!$A$2:$A$100,$A16)=0,\"\",INDEX(Salim!$B$2:$K$7,MATCH($A16,Salim!$A$2:$A$7,0),MATCH(I$4,Salim!$B$1:$K$1,0)))","v":""},{"$f":"IF(COUNTIF(Salim!$A$2:$A$100,$A16)=0,\"\",INDEX(Salim!$B$2:$K$7,MATCH($A16,Salim!$A$2:$A$7,0),MATCH(J$4,Salim!$B$1:$K$1,0)))","v":""},{"$f":"IF(COUNTIF(Salim!$A$2:$A$100,$A16)=0,\"\",INDEX(Salim!$B$2:$K$7,MATCH($A16,Salim!$A$2:$A$7,0),MATCH(K$4,Salim!$B$1:$K$1,0)))","v":""}]
[null,{"$f":"IF(COUNTIF(Salim!$A$2:$A$100,$A17)=0,\"\",INDEX(Salim!$B$2:$K$7,MATCH($A17,Salim!$A$2:$A$7,0),MATCH(B$4,Salim!$B$1:$K$1,0)))","v":""},{"$f":"IF(COUNTIF(Salim!$A$2:$A$100,$A17)=0,\"\",INDEX(Salim!$B$2:$K$7,MATCH($A17,Salim!$A$2:$A$7,0),MATCH(C$4,Salim!$B$1:$K$1,0)))","v":""},{"$f":"IF(COUNTIF(Salim!$A$2:$A$100,$A17)=0,\"\",INDEX(Salim!$B$2:$K$7,MATCH($A17,Salim!$A$2:$A$7,0),MATCH(D$4,Salim!$B$1:$K$1,0)))","v":""},{"$f":"IF(COUNTIF(Salim!$A$2:$A$100,$A17)=0,\"\",INDEX(Salim!$B$2:$K$7,MATCH($A17,Salim!$A$2:$A$7,0),MATCH(E$4,Salim!$B$1:$K$1,0)))","v":""},{"$f":"IF(COUNTIF(Salim!$A$2:$A$100,$A17)=0,\"\",INDEX(Salim!$B$2:$K$7,MATCH($A17,Salim!$A$2:$A$7,0),MATCH(F$4,Salim!$B$1:$K$1,0)))","v":""},{"$f":"IF(COUNTIF(Salim!$A$2:$A$100,$A17)=0,\"\",INDEX(Salim!$B$2:$K$7,MATCH($A17,Salim!$A$2:$A$7,0),MATCH(G$4,Salim!$B$1:$K$1,0)))","v":""},{"$f":"IF(COUNTIF(Salim!$A$2:$A$100,$A17)=0,\"\",INDEX(Salim!$B$2:$K$7,MATCH($A17,Salim!$A$2:$A$7,0),MATCH(H$4,Salim!$B$1:$K$1,0)))","v":""},{"$f":"IF(COUNTIF(Salim!$A$2:$A$100,$A17)=0,\"\",INDEX(Salim!$B$2:$K$7,MATCH($A17,Salim!$A$2:$A$7,0),MATCH(I$4,Salim!$B$1:$K$1,0)))","v":""},{"$f":"IF(COUNTIF(Salim!$A$2:$A$100,$A17)=0,\"\",INDEX(Salim!$B$2:$K$7,MATCH($A17,Salim!$A$2:$A$7,0),MATCH(J$4,Salim!$B$1:$K$1,0)))","v":""},{"$f":"IF(COUNTIF(Salim!$A$2:$A$100,$A17)=0,\"\",INDEX(Salim!$B$2:$K$7,MATCH($A17,Salim!$A$2:$A$7,0),MATCH(K$4,Salim!$B$1:$K$1,0)))","v":""}]
[null,{"$f":"IF(COUNTIF(Salim!$A$2:$A$100,$A18)=0,\"\",INDEX(Salim!$B$2:$K$7,MATCH($A18,Salim!$A$2:$A$7,0),MATCH(B$4,Salim!$B$1:$K$1,0)))","v":""},{"$f":"IF(COUNTIF(Salim!$A$2:$A$100,$A18)=0,\"\",INDEX(Salim!$B$2:$K$7,MATCH($A18,Salim!$A$2:$A$7,0),MATCH(C$4,Salim!$B$1:$K$1,0)))","v":""},{"$f":"IF(COUNTIF(Salim!$A$2:$A$100,$A18)=0,\"\",INDEX(Salim!$B$2:$K$7,MATCH($A18,Salim!$A$2:$A$7,0),MATCH(D$4,Salim!$B$1:$K$1,0)))","v":""},{"$f":"IF(COUNTIF(Salim!$A$2:$A$100,$A18)=0,\"\",INDEX(Salim!$B$2:$K$7,MATCH($A18,Salim!$A$2:$A$7,0),MATCH(E$4,Salim!$B$1:$K$1,0)))","v":""},{"$f":"IF(COUNTIF(Salim!$A$2:$A$100,$A18)=0,\"\",INDEX(Salim!$B$2:$K$7,MATCH($A18,Salim!$A$2:$A$7,0),MATCH(F$4,Salim!$B$1:$K$1,0)))","v":""},{"$f":"IF(COUNTIF(Salim!$A$2:$A$100,$A18)=0,\"\",INDEX(Salim!$B$2:$K$7,MATCH($A18,Salim!$A$2:$A$7,0),MATCH(G$4,Salim!$B$1:$K$1,0)))","v":""},{"$f":"IF(COUNTIF(Salim!$A$2:$A$100,$A18)=0,\"\",INDEX(Salim!$B$2:$K$7,MATCH($A18,Salim!$A$2:$A$7,0),MATCH(H$4,Salim!$B$1:$K$1,0)))","v":""},{"$f":"IF(COUNTIF(Salim!$A$2:$A$100,$A18)=0,\"\",INDEX(Salim!$B$2:$K$7,MATCH($A18,Salim!$A$2:$A$7,0),MATCH(I$4,Salim!$B$1:$K$1,0)))","v":""},{"$f":"IF(COUNTIF(Salim!$A$2:$A$100,$A18)=0,\"\",INDEX(Salim!$B$2:$K$7,MATCH($A18,Salim!$A$2:$A$7,0),MATCH(J$4,Salim!$B$1:$K$1,0)))","v":""},{"$f":"IF(COUNTIF(Salim!$A$2:$A$100,$A18)=0,\"\",INDEX(Salim!$B$2:$K$7,MATCH($A18,Salim!$A$2:$A$7,0),MATCH(K$4,Salim!$B$1:$K$1,0)))","v":""}]
[null,{"$f":"IF(COUNTIF(Salim!$A$2:$A$100,$A19)=0,\"\",INDEX(Salim!$B$2:$K$7,MATCH($A19,Salim!$A$2:$A$7,0),MATCH(B$4,Salim!$B$1:$K$1,0)))","v":""},{"$f":"IF(COUNTIF(Salim!$A$2:$A$100,$A19)=0,\"\",INDEX(Salim!$B$2:$K$7,MATCH($A19,Salim!$A$2:$A$7,0),MATCH(C$4,Salim!$B$1:$K$1,0)))","v":""},{"$f":"IF(COUNTIF(Salim!$A$2:$A$100,$A19)=0,\"\",INDEX(Salim!$B$2:$K$7,MATCH($A19,Salim!$A$2:$A$7,0),MATCH(D$4,Salim!$B$1:$K$1,0)))","v":""},{"$f":"IF(COUNTIF(Salim!$A$2:$A$100,$A19)=0,\"\",INDEX(Salim!$B$2:$K$7,MATCH($A19,Salim!$A$2:$A$7,0),MATCH(E$4,Salim!$B$1:$K$1,0)))","v":""},{"$f":"IF(COUNTIF(Salim!$A$2:$A$100,$A19)=0,\"\",INDEX(Salim!$B$2:$K$7,MATCH($A19,Salim!$A$2:$A$7,0),MATCH(F$4,Salim!$B$1:$K$1,0)))","v":""},{"$f":"IF(COUNTIF(Salim!$A$2:$A$100,$A19)=0,\"\",INDEX(Salim!$B$2:$K$7,MATCH($A19,Salim!$A$2:$A$7,0),MATCH(G$4,Salim!$B$1:$K$1,0)))","v":""},{"$f":"IF(COUNTIF(Salim!$A$2:$A$100,$A19)=0,\"\",INDEX(Salim!$B$2:$K$7,MATCH($A19,Salim!$A$2:$A$7,0),MATCH(H$4,Salim!$B$1:$K$1,0)))","v":""},{"$f":"IF(COUNTIF(Salim!$A$2:$A$100,$A19)=0,\"\",INDEX(Salim!$B$2:$K$7,MATCH($A19,Salim!$A$2:$A$7,0),MATCH(I$4,Salim!$B$1:$K$1,0)))","v":""},{"$f":"IF(COUNTIF(Salim!$A$2:$A$100,$A19)=0,\"\",INDEX(Salim!$B$2:$K$7,MATCH($A19,Salim!$A$2:$A$7,0),MATCH(J$4,Salim!$B$1:$K$1,0)))","v":""},{"$f":"IF(COUNTIF(Salim!$A$2:$A$100,$A19)=0,\"\",INDEX(Salim!$B$2:$K$7,MATCH($A19,Salim!$A$2:$A$7,0),MATCH(K$4,Salim!$B$1:$K$1,0)))","v":""}]
[null,{"$f":"IF(COUNTIF(Salim!$A$2:$A$100,$A20)=0,\"\",INDEX(Salim!$B$2:$K$7,MATCH($A20,Salim!$A$2:$A$7,0),MATCH(B$4,Salim!$B$1:$K$1,0)))","v":""},{"$f":"IF(COUNTIF(Salim!$A$2:$A$100,$A20)=0,\"\",INDEX(Salim!$B$2:$K$7,MATCH($A20,Salim!$A$2:$A$7,0),MATCH(C$4,Salim!$B$1:$K$1,0)))","v":""},{"$f":"IF(COUNTIF(Salim!$A$2:$A$100,$A20)=0,\"\",INDEX(Salim!$B$2:$K$7,MATCH($A20,Salim!$A$2:$A$7,0),MATCH(D$4,Salim!$B$1:$K$1,0)))","v":""},{"$f":"IF(COUNTIF(Salim!$A$2:$A$100,$A20)=0,\"\",INDEX(Salim!$B$2:$K$7,MATCH($A20,Salim!$A$2:$A$7,0),MATCH(E$4,Salim!$B$1:$K$1,0)))","v":""},{"$f":"IF(COUNTIF(Salim!$A$2:$A$100,$A20)=0,\"\",INDEX(Salim!$B$2:$K$7,MATCH($A20,Salim!$A$2:$A$7,0),MATCH(F$4,Salim!$B$1:$K$1,0)))","v":""},{"$f":"IF(COUNTIF(Salim!$A$2:$A$100,$A20)=0,\"\",INDEX(Salim!$B$2:$K$7,MATCH($A20,Salim!$A$2:$A$7,0),MATCH(G$4,Salim!$B$1:$K$1,0)))","v":""},{"$f":"IF(COUNTIF(Salim!$A$2:$A$100,$A20)=0,\"\",INDEX(Salim!$B$2:$K$7,MATCH($A20,Salim!$A$2:$A$7,0),MATCH(H$4,Salim!$B$1:$K$1,0)))","v":""},{"$f":"IF(COUNTIF(Salim!$A$2:$A$100,$A20)=0,\"\",INDEX(Salim!$B$2:$K$7,MATCH($A20,Salim!$A$2:$A$7,0),MATCH(I$4,Salim!$B$1:$K$1,0)))","v":""},{"$f":"IF(COUNTIF(Salim!$A$2:$A$100,$A20)=0,\"\",INDEX(Salim!$B$2:$K$7,MATCH($A20,Salim!$A$2:$A$7,0),MATCH(J$4,Salim!$B$1:$K$1,0)))","v":""},{"$f":"IF(COUNTIF(Salim!$A$2:$A$100,$A20)=0,\"\",INDEX(Salim!$B$2:$K$7,MATCH($A20,Salim!$A$2:$A$7,0),MATCH(K$4,Salim!$B$1:$K$1,0)))","v":""}]
{"$rows_left_out":46}
{"sheet":"Target_SH","index":2,"n_rows":7,"n_cols":11,"rows_kept":7,"cut":false,"hidden":false,"merged":[]}
[null,"Item","ID",null,"Choose ID an Item From Drop Down"]
[null,"NATIONALITY",12896]
[]
[12896,"A3","ABDUL AJEEZ MUJEEBUR RAHMAN","CLEANER / PUBLIC BUILDINGS","INDIA","T2800404","2029-07-22",784198008408381,1747925,"1980-06-09","050-6723853"]
[]
["ID","NATIONALITY"]
[12896,"INDIA"]