{"text_format":"1","workbook":"xlsx","n_sheets":13,"sheets":["TOTAL","المخزن","Histoire","data-ip","DATA1","mohamed 01","mohamed02","mohamed03","mohamed04","mohamed05","mohamed06","mohamed07","mohamed08"],"not_rendered":{"charts":0,"images":1,"macros":1,"external_links":1,"defined_names":7,"comments":0,"pivot_tables":0},"unopened":[],"bounds":{"document_bytes":16777216,"sheet_cells":100000,"rows_first":2000,"rows_last":500,"rows_between":2000,"halvings":0,"cell_chars":16384,"cell_head_chars":4096},"cells_cut":0,"cells_raw":0,"read":"whole","date_system":"1900"}

{"sheet":"TOTAL","index":0,"n_rows":11,"n_cols":10,"rows_kept":11,"cut":false,"hidden":false,"merged":[]}
[]
[]
[]
[]
[]
["رقم","الاسم","دفع","اجمالي","باقي قديم","تاريخ","باقي جديد",null,"تاريخ","اقدم"]
[null,null,null,null,null,null,null,null,{"$f":"F7","v":"00:00:00"},0]
[null,null,null,null,null,null,null,null,"00:00:00",0]
[null,null,null,null,null,null,null,null,"00:00:00",0]
[null,null,null,null,null,null,null,null,"00:00:00",0]
[null,null,null,null,null,null,null,null,"00:00:00",0]

{"sheet":"المخزن","index":1,"n_rows":1065,"n_cols":13,"rows_kept":1065,"cut":false,"hidden":false,"merged":[[0,0,1,5],[3,5,498,5]]}
[null,null,null,null,null,null,0]
[]
[null,"السلعة","الثمن البيع","ثمن الشراء","الكمية",null,"من","الى","سند القبض","اسم المستلم","سند الاستلام","اسم المسلم","ملاحظات"]
[{"$f":"IFERROR(IF(B4<>\"\",ROW(),\"\")-3,\"\")","v":1},"djezzy",1000,null,null,0,1,2,501,"محمد 1",455,"محمد 1","kh1"]
[{"$f":"IFERROR(IF(B5<>\"\",ROW(),\"\")-3,\"\")","v":2},"mobillis",980,null,null,null,1,3,502,"محمد 2",502,"محمد 2","kh2"]
[3,"ooredoo",990,null,null,null,1,4,503,"محمد 3",503,"محمد 3","kh3"]
[4,"sim djeezy",200,null,null,null,1,5,504,"محمد 4",504,"محمد 4","kh4"]
[5,"sim mobillis",180,null,null,null,1,5,505,"محمد 5",505,"محمد 5","kh5"]
[6,"sim ooredoo",140,null,null,null,1,5,506,"محمد 6",506,"محمد 6","kh6"]
[7,"kit",300,null,null,null,1,2,507,"محمد 7",507,"محمد 7","kh7"]
[8,"chareger",500,null,null,null,1,3,508,"محمد 8",508,"محمد 8","kh8"]
["",null,null,null,null,null,1,5,509,"محمد 9",509,"محمد 9","kh9"]
["",null,null,null,null,null,1,4,510,"محمد 10",510,"محمد 10","kh10"]
["",null,null,null,null,null,1,2,5347,"محمد 11",511,"محمد 11","kh11"]
["",null,null,null,null,null,1,3,512,"محمد 12",512,"محمد 12","kh12"]
["",null,null,null,null,null,1,4,513,"محمد 13",513,"محمد 13","kh13"]
["",null,null,null,null,null,1,5,514,"محمد 14",514,"محمد 14","kh14"]
["",null,null,null,null,null,1,2,515,"محمد 15",515,"محمد 15","kh15"]
["",null,null,null,null,null,1,3,516,"محمد 16",516,"محمد 16","kh16"]
["",null,null,null,null,null,1,4,517,"محمد 17",517,"محمد 17","kh17"]
["",null,null,null,null,null,1,5,518,"محمد 18",518,"محمد 18","kh18"]
["",null,null,null,null,null,1,2,519,"محمد 19",519,"محمد 19","kh19"]
["",null,null,null,null,null,1,5,520,"محمد 20",520,"محمد 20","kh20"]
["",null,null,null,null,null,1,4,521,"محمد 21",521,"محمد 21","kh21"]
["",null,null,null,null,null,1,3,522,"محمد 22",522,"محمد 22","kh22"]
["",null,null,null,null,null,1,2,523,"محمد 23",523,"محمد 23","kh23"]
["",null,null,null,null,null,1,5,524,"محمد 24",524,"محمد 24","kh24"]
["",null,null,null,null,null,1,3,525,"محمد 25",525,"محمد 25","kh25"]
["",null,null,null,null,null,1,3,526,"محمد 26",526,"محمد 26","kh26"]
["",null,null,null,null,null,1,3,527,"محمد 27",527,"محمد 27","kh27"]
["",null,null,null,null,null,1,3,528,"محمد 28",528,"محمد 28","kh28"]
["",null,null,null,null,null,1,3,529,"محمد 29",529,"محمد 29","kh29"]
["",null,null,null,null,null,1,3,530,"محمد 30",530,"محمد 30","kh30"]
["",null,null,null,null,null,1,3,531,"محمد 31",531,"محمد 31","kh31"]
["",null,null,null,null,null,1,3,532,"محمد 32",532,"محمد 32","kh32"]
["",null,null,null,null,null,1,3,533,"محمد 33",533,"محمد 33","kh33"]
["",null,null,null,null,null,1,3,534,"محمد 34",534,"محمد 34","kh34"]
["",null,null,null,null,null,1,3,535,"محمد 35",535,"محمد 35","kh35"]
["",null,null,null,null,null,1,3,536,"محمد 36",536,"محمد 36","kh36"]
["",null,null,null,null,null,1,3,537,"محمد 37",537,"محمد 37","kh37"]
["",null,null,null,null,null,1,3,538,"محمد 38",538,"محمد 38","kh38"]
["",null,null,null,null,null,1,3,539,"محمد 39",539,"محمد 39","kh39"]
["",null,null,null,null,null,1,3,540,"محمد 40",540,"محمد 40","kh40"]
["",null,null,null,null,null,1,3,541,"محمد 41",541,"محمد 41","kh41"]
["",null,null,null,null,null,1,3,542,"محمد 42",542,"محمد 42","kh42"]
["",null,null,null,null,null,1,3,543,"محمد 43",543,"محمد 43","kh43"]
["",null,null,null,null,null,1,3,544,"محمد 44",544,"محمد 44","kh44"]
["",null,null,null,null,null,1,3,545,"محمد 45",545,"محمد 45","kh45"]
["",null,null,null,null,null,1,3,546,"محمد 46",546,"محمد 46","kh46"]
["",null,null,null,null,null,1,3,547,"محمد 47",547,"محمد 47","kh47"]
["",null,null,null,null,null,1,3,548,"محمد 48",548,"محمد 48","kh48"]
["",null,null,null,null,null,1,3,549,"محمد 49",549,"محمد 49","kh49"]
["",null,null,null,null,null,1,3,550,"محمد 50",550,"محمد 50","kh50"]
["",null,null,null,null,null,1,3,551,"محمد 51",551,"محمد 51","kh51"]
["",null,null,null,null,null,1,3,552,"محمد 52",552,"محمد 52","kh52"]
["",null,null,null,null,null,1,3,553,"محمد 53",553,"محمد 53","kh53"]
["",null,null,null,null,null,1,3,554,"محمد 54",554,"محمد 54","kh54"]
["",null,null,null,null,null,1,3,555,"محمد 55",555,"محمد 55","kh55"]
["",null,null,null,null,null,1,3,556,"محمد 56",556,"محمد 56","kh56"]
["",null,null,null,null,null,1,3,557,"محمد 57",557,"محمد 57","kh57"]
["",null,null,null,null,null,1,3,558,"محمد 58",558,"محمد 58","kh58"]
["",null,null,null,null,null,1,3,559,"محمد 59",559,"محمد 59","kh59"]
["",null,null,null,null,null,1,3,560,"محمد 60",560,"محمد 60","kh60"]
["",null,null,null,null,null,1,3,561,"محمد 61",561,"محمد 61","kh61"]
["",null,null,null,null,null,1,3,562,"محمد 62",562,"محمد 62","kh62"]
["",null,null,null,null,null,1,3,563,"محمد 63",563,"محمد 63","kh63"]
["",null,null,null,null,null,1,3,564,"محمد 64",564,"محمد 64","kh64"]
["",null,null,null,null,null,1,3,565,"محمد 65",565,"محمد 65","kh65"]
[{"$f":"IFERROR(IF(B69<>\"\",ROW(),\"\")-3,\"\")","v":""},null,null,null,null,null,1,3,566,"محمد 66",566,"محمد 66","kh66"]
["",null,null,null,null,null,1,3,567,"محمد 67",567,"محمد 67","kh67"]
["",null,null,null,null,null,1,3,568,"محمد 68",568,"محمد 68","kh68"]
["",null,null,null,null,null,1,3,569,"محمد 69",569,"محمد 69","kh69"]
["",null,null,null,null,null,1,3,570,"محمد 70",570,"محمد 70","kh70"]
["",null,null,null,null,null,1,3,571,"محمد 71",571,"محمد 71","kh71"]
["",null,null,null,null,null,1,3,572,"محمد 72",572,"محمد 72","kh72"]
["",null,null,null,null,null,1,3,573,"محمد 73",573,"محمد 73","kh73"]
["",null,null,null,null,null,1,3,574,"محمد 74",574,"محمد 74","kh74"]
["",null,null,null,null,null,1,3,575,"محمد 75",575,"محمد 75","kh75"]
["",null,null,null,null,null,1,3,576,"محمد 76",576,"محمد 76","kh76"]
["",null,null,null,null,null,1,3,577,"محمد 77",577,"محمد 77","kh77"]
["",null,null,null,null,null,1,3,578,"محمد 78",578,"محمد 78","kh78"]
["",null,null,null,null,null,1,3,579,"محمد 79",579,"محمد 79","kh79"]
["",null,null,null,null,null,1,3,580,"محمد 80",580,"محمد 80","kh80"]
["",null,null,null,null,null,1,3,581,"محمد 81",581,"محمد 81","kh81"]
["",null,null,null,null,null,1,3,582,"محمد 82",582,"محمد 82","kh82"]
["",null,null,null,null,null,1,3,583,"محمد 83",583,"محمد 83","kh83"]
["",null,null,null,null,null,1,3,584,"محمد 84",584,"محمد 84","kh84"]
["",null,null,null,null,null,1,3,585,"محمد 85",585,"محمد 85","kh85"]
["",null,null,null,null,null,1,3,586,"محمد 86",586,"محمد 86","kh86"]
["",null,null,null,null,null,1,3,587,"محمد 87",587,"محمد 87","kh87"]
["",null,null,null,null,null,1,3,588,"محمد 88",588,"محمد 88","kh88"]
["",null,null,null,null,null,1,3,589,"محمد 89",589,"محمد 89","kh89"]
["",null,null,null,null,null,1,3,590,"محمد 90",590,"محمد 90","kh90"]
["",null,null,null,null,null,1,3,591,"محمد 91",591,"محمد 91","kh91"]
["",null,null,null,null,null,1,3,592,"محمد 92",592,"محمد 92","kh92"]
["",null,null,null,null,null,1,3,593,"محمد 93",593,"محمد 93","kh93"]
["",null,null,null,null,null,1,3,594,"محمد 94",594,"محمد 94","kh94"]
["",null,null,null,null,null,1,3,595,"محمد 95",595,"محمد 95","kh95"]
["",null,null,null,null,null,1,3,596,"محمد 96",596,"محمد 96","kh96"]
["",null,null,null,null,null,1,3,597,"محمد 97",597,"محمد 97","kh97"]
["",null,null,null,null,null,1,3,598,"محمد 98",598,"محمد 98","kh98"]
["",null,null,null,null,null,1,3,599,"محمد 99",599,"محمد 99","kh99"]
["",null,null,null,null,null,1,3,600,"محمد 100",600,"محمد 100","kh100"]
["",null,null,null,null,null,1,3,601,"محمد 101",601,"محمد 101","kh101"]
["",null,null,null,null,null,1,3,602,"محمد 102",602,"محمد 102","kh102"]
["",null,null,null,null,null,1,3,603,"محمد 103",603,"محمد 103","kh103"]
["",null,null,null,null,null,1,3,604,"محمد 104",604,"محمد 104","kh104"]
["",null,null,null,null,null,1,3,605,"محمد 105",605,"محمد 105","kh105"]
["",null,null,null,null,null,1,3,606,"محمد 106",606,"محمد 106","kh106"]
["",null,null,null,null,null,1,3,607,"محمد 107",607,"محمد 107","kh107"]
["",null,null,null,null,null,1,3,608,"محمد 108",608,"محمد 108","kh108"]
["",null,null,null,null,null,1,3,609,"محمد 109",609,"محمد 109","kh109"]
["",null,null,null,null,null,1,3,610,"محمد 110",610,"محمد 110","kh110"]
["",null,null,null,null,null,1,3,611,"محمد 111",611,"محمد 111","kh111"]
["",null,null,null,null,null,1,3,612,"محمد 112",612,"محمد 112","kh112"]
["",null,null,null,null,null,1,3,613,"محمد 113",613,"محمد 113","kh113"]
["",null,null,null,null,null,1,3,614,"محمد 114",614,"محمد 114","kh114"]
["",null,null,null,null,null,1,3,615,"محمد 115",615,"محمد 115","kh115"]
["",null,null,null,null,null,1,3,616,"محمد 116",616,"محمد 116","kh116"]
["",null,null,null,null,null,1,3,617,"محمد 117",617,"محمد 117","kh117"]
["",null,null,null,null,null,1,3,618,"محمد 118",618,"محمد 118","kh118"]
["",null,null,null,null,null,1,3,619,"محمد 119",619,"محمد 119","kh119"]
["",null,null,null,null,null,1,3,620,"محمد 120",620,"محمد 120","kh120"]
["",null,null,null,null,null,1,3,621,"محمد 121",621,"محمد 121","kh121"]
["",null,null,null,null,null,1,3,622,"محمد 122",622,"محمد 122","kh122"]
["",null,null,null,null,null,1,3,623,"محمد 123",623,"محمد 123","kh123"]
["",null,null,null,null,null,1,3,624,"محمد 124",624,"محمد 124","kh124"]
["",null,null,null,null,null,1,2,625,"محمد 125",625,"محمد 125","kh125"]
["",null,null,null,null,null,1,2,626,"محمد 126",626,"محمد 126","kh126"]
["",null,null,null,null,null,1,2,627,"محمد 127",627,"محمد 127","kh127"]
["",null,null,null,null,null,1,2,628,"محمد 128",628,"محمد 128","kh128"]
["",null,null,null,null,null,1,2,629,"محمد 129",629,"محمد 129","kh129"]
[{"$f":"IFERROR(IF(B133<>\"\",ROW(),\"\")-3,\"\")","v":""},null,null,null,null,null,1,2,630,"محمد 130",630,"محمد 130","kh130"]
["",null,null,null,null,null,1,2,631,"محمد 131",631,"محمد 131","kh131"]
["",null,null,null,null,null,1,2,632,"محمد 132",632,"محمد 132","kh132"]
["",null,null,null,null,null,1,2,633,"محمد 133",633,"محمد 133","kh133"]
["",null,null,null,null,null,1,2,634,"محمد 134",634,"محمد 134","kh134"]
["",null,null,null,null,null,1,2,635,"محمد 135",635,"محمد 135","kh135"]
["",null,null,null,null,null,1,2,636,"محمد 136",636,"محمد 136","kh136"]
["",null,null,null,null,null,1,2,637,"محمد 137",637,"محمد 137","kh137"]
["",null,null,null,null,null,1,2,638,"محمد 138",638,"محمد 138","kh138"]
["",null,null,null,null,null,1,2,639,"محمد 139",639,"محمد 139","kh139"]
["",null,null,null,null,null,1,2,640,"محمد 140",640,"محمد 140","kh140"]
["",null,null,null,null,null,1,2,641,"محمد 141",641,"محمد 141","kh141"]
["",null,null,null,null,null,1,2,642,"محمد 142",642,"محمد 142","kh142"]
["",null,null,null,null,null,1,2,643,"محمد 143",643,"محمد 143","kh143"]
["",null,null,null,null,null,1,2,644,"محمد 144",644,"محمد 144","kh144"]
["",null,null,null,null,null,1,2,645,"محمد 145",645,"محمد 145","kh145"]
["",null,null,null,null,null,1,2,646,"محمد 146",646,"محمد 146","kh146"]
["",null,null,null,null,null,1,2,647,"محمد 147",647,"محمد 147","kh147"]
["",null,null,null,null,null,1,2,648,"محمد 148",648,"محمد 148","kh148"]
["",null,null,null,null,null,1,2,649,"محمد 149",649,"محمد 149","kh149"]
["",null,null,null,null,null,1,2,650,"محمد 150",650,"محمد 150","kh150"]
["",null,null,null,null,null,1,2,651,"محمد 151",651,"محمد 151","kh151"]
["",null,null,null,null,null,1,2,652,"محمد 152",652,"محمد 152","kh152"]
["",null,null,null,null,null,1,2,653,"محمد 153",653,"محمد 153","kh153"]
["",null,null,null,null,null,1,2,654,"محمد 154",654,"محمد 154","kh154"]
["",null,null,null,null,null,1,2,655,"محمد 155",655,"محمد 155","kh155"]
["",null,null,null,null,null,1,2,656,"محمد 156",656,"محمد 156","kh156"]
["",null,null,null,null,null,1,2,657,"محمد 157",657,"محمد 157","kh157"]
["",null,null,null,null,null,1,2,658,"محمد 158",658,"محمد 158","kh158"]
["",null,null,null,null,null,1,2,659,"محمد 159",659,"محمد 159","kh159"]
["",null,null,null,null,null,1,2,660,"محمد 160",660,"محمد 160","kh160"]
["",null,null,null,null,null,1,2,661,"محمد 161",661,"محمد 161","kh161"]
["",null,null,null,null,null,1,2,662,"محمد 162",662,"محمد 162","kh162"]
["",null,null,null,null,null,1,2,663,"محمد 163",663,"محمد 163","kh163"]
["",null,null,null,null,null,1,2,664,"محمد 164",664,"محمد 164","kh164"]
["",null,null,null,null,null,1,2,665,"محمد 165",665,"محمد 165","kh165"]
["",null,null,null,null,null,1,2,666,"محمد 166",666,"محمد 166","kh166"]
["",null,null,null,null,null,1,2,667,"محمد 167",667,"محمد 167","kh167"]
["",null,null,null,null,null,1,2,668,"محمد 168",668,"محمد 168","kh168"]
["",null,null,null,null,null,1,2,669,"محمد 169",669,"محمد 169","kh169"]
["",null,null,null,null,null,1,2,670,"محمد 170",670,"محمد 170","kh170"]
["",null,null,null,null,null,1,2,671,"محمد 171",671,"محمد 171","kh171"]
["",null,null,null,null,null,1,2,672,"محمد 172",672,"محمد 172","kh172"]
["",null,null,null,null,null,1,2,673,"محمد 173",673,"محمد 173","kh173"]
["",null,null,null,null,null,1,2,674,"محمد 174",674,"محمد 174","kh174"]
["",null,null,null,null,null,1,2,675,"محمد 175",675,"محمد 175","kh175"]
["",null,null,null,null,null,1,2,676,"محمد 176",676,"محمد 176","kh176"]
["",null,null,null,null,null,1,2,677,"محمد 177",677,"محمد 177","kh177"]
["",null,null,null,null,null,1,2,678,"محمد 178",678,"محمد 178","kh178"]
["",null,null,null,null,null,1,2,679,"محمد 179",679,"محمد 179","kh179"]
["",null,null,null,null,null,1,2,680,"محمد 180",680,"محمد 180","kh180"]
["",null,null,null,null,null,1,2,681,"محمد 181",681,"محمد 181","kh181"]
["",null,null,null,null,null,1,2,682,"محمد 182",682,"محمد 182","kh182"]
["",null,null,null,null,null,1,2,683,"محمد 183",683,"محمد 183","kh183"]
["",null,null,null,null,null,1,2,684,"محمد 184",684,"محمد 184","kh184"]
["",null,null,null,null,null,1,2,685,"محمد 185",685,"محمد 185","kh185"]
["",null,null,null,null,null,1,2,686,"محمد 186",686,"محمد 186","kh186"]
["",null,null,null,null,null,1,2,687,"محمد 187",687,"محمد 187","kh187"]
["",null,null,null,null,null,1,2,688,"محمد 188",688,"محمد 188","kh188"]
["",null,null,null,null,null,1,2,689,"محمد 189",689,"محمد 189","kh189"]
["",null,null,null,null,null,1,2,690,"محمد 190",690,"محمد 190","kh190"]
["",null,null,null,null,null,1,2,691,"محمد 191",691,"محمد 191","kh191"]
["",null,null,null,null,null,1,2,692,"محمد 192",692,"محمد 192","kh192"]
["",null,null,null,null,null,1,2,693,"محمد 193",693,"محمد 193","kh193"]
[{"$f":"IFERROR(IF(B197<>\"\",ROW(),\"\")-3,\"\")","v":""},null,null,null,null,null,1,2,694,"محمد 194",694,"محمد 194","kh194"]
["",null,null,null,null,null,1,2,695,"محمد 195",695,"محمد 195","kh195"]
["",null,null,null,null,null,1,2,696,"محمد 196",696,"محمد 196","kh196"]
["",null,null,null,null,null,1,2,697,"محمد 197",697,"محمد 197","kh197"]
["",null,null,null,null,null,1,2,698,"محمد 198",698,"محمد 198","kh198"]
["",null,null,null,null,null,1,2,699,"محمد 199",699,"محمد 199","kh199"]
["",null,null,null,null,null,1,2,700,"محمد 200",700,"محمد 200","kh200"]
["",null,null,null,null,null,1,2,701,"محمد 201",701,"محمد 201","kh201"]
["",null,null,null,null,null,1,2,702,"محمد 202",702,"محمد 202","kh202"]
["",null,null,null,null,null,1,2,703,"محمد 203",703,"محمد 203","kh203"]
["",null,null,null,null,null,1,2,704,"محمد 204",704,"محمد 204","kh204"]
["",null,null,null,null,null,1,2,705,"محمد 205",705,"محمد 205","kh205"]
["",null,null,null,null,null,1,2,706,"محمد 206",706,"محمد 206","kh206"]
["",null,null,null,null,null,1,2,707,"محمد 207",707,"محمد 207","kh207"]
["",null,null,null,null,null,1,2,708,"محمد 208",708,"محمد 208","kh208"]
["",null,null,null,null,null,1,2,709,"محمد 209",709,"محمد 209","kh209"]
["",null,null,null,null,null,1,2,710,"محمد 210",710,"محمد 210","kh210"]
["",null,null,null,null,null,1,2,711,"محمد 211",711,"محمد 211","kh211"]
["",null,null,null,null,null,1,2,712,"محمد 212",712,"محمد 212","kh212"]
["",null,null,null,null,null,1,2,713,"محمد 213",713,"محمد 213","kh213"]
["",null,null,null,null,null,1,2,714,"محمد 214",714,"محمد 214","kh214"]
["",null,null,null,null,null,1,2,715,"محمد 215",715,"محمد 215","kh215"]
["",null,null,null,null,null,1,2,716,"محمد 216",716,"محمد 216","kh216"]
["",null,null,null,null,null,1,2,717,"محمد 217",717,"محمد 217","kh217"]
["",null,null,null,null,null,1,2,718,"محمد 218",718,"محمد 218","kh218"]
["",null,null,null,null,null,1,2,719,"محمد 219",719,"محمد 219","kh219"]
["",null,null,null,null,null,1,2,720,"محمد 220",720,"محمد 220","kh220"]
["",null,null,null,null,null,1,2,721,"محمد 221",721,"محمد 221","kh221"]
["",null,null,null,null,null,1,2,722,"محمد 222",722,"محمد 222","kh222"]
["",null,null,null,null,null,1,2,723,"محمد 223",723,"محمد 223","kh223"]
["",null,null,null,null,null,1,2,724,"محمد 224",724,"محمد 224","kh224"]
["",null,null,null,null,null,1,2,725,"محمد 225",725,"محمد 225","kh225"]
["",null,null,null,null,null,1,2,726,"محمد 226",726,"محمد 226","kh226"]
["",null,null,null,null,null,1,2,727,"محمد 227",727,"محمد 227","kh227"]
["",null,null,null,null,null,1,2,728,"محمد 228",728,"محمد 228","kh228"]
["",null,null,null,null,null,1,2,729,"محمد 229",729,"محمد 229","kh229"]
["",null,null,null,null,null,1,2,730,"محمد 230",730,"محمد 230","kh230"]
["",null,null,null,null,null,1,2,731,"محمد 231",731,"محمد 231","kh231"]
["",null,null,null,null,null,1,2,732,"محمد 232",732,"محمد 232","kh232"]
["",null,null,null,null,null,1,2,733,"محمد 233",733,"محمد 233","kh233"]
["",null,null,null,null,null,1,2,734,"محمد 234",734,"محمد 234","kh234"]
["",null,null,null,null,null,1,2,735,"محمد 235",735,"محمد 235","kh235"]
["",null,null,null,null,null,1,2,736,"محمد 236",736,"محمد 236","kh236"]
["",null,null,null,null,null,1,2,737,"محمد 237",737,"محمد 237","kh237"]
["",null,null,null,null,null,1,2,738,"محمد 238",738,"محمد 238","kh238"]
["",null,null,null,null,null,1,2,739,"محمد 239",739,"محمد 239","kh239"]
["",null,null,null,null,null,1,2,740,"محمد 240",740,"محمد 240","kh240"]
["",null,null,null,null,null,1,2,741,"محمد 241",741,"محمد 241","kh241"]
["",null,null,null,null,null,1,2,742,"محمد 242",742,"محمد 242","kh242"]
["",null,null,null,null,null,1,2,743,"محمد 243",743,"محمد 243","kh243"]
["",null,null,null,null,null,1,2,744,"محمد 244",744,"محمد 244","kh244"]
["",null,null,null,null,null,1,2,745,"محمد 245",745,"محمد 245","kh245"]
["",null,null,null,null,null,1,2,746,"محمد 246",746,"محمد 246","kh246"]
["",null,null,null,null,null,1,2,747,"محمد 247",747,"محمد 247","kh247"]
["",null,null,null,null,null,1,2,748,"محمد 248",748,"محمد 248","kh248"]
["",null,null,null,null,null,1,2,749,"محمد 249",749,"محمد 249","kh249"]
["",null,null,null,null,null,1,2,750,"محمد 250",750,"محمد 250","kh250"]
["",null,null,null,null,null,1,2,751,"محمد 251",751,"محمد 251","kh251"]
["",null,null,null,null,null,1,2,752,"محمد 252",752,"محمد 252","kh252"]
["",null,null,null,null,null,1,2,753,"محمد 253",753,"محمد 253","kh253"]
["",null,null,null,null,null,1,2,754,"محمد 254",754,"محمد 254","kh254"]
["",null,null,null,null,null,1,2,755,"محمد 255",755,"محمد 255","kh255"]
["",null,null,null,null,null,1,2,756,"محمد 256",756,"محمد 256","kh256"]
["",null,null,null,null,null,1,2,757,"محمد 257",757,"محمد 257","kh257"]
[{"$f":"IFERROR(IF(B261<>\"\",ROW(),\"\")-3,\"\")","v":""},null,null,null,null,null,1,2,758,"محمد 258",758,"محمد 258","kh258"]
["",null,null,null,null,null,1,2,759,"محمد 259",759,"محمد 259","kh259"]
["",null,null,null,null,null,1,2,760,"محمد 260",760,"محمد 260","kh260"]
["",null,null,null,null,null,1,2,761,"محمد 261",761,"محمد 261","kh261"]
["",null,null,null,null,null,1,2,762,"محمد 262",762,"محمد 262","kh262"]
["",null,null,null,null,null,1,2,763,"محمد 263",763,"محمد 263","kh263"]
["",null,null,null,null,null,1,2,764,"محمد 264",764,"محمد 264","kh264"]
["",null,null,null,null,null,1,2,765,"محمد 265",765,"محمد 265","kh265"]
["",null,null,null,null,null,1,2,766,"محمد 266",766,"محمد 266","kh266"]
["",null,null,null,null,null,1,2,767,"محمد 267",767,"محمد 267","kh267"]
["",null,null,null,null,null,1,2,768,"محمد 268",768,"محمد 268","kh268"]
["",null,null,null,null,null,1,2,769,"محمد 269",769,"محمد 269","kh269"]
["",null,null,null,null,null,1,2,770,"محمد 270",770,"محمد 270","kh270"]
["",null,null,null,null,null,1,2,771,"محمد 271",771,"محمد 271","kh271"]
["",null,null,null,null,null,1,2,772,"محمد 272",772,"محمد 272","kh272"]
["",null,null,null,null,null,1,2,773,"محمد 273",773,"محمد 273","kh273"]
["",null,null,null,null,null,1,2,774,"محمد 274",774,"محمد 274","kh274"]
["",null,null,null,null,null,1,2,775,"محمد 275",775,"محمد 275","kh275"]
["",null,null,null,null,null,1,2,776,"محمد 276",776,"محمد 276","kh276"]
["",null,null,null,null,null,1,2,777,"محمد 277",777,"محمد 277","kh277"]
["",null,null,null,null,null,1,2,778,"محمد 278",778,"محمد 278","kh278"]
["",null,null,null,null,null,1,2,779,"محمد 279",779,"محمد 279","kh279"]
["",null,null,null,null,null,1,2,780,"محمد 280",780,"محمد 280","kh280"]
["",null,null,null,null,null,1,2,781,"محمد 281",781,"محمد 281","kh281"]
["",null,null,null,null,null,1,2,782,"محمد 282",782,"محمد 282","kh282"]
["",null,null,null,null,null,1,2,783,"محمد 283",783,"محمد 283","kh283"]
["",null,null,null,null,null,1,2,784,"محمد 284",784,"محمد 284","kh284"]
["",null,null,null,null,null,1,2,785,"محمد 285",785,"محمد 285","kh285"]
["",null,null,null,null,null,1,2,786,"محمد 286",786,"محمد 286","kh286"]
["",null,null,null,null,null,1,2,787,"محمد 287",787,"محمد 287","kh287"]
["",null,null,null,null,null,1,2,788,"محمد 288",788,"محمد 288","kh288"]
["",null,null,null,null,null,1,2,789,"محمد 289",789,"محمد 289","kh289"]
["",null,null,null,null,null,1,2,790,"محمد 290",790,"محمد 290","kh290"]
["",null,null,null,null,null,1,2,791,"محمد 291",791,"محمد 291","kh291"]
["",null,null,null,null,null,1,2,792,"محمد 292",792,"محمد 292","kh292"]
["",null,null,null,null,null,1,2,793,"محمد 293",793,"محمد 293","kh293"]
["",null,null,null,null,null,1,2,794,"محمد 294",794,"محمد 294","kh294"]
["",null,null,null,null,null,1,2,795,"محمد 295",795,"محمد 295","kh295"]
["",null,null,null,null,null,1,2,796,"محمد 296",796,"محمد 296","kh296"]
["",null,null,null,null,null,1,2,797,"محمد 297",797,"محمد 297","kh297"]
["",null,null,null,null,null,1,2,798,"محمد 298",798,"محمد 298","kh298"]
["",null,null,null,null,null,1,2,799,"محمد 299",799,"محمد 299","kh299"]
["",null,null,null,null,null,1,2,800,"محمد 300",800,"محمد 300","kh300"]
["",null,null,null,null,null,1,2,801,"محمد 301",801,"محمد 301","kh301"]
["",null,null,null,null,null,1,2,802,"محمد 302",802,"محمد 302","kh302"]
["",null,null,null,null,null,1,2,803,"محمد 303",803,"محمد 303","kh303"]
["",null,null,null,null,null,1,2,804,"محمد 304",804,"محمد 304","kh304"]
["",null,null,null,null,null,1,2,805,"محمد 305",805,"محمد 305","kh305"]
["",null,null,null,null,null,1,2,806,"محمد 306",806,"محمد 306","kh306"]
["",null,null,null,null,null,1,2,807,"محمد 307",807,"محمد 307","kh307"]
["",null,null,null,null,null,1,2,808,"محمد 308",808,"محمد 308","kh308"]
["",null,null,null,null,null,1,2,809,"محمد 309",809,"محمد 309","kh309"]
["",null,null,null,null,null,1,2,810,"محمد 310",810,"محمد 310","kh310"]
["",null,null,null,null,null,1,1,811,"محمد 311",811,"محمد 311","kh311"]
["",null,null,null,null,null,1,1,812,"محمد 312",812,"محمد 312","kh312"]
["",null,null,null,null,null,1,1,813,"محمد 313",813,"محمد 313","kh313"]
["",null,null,null,null,null,1,1,814,"محمد 314",814,"محمد 314","kh314"]
["",null,null,null,null,null,1,1,815,"محمد 315",815,"محمد 315","kh315"]
["",null,null,null,null,null,1,1,816,"محمد 316",816,"محمد 316","kh316"]
["",null,null,null,null,null,1,1,817,"محمد 317",817,"محمد 317","kh317"]
["",null,null,null,null,null,1,1,818,"محمد 318",818,"محمد 318","kh318"]
["",null,null,null,null,null,1,1,819,"محمد 319",819,"محمد 319","kh319"]
["",null,null,null,null,null,1,1,820,"محمد 320",820,"محمد 320","kh320"]
["",null,null,null,null,null,1,1,821,"محمد 321",821,"محمد 321","kh321"]
[{"$f":"IFERROR(IF(B325<>\"\",ROW(),\"\")-3,\"\")","v":""},null,null,null,null,null,1,1,822,"محمد 322",822,"محمد 322","kh322"]
["",null,null,null,null,null,1,1,823,"محمد 323",823,"محمد 323","kh323"]
["",null,null,null,null,null,1,1,824,"محمد 324",824,"محمد 324","kh324"]
["",null,null,null,null,null,1,1,825,"محمد 325",825,"محمد 325","kh325"]
["",null,null,null,null,null,1,1,826,"محمد 326",826,"محمد 326","kh326"]
["",null,null,null,null,null,1,1,827,"محمد 327",827,"محمد 327","kh327"]
["",null,null,null,null,null,1,1,828,"محمد 328",828,"محمد 328","kh328"]
["",null,null,null,null,null,1,1,829,"محمد 329",829,"محمد 329","kh329"]
["",null,null,null,null,null,1,1,830,"محمد 330",830,"محمد 330","kh330"]
["",null,null,null,null,null,1,1,831,"محمد 331",831,"محمد 331","kh331"]
["",null,null,null,null,null,1,1,832,"محمد 332",832,"محمد 332","kh332"]
["",null,null,null,null,null,1,1,833,"محمد 333",833,"محمد 333","kh333"]
["",null,null,null,null,null,1,1,834,"محمد 334",834,"محمد 334","kh334"]
["",null,null,null,null,null,1,1,835,"محمد 335",835,"محمد 335","kh335"]
["",null,null,null,null,null,1,1,836,"محمد 336",836,"محمد 336","kh336"]
["",null,null,null,null,null,1,1,837,"محمد 337",837,"محمد 337","kh337"]
["",null,null,null,null,null,1,1,838,"محمد 338",838,"محمد 338","kh338"]
["",null,null,null,null,null,1,1,839,"محمد 339",839,"محمد 339","kh339"]
["",null,null,null,null,null,1,1,840,"محمد 340",840,"محمد 340","kh340"]
["",null,null,null,null,null,1,1,841,"محمد 341",841,"محمد 341","kh341"]
["",null,null,null,null,null,1,1,842,"محمد 342",842,"محمد 342","kh342"]
["",null,null,null,null,null,1,1,843,"محمد 343",843,"محمد 343","kh343"]
["",null,null,null,null,null,1,1,844,"محمد 344",844,"محمد 344","kh344"]
["",null,null,null,null,null,1,1,845,"محمد 345",845,"محمد 345","kh345"]
["",null,null,null,null,null,1,1,846,"محمد 346",846,"محمد 346","kh346"]
["",null,null,null,null,null,1,1,847,"محمد 347",847,"محمد 347","kh347"]
["",null,null,null,null,null,1,1,848,"محمد 348",848,"محمد 348","kh348"]
["",null,null,null,null,null,1,1,849,"محمد 349",849,"محمد 349","kh349"]
["",null,null,null,null,null,1,1,850,"محمد 350",850,"محمد 350","kh350"]
["",null,null,null,null,null,1,1,851,"محمد 351",851,"محمد 351","kh351"]
["",null,null,null,null,null,1,1,852,"محمد 352",852,"محمد 352","kh352"]
["",null,null,null,null,null,1,1,853,"محمد 353",853,"محمد 353","kh353"]
["",null,null,null,null,null,1,1,854,"محمد 354",854,"محمد 354","kh354"]
["",null,null,null,null,null,1,1,855,"محمد 355",855,"محمد 355","kh355"]
["",null,null,null,null,null,1,1,856,"محمد 356",856,"محمد 356","kh356"]
["",null,null,null,null,null,1,1,857,"محمد 357",857,"محمد 357","kh357"]
["",null,null,null,null,null,1,1,858,"محمد 358",858,"محمد 358","kh358"]
["",null,null,null,null,null,1,1,859,"محمد 359",859,"محمد 359","kh359"]
["",null,null,null,null,null,1,1,860,"محمد 360",860,"محمد 360","kh360"]
["",null,null,null,null,null,1,1,861,"محمد 361",861,"محمد 361","kh361"]
["",null,null,null,null,null,1,1,862,"محمد 362",862,"محمد 362","kh362"]
["",null,null,null,null,null,1,1,863,"محمد 363",863,"محمد 363","kh363"]
["",null,null,null,null,null,1,1,864,"محمد 364",864,"محمد 364","kh364"]
["",null,null,null,null,null,1,1,865,"محمد 365",865,"محمد 365","kh365"]
["",null,null,null,null,null,1,1,866,"محمد 366",866,"محمد 366","kh366"]
["",null,null,null,null,null,1,1,867,"محمد 367",867,"محمد 367","kh367"]
["",null,null,null,null,null,1,1,868,"محمد 368",868,"محمد 368","kh368"]
["",null,null,null,null,null,1,1,869,"محمد 369",869,"محمد 369","kh369"]
["",null,null,null,null,null,1,1,870,"محمد 370",870,"محمد 370","kh370"]
["",null,null,null,null,null,1,1,871,"محمد 371",871,"محمد 371","kh371"]
["",null,null,null,null,null,1,1,872,"محمد 372",872,"محمد 372","kh372"]
["",null,null,null,null,null,1,1,873,"محمد 373",873,"محمد 373","kh373"]
["",null,null,null,null,null,1,1,874,"محمد 374",874,"محمد 374","kh374"]
["",null,null,null,null,null,1,1,875,"محمد 375",875,"محمد 375","kh375"]
["",null,null,null,null,null,1,1,876,"محمد 376",876,"محمد 376","kh376"]
["",null,null,null,null,null,1,1,877,"محمد 377",877,"محمد 377","kh377"]
["",null,null,null,null,null,1,1,878,"محمد 378",878,"محمد 378","kh378"]
["",null,null,null,null,null,1,1,879,"محمد 379",879,"محمد 379","kh379"]
["",null,null,null,null,null,1,1,880,"محمد 380",880,"محمد 380","kh380"]
["",null,null,null,null,null,1,1,881,"محمد 381",881,"محمد 381","kh381"]
["",null,null,null,null,null,1,1,882,"محمد 382",882,"محمد 382","kh382"]
["",null,null,null,null,null,1,1,883,"محمد 383",883,"محمد 383","kh383"]
["",null,null,null,null,null,1,1,884,"محمد 384",884,"محمد 384","kh384"]
["",null,null,null,null,null,1,1,885,"محمد 385",885,"محمد 385","kh385"]
[{"$f":"IFERROR(IF(B389<>\"\",ROW(),\"\")-3,\"\")","v":""},null,null,null,null,null,1,1,886,"محمد 386",886,"محمد 386","kh386"]
["",null,null,null,null,null,1,1,887,"محمد 387",887,"محمد 387","kh387"]
["",null,null,null,null,null,1,1,888,"محمد 388",888,"محمد 388","kh388"]
["",null,null,null,null,null,1,1,889,"محمد 389",889,"محمد 389","kh389"]
["",null,null,null,null,null,1,1,890,"محمد 390",890,"محمد 390","kh390"]
["",null,null,null,null,null,1,1,891,"محمد 391",891,"محمد 391","kh391"]
["",null,null,null,null,null,1,1,892,"محمد 392",892,"محمد 392","kh392"]
["",null,null,null,null,null,1,1,893,"محمد 393",893,"محمد 393","kh393"]
["",null,null,null,null,null,1,1,894,"محمد 394",894,"محمد 394","kh394"]
["",null,null,null,null,null,1,1,895,"محمد 395",895,"محمد 395","kh395"]
["",null,null,null,null,null,1,1,896,"محمد 396",896,"محمد 396","kh396"]
["",null,null,null,null,null,1,1,897,"محمد 397",897,"محمد 397","kh397"]
["",null,null,null,null,null,1,1,898,"محمد 398",898,"محمد 398","kh398"]
["",null,null,null,null,null,1,1,899,"محمد 399",899,"محمد 399","kh399"]
["",null,null,null,null,null,1,1,900,"محمد 400",900,"محمد 400","kh400"]
["",null,null,null,null,null,1,1,901,"محمد 401",901,"محمد 401","kh401"]
["",null,null,null,null,null,1,1,902,"محمد 402",902,"محمد 402","kh402"]
["",null,null,null,null,null,1,1,903,"محمد 403",903,"محمد 403","kh403"]
["",null,null,null,null,null,1,1,904,"محمد 404",904,"محمد 404","kh404"]
["",null,null,null,null,null,1,1,905,"محمد 405",905,"محمد 405","kh405"]
["",null,null,null,null,null,1,1,906,"محمد 406",906,"محمد 406","kh406"]
["",null,null,null,null,null,1,1,907,"محمد 407",907,"محمد 407","kh407"]
["",null,null,null,null,null,1,1,908,"محمد 408",908,"محمد 408","kh408"]
["",null,null,null,null,null,1,1,909,"محمد 409",909,"محمد 409","kh409"]
["",null,null,null,null,null,1,1,910,"محمد 410",910,"محمد 410","kh410"]
["",null,null,null,null,null,1,1,911,"محمد 411",911,"محمد 411","kh411"]
["",null,null,null,null,null,1,1,912,"محمد 412",912,"محمد 412","kh412"]
["",null,null,null,null,null,1,1,913,"محمد 413",913,"محمد 413","kh413"]
["",null,null,null,null,null,1,1,914,"محمد 414",914,"محمد 414","kh414"]
["",null,null,null,null,null,1,1,915,"محمد 415",915,"محمد 415","kh415"]
["",null,null,null,null,null,1,1,916,"محمد 416",916,"محمد 416","kh416"]
["",null,null,null,null,null,1,1,917,"محمد 417",917,"محمد 417","kh417"]
["",null,null,null,null,null,1,1,918,"محمد 418",918,"محمد 418","kh418"]
["",null,null,null,null,null,1,1,919,"محمد 419",919,"محمد 419","kh419"]
["",null,null,null,null,null,1,1,920,"محمد 420",920,"محمد 420","kh420"]
["",null,null,null,null,null,1,1,921,"محمد 421",921,"محمد 421","kh421"]
["",null,null,null,null,null,1,1,922,"محمد 422",922,"محمد 422","kh422"]
["",null,null,null,null,null,1,1,923,"محمد 423",923,"محمد 423","kh423"]
["",null,null,null,null,null,1,1,924,"محمد 424",924,"محمد 424","kh424"]
["",null,null,null,null,null,1,1,925,"محمد 425",925,"محمد 425","kh425"]
["",null,null,null,null,null,1,1,926,"محمد 426",926,"محمد 426","kh426"]
["",null,null,null,null,null,1,1,927,"محمد 427",927,"محمد 427","kh427"]
["",null,null,null,null,null,1,1,928,"محمد 428",928,"محمد 428","kh428"]
["",null,null,null,null,null,1,1,929,"محمد 429",929,"محمد 429","kh429"]
["",null,null,null,null,null,1,1,930,"محمد 430",930,"محمد 430","kh430"]
["",null,null,null,null,null,1,1,931,"محمد 431",931,"محمد 431","kh431"]
["",null,null,null,null,null,1,1,932,"محمد 432",932,"محمد 432","kh432"]
["",null,null,null,null,null,1,1,933,"محمد 433",933,"محمد 433","kh433"]
["",null,null,null,null,null,1,1,934,"محمد 434",934,"محمد 434","kh434"]
["",null,null,null,null,null,1,1,935,"محمد 435",935,"محمد 435","kh435"]
["",null,null,null,null,null,1,1,936,"محمد 436",936,"محمد 436","kh436"]
["",null,null,null,null,null,1,1,937,"محمد 437",937,"محمد 437","kh437"]
["",null,null,null,null,null,1,1,938,"محمد 438",938,"محمد 438","kh438"]
["",null,null,null,null,null,1,1,939,"محمد 439",939,"محمد 439","kh439"]
["",null,null,null,null,null,1,1,940,"محمد 440",940,"محمد 440","kh440"]
["",null,null,null,null,null,1,1,941,"محمد 441",941,"محمد 441","kh441"]
["",null,null,null,null,null,1,1,942,"محمد 442",942,"محمد 442","kh442"]
["",null,null,null,null,null,1,1,943,"محمد 443",943,"محمد 443","kh443"]
["",null,null,null,null,null,1,1,944,"محمد 444",944,"محمد 444","kh444"]
["",null,null,null,null,null,1,1,945,"محمد 445",945,"محمد 445","kh445"]
["",null,null,null,null,null,1,1,946,"محمد 446",946,"محمد 446","kh446"]
["",null,null,null,null,null,1,1,947,"محمد 447",947,"محمد 447","kh447"]
["",null,null,null,null,null,1,1,948,"محمد 448",948,"محمد 448","kh448"]
["",null,null,null,null,null,1,1,949,"محمد 449",949,"محمد 449","kh449"]
[{"$f":"IFERROR(IF(B453<>\"\",ROW(),\"\")-3,\"\")","v":""},null,null,null,null,null,1,1,950,"محمد 450",950,"محمد 450","kh450"]
["",null,null,null,null,null,1,1,951,"محمد 451",951,"محمد 451","kh451"]
["",null,null,null,null,null,1,1,952,"محمد 452",952,"محمد 452","kh452"]
["",null,null,null,null,null,1,1,953,"محمد 453",953,"محمد 453","kh453"]
["",null,null,null,null,null,1,1,954,"محمد 454",954,"محمد 454","kh454"]
["",null,null,null,null,null,1,1,955,"محمد 455",955,"محمد 455","kh455"]
["",null,null,null,null,null,1,1,956,"محمد 456",956,"محمد 456","kh456"]
["",null,null,null,null,null,1,1,957,"محمد 457",957,"محمد 457","kh457"]
["",null,null,null,null,null,1,1,958,"محمد 458",958,"محمد 458","kh458"]
["",null,null,null,null,null,1,1,959,"محمد 459",959,"محمد 459","kh459"]
["",null,null,null,null,null,1,1,960,"محمد 460",960,"محمد 460","kh460"]
["",null,null,null,null,null,1,1,961,"محمد 461",961,"محمد 461","kh461"]
["",null,null,null,null,null,1,1,962,"محمد 462",962,"محمد 462","kh462"]
["",null,null,null,null,null,1,1,963,"محمد 463",963,"محمد 463","kh463"]
["",null,null,null,null,null,1,1,964,"محمد 464",964,"محمد 464","kh464"]
["",null,null,null,null,null,1,1,965,"محمد 465",965,"محمد 465","kh465"]
["",null,null,null,null,null,1,1,966,"محمد 466",966,"محمد 466","kh466"]
["",null,null,null,null,null,1,1,967,"محمد 467",967,"محمد 467","kh467"]
["",null,null,null,null,null,1,1,968,"محمد 468",968,"محمد 468","kh468"]
["",null,null,null,null,null,1,1,969,"محمد 469",969,"محمد 469","kh469"]
["",null,null,null,null,null,1,1,970,"محمد 470",970,"محمد 470","kh470"]
["",null,null,null,null,null,1,1,971,"محمد 471",971,"محمد 471","kh471"]
["",null,null,null,null,null,1,1,972,"محمد 472",972,"محمد 472","kh472"]
["",null,null,null,null,null,1,1,973,"محمد 473",973,"محمد 473","kh473"]
["",null,null,null,null,null,1,1,974,"محمد 474",974,"محمد 474","kh474"]
["",null,null,null,null,null,1,1,975,"محمد 475",975,"محمد 475","kh475"]
["",null,null,null,null,null,1,1,976,"محمد 476",976,"محمد 476","kh476"]
["",null,null,null,null,null,1,1,977,"محمد 477",977,"محمد 477","kh477"]
["",null,null,null,null,null,1,1,978,"محمد 478",978,"محمد 478","kh478"]
["",null,null,null,null,null,1,1,979,"محمد 479",979,"محمد 479","kh479"]
["",null,null,null,null,null,1,1,980,"محمد 480",980,"محمد 480","kh480"]
["",null,null,null,null,null,1,1,981,"محمد 481",981,"محمد 481","kh481"]
["",null,null,null,null,null,1,1,982,"محمد 482",982,"محمد 482","kh482"]
["",null,null,null,null,null,1,1,983,"محمد 483",983,"محمد 483","kh483"]
["",null,null,null,null,null,1,1,984,"محمد 484",984,"محمد 484","kh484"]
["",null,null,null,null,null,1,1,985,"محمد 485",985,"محمد 485","kh485"]
["",null,null,null,null,null,1,1,986,"محمد 486",986,"محمد 486","kh486"]
["",null,null,null,null,null,1,1,987,"محمد 487",987,"محمد 487","kh487"]
["",null,null,null,null,null,1,1,988,"محمد 488",988,"محمد 488","kh488"]
["",null,null,null,null,null,1,1,989,"محمد 489",989,"محمد 489","kh489"]
["",null,null,null,null,null,1,1,990,"محمد 490",990,"محمد 490","kh490"]
["",null,null,null,null,null,1,1,991,"محمد 491",991,"محمد 491","kh491"]
["",null,null,null,null,null,1,1,992,"محمد 492",992,"محمد 492","kh492"]
["",null,null,null,null,null,1,1,993,"محمد 493",993,"محمد 493","kh493"]
["",null,null,null,null,null,1,1,994,"محمد 494",994,"محمد 494","kh494"]
["",null,null,null,null,null,1,1,995,"محمد 495",995,"محمد 495","kh495"]
["",null,null,null,null,null,1,0,996,"محمد 496",996,"محمد 496","kh496"]
[null,497,1497,"2012-05-25",null,997,1,0,997,"محمد 497",997,"محمد 497","kh497"]
[null,498,1498,"2012-05-26",null,999,1,0,998,"محمد 498",998,"محمد 498","kh498"]
[null,499,1499,"2012-05-27",null,1001,1,0,999,"محمد 499",999,"محمد 499","kh499"]
[null,500,1500,"2012-05-28",null,1002,1,0,1000,"محمد 500",1000,"محمد 500","kh500"]
[null,501,1501,"2012-05-29",null,1004,1,0,1001,"محمد 501",1001,"محمد 501","kh501"]
[null,502,1502,"2012-05-30",null,1006,1,0,1002,"محمد 502",1002,"محمد 502","kh502"]
[null,503,1503,"2012-05-31",null,1008,1,0,1003,"محمد 503",1003,"محمد 503","kh503"]
[null,504,1504,"2012-06-01",null,1009,1,0,1004,"محمد 504",1004,"محمد 504","kh504"]
[null,505,1505,"2012-06-02",null,1011,1,0,1005,"محمد 505",1005,"محمد 505","kh505"]
[null,506,1506,"2012-06-03",null,1013,1,0,1006,"محمد 506",1006,"محمد 506","kh506"]
[null,507,1507,"2012-06-04",null,1014,1,0,1007,"محمد 507",1007,"محمد 507","kh507"]
[null,508,1508,"2012-06-05",null,1016,1,0,1008,"محمد 508",1008,"محمد 508","kh508"]
[null,509,1509,"2012-06-06",null,1018,1,0,1009,"محمد 509",1009,"محمد 509","kh509"]
[null,510,1510,"2012-06-07",null,1020,1,0,1010,"محمد 510",1010,"محمد 510","kh510"]
[null,511,1511,"2012-06-08",null,1021,1,0,1011,"محمد 511",1011,"محمد 511","kh511"]
[null,512,1512,"2012-06-09",null,1023,1,0,1012,"محمد 512",1012,"محمد 512","kh512"]
[null,513,1513,"2012-06-10",null,1025,1,0,1013,"محمد 513",1013,"محمد 513","kh513"]
[null,514,1514,"2012-06-11",null,1026,1,0,1014,"محمد 514",1014,"محمد 514","kh514"]
[null,515,1515,"2012-06-12",null,1028,1,0,1015,"محمد 515",1015,"محمد 515","kh515"]
[null,516,1516,"2012-06-13",null,1030,1,0,1016,"محمد 516",1016,"محمد 516","kh516"]
[null,517,1517,"2012-06-14",null,1032,1,0,1017,"محمد 517",1017,"محمد 517","kh517"]
[null,518,1518,"2012-06-15",null,1033,1,0,1018,"محمد 518",1018,"محمد 518","kh518"]
[null,519,1519,"2012-06-16",null,1035,1,0,1019,"محمد 519",1019,"محمد 519","kh519"]
[null,520,1520,"2012-06-17",null,1037,1,0,1020,"محمد 520",1020,"محمد 520","kh520"]
[null,521,1521,"2012-06-18",null,1039,1,0,1021,"محمد 521",1021,"محمد 521","kh521"]
[null,522,1522,"2012-06-19",null,1040,1,0,1022,"محمد 522",1022,"محمد 522","kh522"]
[null,523,1523,"2012-06-20",null,1042,1,0,1023,"محمد 523",1023,"محمد 523","kh523"]
[null,524,1524,"2012-06-21",null,1044,1,0,1024,"محمد 524",1024,"محمد 524","kh524"]
[null,525,1525,"2012-06-22",null,1045,1,0,1025,"محمد 525",1025,"محمد 525","kh525"]
[null,526,1526,"2012-06-23",null,1047,1,0,1026,"محمد 526",1026,"محمد 526","kh526"]
[null,527,1527,"2012-06-24",null,1049,1,0,1027,"محمد 527",1027,"محمد 527","kh527"]
[null,528,1528,"2012-06-25",null,1051,1,0,1028,"محمد 528",1028,"محمد 528","kh528"]
[null,529,1529,"2012-06-26",null,1052,1,0,1029,"محمد 529",1029,"محمد 529","kh529"]
[null,530,1530,"2012-06-27",null,1054,1,0,1030,"محمد 530",1030,"محمد 530","kh530"]
[null,531,1531,"2012-06-28",null,1056,1,0,1031,"محمد 531",1031,"محمد 531","kh531"]
[null,532,1532,"2012-05-01",null,1057,1,0,1032,"محمد 532",1032,"محمد 532","kh532"]
[null,533,1533,"2012-05-02",null,1059,1,0,1033,"محمد 533",1033,"محمد 533","kh533"]
[null,534,1534,"2012-05-03",null,1061,1,0,1034,"محمد 534",1034,"محمد 534","kh534"]
[null,535,1535,"2012-05-04",null,1063,1,0,1035,"محمد 535",1035,"محمد 535","kh535"]
[null,536,1536,"2012-05-05",null,1064,1,0,1036,"محمد 536",1036,"محمد 536","kh536"]
[null,537,1537,"2012-05-06",null,1066,1,0,1037,"محمد 537",1037,"محمد 537","kh537"]
[null,538,1538,"2012-05-07",null,1068,1,0,1038,"محمد 538",1038,"محمد 538","kh538"]
[null,539,1539,"2012-05-08",null,1070,1,0,1039,"محمد 539",1039,"محمد 539","kh539"]
[null,540,1540,"2012-05-09",null,1071,1,0,1040,"محمد 540",1040,"محمد 540","kh540"]
[null,541,1541,"2012-05-10",null,1073,1,0,1041,"محمد 541",1041,"محمد 541","kh541"]
[null,542,1542,"2012-05-11",null,1075,1,0,1042,"محمد 542",1042,"محمد 542","kh542"]
[null,543,1543,"2012-05-12",null,1076,1,0,1043,"محمد 543",1043,"محمد 543","kh543"]
[null,544,1544,"2012-05-13",null,1078,1,0,1044,"محمد 544",1044,"محمد 544","kh544"]
[null,545,1545,"2012-05-14",null,1080,1,0,1045,"محمد 545",1045,"محمد 545","kh545"]
[null,546,1546,"2012-05-15",null,1082,1,0,1046,"محمد 546",1046,"محمد 546","kh546"]
[null,547,1547,"2012-05-16",null,1083,1,0,1047,"محمد 547",1047,"محمد 547","kh547"]
[null,548,1548,"2012-05-17",null,1085,1,0,1048,"محمد 548",1048,"محمد 548","kh548"]
[null,549,1549,"2012-05-18",null,1087,1,0,1049,"محمد 549",1049,"محمد 549","kh549"]
[null,550,1550,"2012-05-19",null,1088,1,0,1050,"محمد 550",1050,"محمد 550","kh550"]
[null,551,1551,"2012-05-20",null,1090,1,0,1051,"محمد 551",1051,"محمد 551","kh551"]
[null,552,1552,"2012-05-21",null,1092,1,0,1052,"محمد 552",1052,"محمد 552","kh552"]
[null,553,1553,"2012-05-22",null,1094,1,0,1053,"محمد 553",1053,"محمد 553","kh553"]
[null,554,1554,"2012-05-23",null,1095,1,0,1054,"محمد 554",1054,"محمد 554","kh554"]
[null,555,1555,"2012-05-24",null,1097,1,0,1055,"محمد 555",1055,"محمد 555","kh555"]
[null,556,1556,"2012-05-25",null,1099,1,0,1056,"محمد 556",1056,"محمد 556","kh556"]
[null,557,1557,"2012-05-26",null,1101,1,0,1057,"محمد 557",1057,"محمد 557","kh557"]
[null,558,1558,"2012-05-27",null,1102,1,0,1058,"محمد 558",1058,"محمد 558","kh558"]
[null,559,1559,"2012-05-28",null,1104,1,0,1059,"محمد 559",1059,"محمد 559","kh559"]
[null,560,1560,"2012-05-29",null,1106,1,0,1060,"محمد 560",1060,"محمد 560","kh560"]
[null,561,1561,"2012-05-30",null,1107,1,0,1061,"محمد 561",1061,"محمد 561","kh561"]
[null,562,1562,"2012-05-31",null,1109,1,0,1062,"محمد 562",1062,"محمد 562","kh562"]
[null,563,1563,"2012-06-01",null,1111,1,0,1063,"محمد 563",1063,"محمد 563","kh563"]
[null,564,1564,"2012-06-02",null,1113,1,0,1064,"محمد 564",1064,"محمد 564","kh564"]
[null,565,1565,"2012-06-03",null,1114,1,0,1065,"محمد 565",1065,"محمد 565","kh565"]
[null,566,1566,"2012-06-04",null,1116,1,0,1066,"محمد 566",1066,"محمد 566","kh566"]
[null,567,1567,"2012-06-05",null,1118,1,0,1067,"محمد 567",1067,"محمد 567","kh567"]
[null,568,1568,"2012-06-06",null,1119,1,0,1068,"محمد 568",1068,"محمد 568","kh568"]
[null,569,1569,"2012-06-07",null,1121,1,0,1069,"محمد 569",1069,"محمد 569","kh569"]
[null,570,1570,"2012-06-08",null,1123,1,0,1070,"محمد 570",1070,"محمد 570","kh570"]
[null,571,1571,"2012-06-09",null,1125,1,0,1071,"محمد 571",1071,"محمد 571","kh571"]
[null,572,1572,"2012-06-10",null,1126,1,0,1072,"محمد 572",1072,"محمد 572","kh572"]
[null,573,1573,"2012-06-11",null,1128,1,0,1073,"محمد 573",1073,"محمد 573","kh573"]
[null,574,1574,"2012-06-12",null,1130,1,0,1074,"محمد 574",1074,"محمد 574","kh574"]
[null,575,1575,"2012-06-13",null,1132,1,0,1075,"محمد 575",1075,"محمد 575","kh575"]
[null,576,1576,"2012-06-14",null,1133,1,0,1076,"محمد 576",1076,"محمد 576","kh576"]
[null,577,1577,"2012-06-15",null,1135,1,0,1077,"محمد 577",1077,"محمد 577","kh577"]
[null,578,1578,"2012-06-16",null,1137,1,0,1078,"محمد 578",1078,"محمد 578","kh578"]
[null,579,1579,"2012-06-17",null,1138,1,0,1079,"محمد 579",1079,"محمد 579","kh579"]
[null,580,1580,"2012-06-18",null,1140,1,0,1080,"محمد 580",1080,"محمد 580","kh580"]
[null,581,1581,"2012-06-19",null,1142,1,0,1081,"محمد 581",1081,"محمد 581","kh581"]
[null,582,1582,"2012-06-20",null,1144,1,0,1082,"محمد 582",1082,"محمد 582","kh582"]
[null,583,1583,"2012-06-21",null,1145,1,0,1083,"محمد 583",1083,"محمد 583","kh583"]
[null,584,1584,"2012-06-22",null,1147,1,0,1084,"محمد 584",1084,"محمد 584","kh584"]
[null,585,1585,"2012-06-23",null,1149,1,0,1085,"محمد 585",1085,"محمد 585","kh585"]
[null,586,1586,"2012-06-24",null,1150,1,0,1086,"محمد 586",1086,"محمد 586","kh586"]
[null,587,1587,"2012-06-25",null,1152,1,0,1087,"محمد 587",1087,"محمد 587","kh587"]
[null,588,1588,"2012-06-26",null,1154,1,0,1088,"محمد 588",1088,"محمد 588","kh588"]
[null,589,1589,"2012-06-27",null,1156,1,0,1089,"محمد 589",1089,"محمد 589","kh589"]
[null,590,1590,"2012-06-28",null,1157,1,0,1090,"محمد 590",1090,"محمد 590","kh590"]
[null,591,1591,"2012-05-01",null,1159,1,0,1091,"محمد 591",1091,"محمد 591","kh591"]
[null,592,1592,"2012-05-02",null,1161,1,0,1092,"محمد 592",1092,"محمد 592","kh592"]
[null,593,1593,"2012-05-03",null,1163,1,0,1093,"محمد 593",1093,"محمد 593","kh593"]
[null,594,1594,"2012-05-04",null,1164,1,0,1094,"محمد 594",1094,"محمد 594","kh594"]
[null,595,1595,"2012-05-05",null,1166,1,0,1095,"محمد 595",1095,"محمد 595","kh595"]
[null,596,1596,"2012-05-06",null,1168,1,0,1096,"محمد 596",1096,"محمد 596","kh596"]
[null,597,1597,"2012-05-07",null,1169,1,0,1097,"محمد 597",1097,"محمد 597","kh597"]
[null,598,1598,"2012-05-08",null,1171,1,0,1098,"محمد 598",1098,"محمد 598","kh598"]
[null,599,1599,"2012-05-09",null,1173,1,0,1099,"محمد 599",1099,"محمد 599","kh599"]
[null,600,1600,"2012-05-10",null,1175,1,0,1100,"محمد 600",1100,"محمد 600","kh600"]
[null,601,1601,"2012-05-11",null,1176,1,0,1101,"محمد 601",1101,"محمد 601","kh601"]
[null,602,1602,"2012-05-12",null,1178,1,0,1102,"محمد 602",1102,"محمد 602","kh602"]
[null,603,1603,"2012-05-13",null,1180,1,0,1103,"محمد 603",1103,"محمد 603","kh603"]
[null,604,1604,"2012-05-14",null,1181,1,0,1104,"محمد 604",1104,"محمد 604","kh604"]
[null,605,1605,"2012-05-15",null,1183,1,0,1105,"محمد 605",1105,"محمد 605","kh605"]
[null,606,1606,"2012-05-16",null,1185,1,0,1106,"محمد 606",1106,"محمد 606","kh606"]
[null,607,1607,"2012-05-17",null,1187,1,0,1107,"محمد 607",1107,"محمد 607","kh607"]
[null,608,1608,"2012-05-18",null,1188,1,0,1108,"محمد 608",1108,"محمد 608","kh608"]
[null,609,1609,"2012-05-19",null,1190,1,0,1109,"محمد 609",1109,"محمد 609","kh609"]
[null,610,1610,"2012-05-20",null,1192,1,0,1110,"محمد 610",1110,"محمد 610","kh610"]
[null,611,1611,"2012-05-21",null,1194,1,0,1111,"محمد 611",1111,"محمد 611","kh611"]
[null,612,1612,"2012-05-22",null,1195,1,0,1112,"محمد 612",1112,"محمد 612","kh612"]
[null,613,1613,"2012-05-23",null,1197,1,0,1113,"محمد 613",1113,"محمد 613","kh613"]
[null,614,1614,"2012-05-24",null,1199,1,0,1114,"محمد 614",1114,"محمد 614","kh614"]
[null,615,1615,"2012-05-25",null,1200,1,0,1115,"محمد 615",1115,"محمد 615","kh615"]
[null,616,1616,"2012-05-26",null,1202,1,0,1116,"محمد 616",1116,"محمد 616","kh616"]
[null,617,1617,"2012-05-27",null,1204,1,0,1117,"محمد 617",1117,"محمد 617","kh617"]
[null,618,1618,"2012-05-28",null,1206,1,0,1118,"محمد 618",1118,"محمد 618","kh618"]
[null,619,1619,"2012-05-29",null,1207,1,0,1119,"محمد 619",1119,"محمد 619","kh619"]
[null,620,1620,"2012-05-30",null,1209,1,0,1120,"محمد 620",1120,"محمد 620","kh620"]
[null,621,1621,"2012-05-31",null,1211,1,0,1121,"محمد 621",1121,"محمد 621","kh621"]
[null,622,1622,"2012-06-01",null,1212,1,0,1122,"محمد 622",1122,"محمد 622","kh622"]
[null,623,1623,"2012-06-02",null,1214,1,0,1123,"محمد 623",1123,"محمد 623","kh623"]
[null,624,1624,"2012-06-03",null,1216,1,0,1124,"محمد 624",1124,"محمد 624","kh624"]
[null,625,1625,"2012-06-04",null,1218,1,0,1125,"محمد 625",1125,"محمد 625","kh625"]
[null,626,1626,"2012-06-05",null,1219,1,0,1126,"محمد 626",1126,"محمد 626","kh626"]
[null,627,1627,"2012-06-06",null,1221,1,0,1127,"محمد 627",1127,"محمد 627","kh627"]
[null,628,1628,"2012-06-07",null,1223,1,0,1128,"محمد 628",1128,"محمد 628","kh628"]
[null,629,1629,"2012-06-08",null,1225,1,0,1129,"محمد 629",1129,"محمد 629","kh629"]
[null,630,1630,"2012-06-09",null,1226,1,0,1130,"محمد 630",1130,"محمد 630","kh630"]
[null,631,1631,"2012-06-10",null,1228,1,0,1131,"محمد 631",1131,"محمد 631","kh631"]
[null,632,1632,"2012-06-11",null,1230,1,0,1132,"محمد 632",1132,"محمد 632","kh632"]
[null,633,1633,"2012-06-12",null,1231,1,0,1133,"محمد 633",1133,"محمد 633","kh633"]
[null,634,1634,"2012-06-13",null,1233,1,0,1134,"محمد 634",1134,"محمد 634","kh634"]
[null,635,1635,"2012-06-14",null,1235,1,0,1135,"محمد 635",1135,"محمد 635","kh635"]
[null,636,1636,"2012-06-15",null,1237,1,0,1136,"محمد 636",1136,"محمد 636","kh636"]
[null,637,1637,"2012-06-16",null,1238,1,0,1137,"محمد 637",1137,"محمد 637","kh637"]
[null,638,1638,"2012-06-17",null,1240,1,0,1138,"محمد 638",1138,"محمد 638","kh638"]
[null,639,1639,"2012-06-18",null,1242,1,0,1139,"محمد 639",1139,"محمد 639","kh639"]
[null,640,1640,"2012-06-19",null,1243,1,0,1140,"محمد 640",1140,"محمد 640","kh640"]
[null,641,1641,"2012-06-20",null,1245,1,0,1141,"محمد 641",1141,"محمد 641","kh641"]
[null,642,1642,"2012-06-21",null,1247,1,0,1142,"محمد 642",1142,"محمد 642","kh642"]
[null,643,1643,"2012-06-22",null,1249,1,0,1143,"محمد 643",1143,"محمد 643","kh643"]
[null,644,1644,"2012-06-23",null,1250,1,0,1144,"محمد 644",1144,"محمد 644","kh644"]
[null,645,1645,"2012-06-24",null,1252,1,0,1145,"محمد 645",1145,"محمد 645","kh645"]
[null,646,1646,"2012-06-25",null,1254,1,0,1146,"محمد 646",1146,"محمد 646","kh646"]
[null,647,1647,"2012-06-26",null,1256,1,0,1147,"محمد 647",1147,"محمد 647","kh647"]
[null,648,1648,"2012-06-27",null,1257,1,0,1148,"محمد 648",1148,"محمد 648","kh648"]
[null,649,1649,"2012-06-28",null,1259,1,0,1149,"محمد 649",1149,"محمد 649","kh649"]
[null,650,1650,"2012-05-01",null,1261,1,0,1150,"محمد 650",1150,"محمد 650","kh650"]
[null,651,1651,"2012-05-02",null,1262,1,0,1151,"محمد 651",1151,"محمد 651","kh651"]
[null,652,1652,"2012-05-03",null,1264,1,0,1152,"محمد 652",1152,"محمد 652","kh652"]
[null,653,1653,"2012-05-04",null,1266,1,0,1153,"محمد 653",1153,"محمد 653","kh653"]
[null,654,1654,"2012-05-05",null,1268,1,0,1154,"محمد 654",1154,"محمد 654","kh654"]
[null,655,1655,"2012-05-06",null,1269,1,0,1155,"محمد 655",1155,"محمد 655","kh655"]
[null,656,1656,"2012-05-07",null,1271,1,0,1156,"محمد 656",1156,"محمد 656","kh656"]
[null,657,1657,"2012-05-08",null,1273,1,0,1157,"محمد 657",1157,"محمد 657","kh657"]
[null,658,1658,"2012-05-09",null,1274,1,0,1158,"محمد 658",1158,"محمد 658","kh658"]
[null,659,1659,"2012-05-10",null,1276,1,0,1159,"محمد 659",1159,"محمد 659","kh659"]
[null,660,1660,"2012-05-11",null,1278,1,0,1160,"محمد 660",1160,"محمد 660","kh660"]
[null,661,1661,"2012-05-12",null,1280,1,0,1161,"محمد 661",1161,"محمد 661","kh661"]
[null,662,1662,"2012-05-13",null,1281,1,0,1162,"محمد 662",1162,"محمد 662","kh662"]
[null,663,1663,"2012-05-14",null,1283,1,0,1163,"محمد 663",1163,"محمد 663","kh663"]
[null,664,1664,"2012-05-15",null,1285,1,0,1164,"محمد 664",1164,"محمد 664","kh664"]
[null,665,1665,"2012-05-16",null,1287,1,0,1165,"محمد 665",1165,"محمد 665","kh665"]
[null,666,1666,"2012-05-17",null,1288,1,0,1166,"محمد 666",1166,"محمد 666","kh666"]
[null,667,1667,"2012-05-18",null,1290,1,0,1167,"محمد 667",1167,"محمد 667","kh667"]
[null,668,1668,"2012-05-19",null,1292,1,0,1168,"محمد 668",1168,"محمد 668","kh668"]
[null,669,1669,"2012-05-20",null,1293,1,0,1169,"محمد 669",1169,"محمد 669","kh669"]
[null,670,1670,"2012-05-21",null,1295,1,0,1170,"محمد 670",1170,"محمد 670","kh670"]
[null,671,1671,"2012-05-22",null,1297,1,0,1171,"محمد 671",1171,"محمد 671","kh671"]
[null,672,1672,"2012-05-23",null,1299,1,0,1172,"محمد 672",1172,"محمد 672","kh672"]
[null,673,1673,"2012-05-24",null,1300,1,0,1173,"محمد 673",1173,"محمد 673","kh673"]
[null,674,1674,"2012-05-25",null,1302,1,0,1174,"محمد 674",1174,"محمد 674","kh674"]
[null,675,1675,"2012-05-26",null,1304,1,0,1175,"محمد 675",1175,"محمد 675","kh675"]
[null,676,1676,"2012-05-27",null,1305,1,0,1176,"محمد 676",1176,"محمد 676","kh676"]
[null,677,1677,"2012-05-28",null,1307,1,0,1177,"محمد 677",1177,"محمد 677","kh677"]
[null,678,1678,"2012-05-29",null,1309,1,0,1178,"محمد 678",1178,"محمد 678","kh678"]
[null,679,1679,"2012-05-30",null,1311,1,0,1179,"محمد 679",1179,"محمد 679","kh679"]
[null,680,1680,"2012-05-31",null,1312,1,0,1180,"محمد 680",1180,"محمد 680","kh680"]
[null,681,1681,"2012-06-01",null,1314,1,0,1181,"محمد 681",1181,"محمد 681","kh681"]
[null,682,1682,"2012-06-02",null,1316,1,1,1182,"محمد 682",1182,"محمد 682","kh682"]
[null,683,1683,"2012-06-03",null,1318,1,1,1183,"محمد 683",1183,"محمد 683","kh683"]
[null,684,1684,"2012-06-04",null,1319,1,1,1184,"محمد 684",1184,"محمد 684","kh684"]
[null,685,1685,"2012-06-05",null,1321,1,1,1185,"محمد 685",1185,"محمد 685","kh685"]
[null,686,1686,"2012-06-06",null,1323,1,1,1186,"محمد 686",1186,"محمد 686","kh686"]
[null,687,1687,"2012-06-07",null,1324,1,1,1187,"محمد 687",1187,"محمد 687","kh687"]
[null,688,1688,"2012-06-08",null,1326,1,1,1188,"محمد 688",1188,"محمد 688","kh688"]
[null,689,1689,"2012-06-09",null,1328,1,1,1189,"محمد 689",1189,"محمد 689","kh689"]
[null,690,1690,"2012-06-10",null,1330,1,1,1190,"محمد 690",1190,"محمد 690","kh690"]
[null,691,1691,"2012-06-11",null,1331,1,1,1191,"محمد 691",1191,"محمد 691","kh691"]
[null,692,1692,"2012-06-12",null,1333,1,1,1192,"محمد 692",1192,"محمد 692","kh692"]
[null,693,1693,"2012-06-13",null,1335,1,1,1193,"محمد 693",1193,"محمد 693","kh693"]
[null,694,1694,"2012-06-14",null,1336,1,1,1194,"محمد 694",1194,"محمد 694","kh694"]
[null,695,1695,"2012-06-15",null,1338,1,1,1195,"محمد 695",1195,"محمد 695","kh695"]
[null,696,1696,"2012-06-16",null,1340,1,1,1196,"محمد 696",1196,"محمد 696","kh696"]
[null,697,1697,"2012-06-17",null,1342,1,1,1197,"محمد 697",1197,"محمد 697","kh697"]
[null,698,1698,"2012-06-18",null,1343,1,1,1198,"محمد 698",1198,"محمد 698","kh698"]
[null,699,1699,"2012-06-19",null,1345,1,1,1199,"محمد 699",1199,"محمد 699","kh699"]
[null,700,1700,"2012-06-20",null,1347,1,1,1200,"محمد 700",1200,"محمد 700","kh700"]
[null,701,1701,"2012-06-21",null,1349,1,1,1201,"محمد 701",1201,"محمد 701","kh701"]
[null,702,1702,"2012-06-22",null,1350,1,1,1202,"محمد 702",1202,"محمد 702","kh702"]
[null,703,1703,"2012-06-23",null,1352,1,1,1203,"محمد 703",1203,"محمد 703","kh703"]
[null,704,1704,"2012-06-24",null,1354,1,1,1204,"محمد 704",1204,"محمد 704","kh704"]
[null,705,1705,"2012-06-25",null,1355,1,1,1205,"محمد 705",1205,"محمد 705","kh705"]
[null,706,1706,"2012-06-26",null,1357,1,1,1206,"محمد 706",1206,"محمد 706","kh706"]
[null,707,1707,"2012-06-27",null,1359,1,1,1207,"محمد 707",1207,"محمد 707","kh707"]
[null,708,1708,"2012-06-28",null,1361,1,1,1208,"محمد 708",1208,"محمد 708","kh708"]
[null,709,1709,"2012-05-01",null,1362,1,1,1209,"محمد 709",1209,"محمد 709","kh709"]
[null,710,1710,"2012-05-02",null,1364,1,1,1210,"محمد 710",1210,"محمد 710","kh710"]
[null,711,1711,"2012-05-03",null,1366,1,1,1211,"محمد 711",1211,"محمد 711","kh711"]
[null,712,1712,"2012-05-04",null,1367,1,1,1212,"محمد 712",1212,"محمد 712","kh712"]
[null,713,1713,"2012-05-05",null,1369,1,1,1213,"محمد 713",1213,"محمد 713","kh713"]
[null,714,1714,"2012-05-06",null,1371,1,1,1214,"محمد 714",1214,"محمد 714","kh714"]
[null,715,1715,"2012-05-07",null,1373,1,1,1215,"محمد 715",1215,"محمد 715","kh715"]
[null,716,1716,"2012-05-08",null,1374,1,1,1216,"محمد 716",1216,"محمد 716","kh716"]
[null,717,1717,"2012-05-09",null,1376,1,1,1217,"محمد 717",1217,"محمد 717","kh717"]
[null,718,1718,"2012-05-10",null,1378,1,1,1218,"محمد 718",1218,"محمد 718","kh718"]
[null,719,1719,"2012-05-11",null,1380,1,1,1219,"محمد 719",1219,"محمد 719","kh719"]
[null,720,1720,"2012-05-12",null,1381,1,1,1220,"محمد 720",1220,"محمد 720","kh720"]
[null,721,1721,"2012-05-13",null,1383,1,1,1221,"محمد 721",1221,"محمد 721","kh721"]
[null,722,1722,"2012-05-14",null,1385,1,1,1222,"محمد 722",1222,"محمد 722","kh722"]
[null,723,1723,"2012-05-15",null,1386,1,1,1223,"محمد 723",1223,"محمد 723","kh723"]
[null,724,1724,"2012-05-16",null,1388,1,1,1224,"محمد 724",1224,"محمد 724","kh724"]
[null,725,1725,"2012-05-17",null,1390,1,1,1225,"محمد 725",1225,"محمد 725","kh725"]
[null,726,1726,"2012-05-18",null,1392,1,1,1226,"محمد 726",1226,"محمد 726","kh726"]
[null,727,1727,"2012-05-19",null,1393,1,1,1227,"محمد 727",1227,"محمد 727","kh727"]
[null,728,1728,"2012-05-20",null,1395,1,1,1228,"محمد 728",1228,"محمد 728","kh728"]
[null,729,1729,"2012-05-21",null,1397,1,1,1229,"محمد 729",1229,"محمد 729","kh729"]
[null,730,1730,"2012-05-22",null,1398,1,1,1230,"محمد 730",1230,"محمد 730","kh730"]
[null,731,1731,"2012-05-23",null,1400,1,1,1231,"محمد 731",1231,"محمد 731","kh731"]
[null,732,1732,"2012-05-24",null,1402,1,1,1232,"محمد 732",1232,"محمد 732","kh732"]
[null,733,1733,"2012-05-25",null,1404,1,1,1233,"محمد 733",1233,"محمد 733","kh733"]
[null,734,1734,"2012-05-26",null,1405,1,1,1234,"محمد 734",1234,"محمد 734","kh734"]
[null,735,1735,"2012-05-27",null,1407,1,1,1235,"محمد 735",1235,"محمد 735","kh735"]
[null,736,1736,"2012-05-28",null,1409,1,1,1236,"محمد 736",1236,"محمد 736","kh736"]
[null,737,1737,"2012-05-29",null,1411,1,1,1237,"محمد 737",1237,"محمد 737","kh737"]
[null,738,1738,"2012-05-30",null,1412,1,1,1238,"محمد 738",1238,"محمد 738","kh738"]
[null,739,1739,"2012-05-31",null,1414,1,1,1239,"محمد 739",1239,"محمد 739","kh739"]
[null,740,1740,"2012-06-01",null,1416,1,1,1240,"محمد 740",1240,"محمد 740","kh740"]
[null,741,1741,"2012-06-02",null,1417,1,1,1241,"محمد 741",1241,"محمد 741","kh741"]
[null,742,1742,"2012-06-03",null,1419,1,1,1242,"محمد 742",1242,"محمد 742","kh742"]
[null,743,1743,"2012-06-04",null,1421,1,1,1243,"محمد 743",1243,"محمد 743","kh743"]
[null,744,1744,"2012-06-05",null,1423,1,1,1244,"محمد 744",1244,"محمد 744","kh744"]
[null,745,1745,"2012-06-06",null,1424,1,1,1245,"محمد 745",1245,"محمد 745","kh745"]
[null,746,1746,"2012-06-07",null,1426,1,1,1246,"محمد 746",1246,"محمد 746","kh746"]
[null,747,1747,"2012-06-08",null,1428,1,1,1247,"محمد 747",1247,"محمد 747","kh747"]
[null,748,1748,"2012-06-09",null,1429,1,1,1248,"محمد 748",1248,"محمد 748","kh748"]
[null,749,1749,"2012-06-10",null,1431,1,1,1249,"محمد 749",1249,"محمد 749","kh749"]
[null,750,1750,"2012-06-11",null,1433,1,1,1250,"محمد 750",1250,"محمد 750","kh750"]
[null,751,1751,"2012-06-12",null,1435,1,1,1251,"محمد 751",1251,"محمد 751","kh751"]
[null,752,1752,"2012-06-13",null,1436,1,1,1252,"محمد 752",1252,"محمد 752","kh752"]
[null,753,1753,"2012-06-14",null,1438,1,1,1253,"محمد 753",1253,"محمد 753","kh753"]
[null,754,1754,"2012-06-15",null,1440,1,1,1254,"محمد 754",1254,"محمد 754","kh754"]
[null,755,1755,"2012-06-16",null,1442,1,1,1255,"محمد 755",1255,"محمد 755","kh755"]
[null,756,1756,"2012-06-17",null,1443,1,1,1256,"محمد 756",1256,"محمد 756","kh756"]
[null,757,1757,"2012-06-18",null,1445,1,1,1257,"محمد 757",1257,"محمد 757","kh757"]
[null,758,1758,"2012-06-19",null,1447,1,1,1258,"محمد 758",1258,"محمد 758","kh758"]
[null,759,1759,"2012-06-20",null,1448,1,1,1259,"محمد 759",1259,"محمد 759","kh759"]
[null,760,1760,"2012-06-21",null,1450,1,1,1260,"محمد 760",1260,"محمد 760","kh760"]
[null,761,1761,"2012-06-22",null,1452,1,1,1261,"محمد 761",1261,"محمد 761","kh761"]
[null,762,1762,"2012-06-23",null,1454,1,1,1262,"محمد 762",1262,"محمد 762","kh762"]
[null,763,1763,"2012-06-24",null,1455,1,1,1263,"محمد 763",1263,"محمد 763","kh763"]
[null,764,1764,"2012-06-25",null,1457,1,1,1264,"محمد 764",1264,"محمد 764","kh764"]
[null,765,1765,"2012-06-26",null,1459,1,1,1265,"محمد 765",1265,"محمد 765","kh765"]
[null,766,1766,"2012-06-27",null,1460,1,1,1266,"محمد 766",1266,"محمد 766","kh766"]
[null,767,1767,"2012-06-28",null,1462,1,1,1267,"محمد 767",1267,"محمد 767","kh767"]
[null,768,1768,"2012-05-01",null,1464,1,1,1268,"محمد 768",1268,"محمد 768","kh768"]
[null,769,1769,"2012-05-02",null,1466,1,1,1269,"محمد 769",1269,"محمد 769","kh769"]
[null,770,1770,"2012-05-03",null,1467,1,1,1270,"محمد 770",1270,"محمد 770","kh770"]
[null,771,1771,"2012-05-04",null,1469,1,1,1271,"محمد 771",1271,"محمد 771","kh771"]
[null,772,1772,"2012-05-05",null,1471,1,1,1272,"محمد 772",1272,"محمد 772","kh772"]
[null,773,1773,"2012-05-06",null,1473,1,1,1273,"محمد 773",1273,"محمد 773","kh773"]
[null,774,1774,"2012-05-07",null,1474,1,1,1274,"محمد 774",1274,"محمد 774","kh774"]
[null,775,1775,"2012-05-08",null,1476,1,1,1275,"محمد 775",1275,"محمد 775","kh775"]
[null,776,1776,"2012-05-09",null,1478,1,1,1276,"محمد 776",1276,"محمد 776","kh776"]
[null,777,1777,"2012-05-10",null,1479,1,1,1277,"محمد 777",1277,"محمد 777","kh777"]
[null,778,1778,"2012-05-11",null,1481,1,1,1278,"محمد 778",1278,"محمد 778","kh778"]
[null,779,1779,"2012-05-12",null,1483,1,1,1279,"محمد 779",1279,"محمد 779","kh779"]
[null,780,1780,"2012-05-13",null,1485,1,1,1280,"محمد 780",1280,"محمد 780","kh780"]
[null,781,1781,"2012-05-14",null,1486,1,1,1281,"محمد 781",1281,"محمد 781","kh781"]
[null,782,1782,"2012-05-15",null,1488,1,1,1282,"محمد 782",1282,"محمد 782","kh782"]
[null,783,1783,"2012-05-16",null,1490,1,1,1283,"محمد 783",1283,"محمد 783","kh783"]
[null,784,1784,"2012-05-17",null,1491,1,1,1284,"محمد 784",1284,"محمد 784","kh784"]
[null,785,1785,"2012-05-18",null,1493,1,1,1285,"محمد 785",1285,"محمد 785","kh785"]
[null,786,1786,"2012-05-19",null,1495,1,1,1286,"محمد 786",1286,"محمد 786","kh786"]
[null,787,1787,"2012-05-20",null,1497,1,1,1287,"محمد 787",1287,"محمد 787","kh787"]
[null,788,1788,"2012-05-21",null,1498,1,1,1288,"محمد 788",1288,"محمد 788","kh788"]
[null,789,1789,"2012-05-22",null,1500,1,1,1289,"محمد 789",1289,"محمد 789","kh789"]
[null,790,1790,"2012-05-23",null,1502,1,1,1290,"محمد 790",1290,"محمد 790","kh790"]
[null,791,1791,"2012-05-24",null,1504,1,1,1291,"محمد 791",1291,"محمد 791","kh791"]
[null,792,1792,"2012-05-25",null,1505,1,1,1292,"محمد 792",1292,"محمد 792","kh792"]
[null,793,1793,"2012-05-26",null,1507,1,1,1293,"محمد 793",1293,"محمد 793","kh793"]
[null,794,1794,"2012-05-27",null,1509,1,1,1294,"محمد 794",1294,"محمد 794","kh794"]
[null,795,1795,"2012-05-28",null,1510,1,1,1295,"محمد 795",1295,"محمد 795","kh795"]
[null,796,1796,"2012-05-29",null,1512,1,1,1296,"محمد 796",1296,"محمد 796","kh796"]
[null,797,1797,"2012-05-30",null,1514,1,1,1297,"محمد 797",1297,"محمد 797","kh797"]
[null,798,1798,"2012-05-31",null,1516,1,1,1298,"محمد 798",1298,"محمد 798","kh798"]
[null,799,1799,"2012-06-01",null,1517,1,1,1299,"محمد 799",1299,"محمد 799","kh799"]
[null,800,1800,"2012-06-02",null,1519,1,1,1300,"محمد 800",1300,"محمد 800","kh800"]
[null,801,1801,"2012-06-03",null,1521,1,1,1301,"محمد 801",1301,"محمد 801","kh801"]
[null,802,1802,"2012-06-04",null,1522,1,1,1302,"محمد 802",1302,"محمد 802","kh802"]
[null,803,1803,"2012-06-05",null,1524,1,1,1303,"محمد 803",1303,"محمد 803","kh803"]
[null,804,1804,"2012-06-06",null,1526,1,1,1304,"محمد 804",1304,"محمد 804","kh804"]
[null,805,1805,"2012-06-07",null,1528,1,1,1305,"محمد 805",1305,"محمد 805","kh805"]
[null,806,1806,"2012-06-08",null,1529,1,1,1306,"محمد 806",1306,"محمد 806","kh806"]
[null,807,1807,"2012-06-09",null,1531,1,1,1307,"محمد 807",1307,"محمد 807","kh807"]
[null,808,1808,"2012-06-10",null,1533,1,1,1308,"محمد 808",1308,"محمد 808","kh808"]
[null,809,1809,"2012-06-11",null,1535,1,1,1309,"محمد 809",1309,"محمد 809","kh809"]
[null,810,1810,"2012-06-12",null,1536,1,1,1310,"محمد 810",1310,"محمد 810","kh810"]
[null,811,1811,"2012-06-13",null,1538,1,1,1311,"محمد 811",1311,"محمد 811","kh811"]
[null,812,1812,"2012-06-14",null,1540,1,1,1312,"محمد 812",1312,"محمد 812","kh812"]
[null,813,1813,"2012-06-15",null,1541,1,1,1313,"محمد 813",1313,"محمد 813","kh813"]
[null,814,1814,"2012-06-16",null,1543,1,1,1314,"محمد 814",1314,"محمد 814","kh814"]
[null,815,1815,"2012-06-17",null,1545,1,1,1315,"محمد 815",1315,"محمد 815","kh815"]
[null,816,1816,"2012-06-18",null,1547,1,1,1316,"محمد 816",1316,"محمد 816","kh816"]
[null,817,1817,"2012-06-19",null,1548,1,1,1317,"محمد 817",1317,"محمد 817","kh817"]
[null,818,1818,"2012-06-20",null,1550,1,1,1318,"محمد 818",1318,"محمد 818","kh818"]
[null,819,1819,"2012-06-21",null,1552,1,1,1319,"محمد 819",1319,"محمد 819","kh819"]
[null,820,1820,"2012-06-22",null,1553,1,1,1320,"محمد 820",1320,"محمد 820","kh820"]
[null,821,1821,"2012-06-23",null,1555,1,1,1321,"محمد 821",1321,"محمد 821","kh821"]
[null,822,1822,"2012-06-24",null,1557,1,1,1322,"محمد 822",1322,"محمد 822","kh822"]
[null,823,1823,"2012-06-25",null,1559,1,1,1323,"محمد 823",1323,"محمد 823","kh823"]
[null,824,1824,"2012-06-26",null,1560,1,1,1324,"محمد 824",1324,"محمد 824","kh824"]
[null,825,1825,"2012-06-27",null,1562,1,1,1325,"محمد 825",1325,"محمد 825","kh825"]
[null,826,1826,"2012-06-28",null,1564,1,1,1326,"محمد 826",1326,"محمد 826","kh826"]
[null,827,1827,"2012-05-01",null,1566,1,1,1327,"محمد 827",1327,"محمد 827","kh827"]
[null,828,1828,"2012-05-02",null,1567,1,1,1328,"محمد 828",1328,"محمد 828","kh828"]
[null,829,1829,"2012-05-03",null,1569,1,1,1329,"محمد 829",1329,"محمد 829","kh829"]
[null,830,1830,"2012-05-04",null,1571,1,1,1330,"محمد 830",1330,"محمد 830","kh830"]
[null,831,1831,"2012-05-05",null,1572,1,1,1331,"محمد 831",1331,"محمد 831","kh831"]
[null,832,1832,"2012-05-06",null,1574,1,1,1332,"محمد 832",1332,"محمد 832","kh832"]
[null,833,1833,"2012-05-07",null,1576,1,1,1333,"محمد 833",1333,"محمد 833","kh833"]
[null,834,1834,"2012-05-08",null,1578,1,1,1334,"محمد 834",1334,"محمد 834","kh834"]
[null,835,1835,"2012-05-09",null,1579,1,1,1335,"محمد 835",1335,"محمد 835","kh835"]
[null,836,1836,"2012-05-10",null,1581,1,1,1336,"محمد 836",1336,"محمد 836","kh836"]
[null,837,1837,"2012-05-11",null,1583,1,1,1337,"محمد 837",1337,"محمد 837","kh837"]
[null,838,1838,"2012-05-12",null,1584,1,1,1338,"محمد 838",1338,"محمد 838","kh838"]
[null,839,1839,"2012-05-13",null,1586,1,1,1339,"محمد 839",1339,"محمد 839","kh839"]
[null,840,1840,"2012-05-14",null,1588,1,1,1340,"محمد 840",1340,"محمد 840","kh840"]
[null,841,1841,"2012-05-15",null,1590,1,1,1341,"محمد 841",1341,"محمد 841","kh841"]
[null,842,1842,"2012-05-16",null,1591,1,1,1342,"محمد 842",1342,"محمد 842","kh842"]
[null,843,1843,"2012-05-17",null,1593,1,1,1343,"محمد 843",1343,"محمد 843","kh843"]
[null,844,1844,"2012-05-18",null,1595,1,1,1344,"محمد 844",1344,"محمد 844","kh844"]
[null,845,1845,"2012-05-19",null,1597,1,1,1345,"محمد 845",1345,"محمد 845","kh845"]
[null,846,1846,"2012-05-20",null,1598,1,1,1346,"محمد 846",1346,"محمد 846","kh846"]
[null,847,1847,"2012-05-21",null,1600,1,1,1347,"محمد 847",1347,"محمد 847","kh847"]
[null,848,1848,"2012-05-22",null,1602,1,1,1348,"محمد 848",1348,"محمد 848","kh848"]
[null,849,1849,"2012-05-23",null,1603,1,1,1349,"محمد 849",1349,"محمد 849","kh849"]
[null,850,1850,"2012-05-24",null,1605,1,1,1350,"محمد 850",1350,"محمد 850","kh850"]
[null,851,1851,"2012-05-25",null,1607,1,1,1351,"محمد 851",1351,"محمد 851","kh851"]
[null,852,1852,"2012-05-26",null,1609,1,1,1352,"محمد 852",1352,"محمد 852","kh852"]
[null,853,1853,"2012-05-27",null,1610,1,1,1353,"محمد 853",1353,"محمد 853","kh853"]
[null,854,1854,"2012-05-28",null,1612,1,1,1354,"محمد 854",1354,"محمد 854","kh854"]
[null,855,1855,"2012-05-29",null,1614,1,1,1355,"محمد 855",1355,"محمد 855","kh855"]
[null,856,1856,"2012-05-30",null,1615,1,1,1356,"محمد 856",1356,"محمد 856","kh856"]
[null,857,1857,"2012-05-31",null,1617,1,1,1357,"محمد 857",1357,"محمد 857","kh857"]
[null,858,1858,"2012-06-01",null,1619,1,1,1358,"محمد 858",1358,"محمد 858","kh858"]
[null,859,1859,"2012-06-02",null,1621,1,1,1359,"محمد 859",1359,"محمد 859","kh859"]
[null,860,1860,"2012-06-03",null,1622,1,1,1360,"محمد 860",1360,"محمد 860","kh860"]
[null,861,1861,"2012-06-04",null,1624,1,1,1361,"محمد 861",1361,"محمد 861","kh861"]
[null,862,1862,"2012-06-05",null,1626,1,1,1362,"محمد 862",1362,"محمد 862","kh862"]
[null,863,1863,"2012-06-06",null,1628,1,1,1363,"محمد 863",1363,"محمد 863","kh863"]
[null,864,1864,"2012-06-07",null,1629,1,1,1364,"محمد 864",1364,"محمد 864","kh864"]
[null,865,1865,"2012-06-08",null,1631,1,1,1365,"محمد 865",1365,"محمد 865","kh865"]
[null,866,1866,"2012-06-09",null,1633,1,1,1366,"محمد 866",1366,"محمد 866","kh866"]
[null,867,1867,"2012-06-10",null,1634,1,1,1367,"محمد 867",1367,"محمد 867","kh867"]
[null,868,1868,"2012-06-11",null,1636,1,2,1368,"محمد 868",1368,"محمد 868","kh868"]
[null,869,1869,"2012-06-12",null,1638,1,2,1369,"محمد 869",1369,"محمد 869","kh869"]
[null,870,1870,"2012-06-13",null,1640,1,2,1370,"محمد 870",1370,"محمد 870","kh870"]
[null,871,1871,"2012-06-14",null,1641,1,2,1371,"محمد 871",1371,"محمد 871","kh871"]
[null,872,1872,"2012-06-15",null,1643,1,2,1372,"محمد 872",1372,"محمد 872","kh872"]
[null,873,1873,"2012-06-16",null,1645,1,2,1373,"محمد 873",1373,"محمد 873","kh873"]
[null,874,1874,"2012-06-17",null,1646,1,2,1374,"محمد 874",1374,"محمد 874","kh874"]
[null,875,1875,"2012-06-18",null,1648,1,2,1375,"محمد 875",1375,"محمد 875","kh875"]
[null,876,1876,"2012-06-19",null,1650,1,2,1376,"محمد 876",1376,"محمد 876","kh876"]
[null,877,1877,"2012-06-20",null,1652,1,2,1377,"محمد 877",1377,"محمد 877","kh877"]
[null,878,1878,"2012-06-21",null,1653,1,2,1378,"محمد 878",1378,"محمد 878","kh878"]
[null,879,1879,"2012-06-22",null,1655,1,2,1379,"محمد 879",1379,"محمد 879","kh879"]
[null,880,1880,"2012-06-23",null,1657,1,2,1380,"محمد 880",1380,"محمد 880","kh880"]
[null,881,1881,"2012-06-24",null,1659,1,2,1381,"محمد 881",1381,"محمد 881","kh881"]
[null,882,1882,"2012-06-25",null,1660,1,2,1382,"محمد 882",1382,"محمد 882","kh882"]
[null,883,1883,"2012-06-26",null,1662,1,2,1383,"محمد 883",1383,"محمد 883","kh883"]
[null,884,1884,"2012-06-27",null,1664,1,2,1384,"محمد 884",1384,"محمد 884","kh884"]
[null,885,1885,"2012-06-28",null,1665,1,2,1385,"محمد 885",1385,"محمد 885","kh885"]
[null,886,1886,"2012-05-01",null,1667,1,2,1386,"محمد 886",1386,"محمد 886","kh886"]
[null,887,1887,"2012-05-02",null,1669,1,2,1387,"محمد 887",1387,"محمد 887","kh887"]
[null,888,1888,"2012-05-03",null,1671,1,2,1388,"محمد 888",1388,"محمد 888","kh888"]
[null,889,1889,"2012-05-04",null,1672,1,2,1389,"محمد 889",1389,"محمد 889","kh889"]
[null,890,1890,"2012-05-05",null,1674,1,2,1390,"محمد 890",1390,"محمد 890","kh890"]
[null,891,1891,"2012-05-06",null,1676,1,2,1391,"محمد 891",1391,"محمد 891","kh891"]
[null,892,1892,"2012-05-07",null,1677,1,2,1392,"محمد 892",1392,"محمد 892","kh892"]
[null,893,1893,"2012-05-08",null,1679,1,2,1393,"محمد 893",1393,"محمد 893","kh893"]
[null,894,1894,"2012-05-09",null,1681,1,2,1394,"محمد 894",1394,"محمد 894","kh894"]
[null,895,1895,"2012-05-10",null,1683,1,2,1395,"محمد 895",1395,"محمد 895","kh895"]
[null,896,1896,"2012-05-11",null,1684,1,2,1396,"محمد 896",1396,"محمد 896","kh896"]
[null,897,1897,"2012-05-12",null,1686,1,2,1397,"محمد 897",1397,"محمد 897","kh897"]
[null,898,1898,"2012-05-13",null,1688,1,2,1398,"محمد 898",1398,"محمد 898","kh898"]
[null,899,1899,"2012-05-14",null,1690,1,2,1399,"محمد 899",1399,"محمد 899","kh899"]
[null,900,1900,"2012-05-15",null,1691,1,2,1400,"محمد 900",1400,"محمد 900","kh900"]
[null,901,1901,"2012-05-16",null,1693,1,2,1401,"محمد 901",1401,"محمد 901","kh901"]
[null,902,1902,"2012-05-17",null,1695,1,2,1402,"محمد 902",1402,"محمد 902","kh902"]
[null,903,1903,"2012-05-18",null,1696,1,2,1403,"محمد 903",1403,"محمد 903","kh903"]
[null,904,1904,"2012-05-19",null,1698,1,2,1404,"محمد 904",1404,"محمد 904","kh904"]
[null,905,1905,"2012-05-20",null,1700,1,2,1405,"محمد 905",1405,"محمد 905","kh905"]
[null,906,1906,"2012-05-21",null,1702,1,2,1406,"محمد 906",1406,"محمد 906","kh906"]
[null,907,1907,"2012-05-22",null,1703,1,2,1407,"محمد 907",1407,"محمد 907","kh907"]
[null,908,1908,"2012-05-23",null,1705,1,2,1408,"محمد 908",1408,"محمد 908","kh908"]
[null,909,1909,"2012-05-24",null,1707,1,2,1409,"محمد 909",1409,"محمد 909","kh909"]
[null,910,1910,"2012-05-25",null,1708,1,2,1410,"محمد 910",1410,"محمد 910","kh910"]
[null,911,1911,"2012-05-26",null,1710,1,2,1411,"محمد 911",1411,"محمد 911","kh911"]
[null,912,1912,"2012-05-27",null,1712,1,2,1412,"محمد 912",1412,"محمد 912","kh912"]
[null,913,1913,"2012-05-28",null,1714,1,2,1413,"محمد 913",1413,"محمد 913","kh913"]
[null,914,1914,"2012-05-29",null,1715,1,2,1414,"محمد 914",1414,"محمد 914","kh914"]
[null,915,1915,"2012-05-30",null,1717,1,2,1415,"محمد 915",1415,"محمد 915","kh915"]
[null,916,1916,"2012-05-31",null,1719,1,2,1416,"محمد 916",1416,"محمد 916","kh916"]
[null,917,1917,"2012-06-01",null,1721,1,2,1417,"محمد 917",1417,"محمد 917","kh917"]
[null,918,1918,"2012-06-02",null,1722,1,2,1418,"محمد 918",1418,"محمد 918","kh918"]
[null,919,1919,"2012-06-03",null,1724,1,2,1419,"محمد 919",1419,"محمد 919","kh919"]
[null,920,1920,"2012-06-04",null,1726,1,2,1420,"محمد 920",1420,"محمد 920","kh920"]
[null,921,1921,"2012-06-05",null,1727,1,2,1421,"محمد 921",1421,"محمد 921","kh921"]
[null,922,1922,"2012-06-06",null,1729,1,2,1422,"محمد 922",1422,"محمد 922","kh922"]
[null,923,1923,"2012-06-07",null,1731,1,2,1423,"محمد 923",1423,"محمد 923","kh923"]
[null,924,1924,"2012-06-08",null,1733,1,2,1424,"محمد 924",1424,"محمد 924","kh924"]
[null,925,1925,"2012-06-09",null,1734,1,2,1425,"محمد 925",1425,"محمد 925","kh925"]
[null,926,1926,"2012-06-10",null,1736,1,2,1426,"محمد 926",1426,"محمد 926","kh926"]
[null,927,1927,"2012-06-11",null,1738,1,2,1427,"محمد 927",1427,"محمد 927","kh927"]
[null,928,1928,"2012-06-12",null,1739,1,2,1428,"محمد 928",1428,"محمد 928","kh928"]
[null,929,1929,"2012-06-13",null,1741,1,2,1429,"محمد 929",1429,"محمد 929","kh929"]
[null,930,1930,"2012-06-14",null,1743,1,2,1430,"محمد 930",1430,"محمد 930","kh930"]
[null,931,1931,"2012-06-15",null,1745,1,2,1431,"محمد 931",1431,"محمد 931","kh931"]
[null,932,1932,"2012-06-16",null,1746,1,2,1432,"محمد 932",1432,"محمد 932","kh932"]
[null,933,1933,"2012-06-17",null,1748,1,2,1433,"محمد 933",1433,"محمد 933","kh933"]
[null,934,1934,"2012-06-18",null,1750,1,2,1434,"محمد 934",1434,"محمد 934","kh934"]
[null,935,1935,"2012-06-19",null,1752,1,2,1435,"محمد 935",1435,"محمد 935","kh935"]
[null,936,1936,"2012-06-20",null,1753,1,2,1436,"محمد 936",1436,"محمد 936","kh936"]
[null,937,1937,"2012-06-21",null,1755,1,2,1437,"محمد 937",1437,"محمد 937","kh937"]
[null,938,1938,"2012-06-22",null,1757,1,2,1438,"محمد 938",1438,"محمد 938","kh938"]
[null,939,1939,"2012-06-23",null,1758,1,2,1439,"محمد 939",1439,"محمد 939","kh939"]
[null,940,1940,"2012-06-24",null,1760,1,2,1440,"محمد 940",1440,"محمد 940","kh940"]
[null,941,1941,"2012-06-25",null,1762,1,2,1441,"محمد 941",1441,"محمد 941","kh941"]
[null,942,1942,"2012-06-26",null,1764,1,2,1442,"محمد 942",1442,"محمد 942","kh942"]
[null,943,1943,"2012-06-27",null,1765,1,2,1443,"محمد 943",1443,"محمد 943","kh943"]
[null,944,1944,"2012-06-28",null,1767,1,2,1444,"محمد 944",1444,"محمد 944","kh944"]
[null,945,1945,"2012-05-01",null,1769,1,2,1445,"محمد 945",1445,"محمد 945","kh945"]
[null,946,1946,"2012-05-02",null,1770,1,2,1446,"محمد 946",1446,"محمد 946","kh946"]
[null,947,1947,"2012-05-03",null,1772,1,2,1447,"محمد 947",1447,"محمد 947","kh947"]
[null,948,1948,"2012-05-04",null,1774,1,2,1448,"محمد 948",1448,"محمد 948","kh948"]
[null,949,1949,"2012-05-05",null,1776,1,2,1449,"محمد 949",1449,"محمد 949","kh949"]
[null,950,1950,"2012-05-06",null,1777,1,2,1450,"محمد 950",1450,"محمد 950","kh950"]
[null,951,1951,"2012-05-07",null,1779,1,2,1451,"محمد 951",1451,"محمد 951","kh951"]
[null,952,1952,"2012-05-08",null,1781,1,2,1452,"محمد 952",1452,"محمد 952","kh952"]
[null,953,1953,"2012-05-09",null,1783,1,2,1453,"محمد 953",1453,"محمد 953","kh953"]
[null,954,1954,"2012-05-10",null,1784,1,2,1454,"محمد 954",1454,"محمد 954","kh954"]
[null,955,1955,"2012-05-11",null,1786,1,2,1455,"محمد 955",1455,"محمد 955","kh955"]
[null,956,1956,"2012-05-12",null,1788,1,2,1456,"محمد 956",1456,"محمد 956","kh956"]
[null,957,1957,"2012-05-13",null,1789,1,2,1457,"محمد 957",1457,"محمد 957","kh957"]
[null,958,1958,"2012-05-14",null,1791,1,2,1458,"محمد 958",1458,"محمد 958","kh958"]
[null,959,1959,"2012-05-15",null,1793,1,2,1459,"محمد 959",1459,"محمد 959","kh959"]
[null,960,1960,"2012-05-16",null,1795,1,2,1460,"محمد 960",1460,"محمد 960","kh960"]
[null,961,1961,"2012-05-17",null,1796,1,2,1461,"محمد 961",1461,"محمد 961","kh961"]
[null,962,1962,"2012-05-18",null,1798,1,2,1462,"محمد 962",1462,"محمد 962","kh962"]
[null,963,1963,"2012-05-19",null,1800,1,2,1463,"محمد 963",1463,"محمد 963","kh963"]
[null,964,1964,"2012-05-20",null,1801,1,2,1464,"محمد 964",1464,"محمد 964","kh964"]
[null,965,1965,"2012-05-21",null,1803,1,2,1465,"محمد 965",1465,"محمد 965","kh965"]
[null,966,1966,"2012-05-22",null,1805,1,2,1466,"محمد 966",1466,"محمد 966","kh966"]
[null,967,1967,"2012-05-23",null,1807,1,2,1467,"محمد 967",1467,"محمد 967","kh967"]
[null,968,1968,"2012-05-24",null,1808,1,2,1468,"محمد 968",1468,"محمد 968","kh968"]
[null,969,1969,"2012-05-25",null,1810,1,2,1469,"محمد 969",1469,"محمد 969","kh969"]
[null,970,1970,"2012-05-26",null,1812,1,2,1470,"محمد 970",1470,"محمد 970","kh970"]
[null,971,1971,"2012-05-27",null,1814,1,2,1471,"محمد 971",1471,"محمد 971","kh971"]
[null,972,1972,"2012-05-28",null,1815,1,2,1472,"محمد 972",1472,"محمد 972","kh972"]
[null,973,1973,"2012-05-29",null,1817,1,2,1473,"محمد 973",1473,"محمد 973","kh973"]
[null,974,1974,"2012-05-30",null,1819,1,2,1474,"محمد 974",1474,"محمد 974","kh974"]
[null,975,1975,"2012-05-31",null,1820,1,2,1475,"محمد 975",1475,"محمد 975","kh975"]
[null,976,1976,"2012-06-01",null,1822,1,2,1476,"محمد 976",1476,"محمد 976","kh976"]
[null,977,1977,"2012-06-02",null,1824,1,2,1477,"محمد 977",1477,"محمد 977","kh977"]
[null,978,1978,"2012-06-03",null,1826,1,2,1478,"محمد 978",1478,"محمد 978","kh978"]
[null,979,1979,"2012-06-04",null,1827,1,2,1479,"محمد 979",1479,"محمد 979","kh979"]
[null,980,1980,"2012-06-05",null,1829,1,2,1480,"محمد 980",1480,"محمد 980","kh980"]
[null,981,1981,"2012-06-06",null,1831,1,2,1481,"محمد 981",1481,"محمد 981","kh981"]
[null,982,1982,"2012-06-07",null,1832,1,2,1482,"محمد 982",1482,"محمد 982","kh982"]
[null,983,1983,"2012-06-08",null,1834,1,2,1483,"محمد 983",1483,"محمد 983","kh983"]
[null,984,1984,"2012-06-09",null,1836,1,2,1484,"محمد 984",1484,"محمد 984","kh984"]
[null,985,1985,"2012-06-10",null,1838,1,2,1485,"محمد 985",1485,"محمد 985","kh985"]
[null,986,1986,"2012-06-11",null,1839,1,2,1486,"محمد 986",1486,"محمد 986","kh986"]
[null,987,1987,"2012-06-12",null,1841,1,2,1487,"محمد 987",1487,"محمد 987","kh987"]
[null,988,1988,"2012-06-13",null,1843,1,2,1488,"محمد 988",1488,"محمد 988","kh988"]
[null,989,1989,"2012-06-14",null,1845,1,2,1489,"محمد 989",1489,"محمد 989","kh989"]
[null,990,1990,"2012-06-15",null,1846,1,2,1490,"محمد 990",1490,"محمد 990","kh990"]
[null,991,1991,"2012-06-16",null,1848,1,2,1491,"محمد 991",1491,"محمد 991","kh991"]
[null,992,1992,"2012-06-17",null,1850,1,2,1492,"محمد 992",1492,"محمد 992","kh992"]
[null,993,1993,"2012-06-18",null,1851,1,2,1493,"محمد 993",1493,"محمد 993","kh993"]
[null,994,1994,"2012-06-19",null,1853,1,2,1494,"محمد 994",1494,"محمد 994","kh994"]
[null,995,1995,"2012-06-20",null,1855,1,2,1495,"محمد 995",1495,"محمد 995","kh995"]
[null,996,1996,"2012-06-21",null,1857,1,2,1496,"محمد 996",1496,"محمد 996","kh996"]
[null,997,1997,"2012-06-22",null,1858,1,2,1497,"محمد 997",1497,"محمد 997","kh997"]
[null,998,1998,"2012-06-23",null,1860,1,2,1498,"محمد 998",1498,"محمد 998","kh998"]
[null,999,1999,"2012-06-24",null,1862,1,2,1499,"محمد 999",1499,"محمد 999","kh999"]
[null,1000,2000,"2012-06-25",null,1863,1,2,1500,"محمد 1000",1500,"محمد 1000","kh1000"]
[null,1001,2001,"2012-06-26",null,1865,1,2,1501,"محمد 1001",1501,"محمد 1001","kh1001"]
[null,1002,2002,"2012-06-27",null,1867,1,2,1502,"محمد 1002",1502,"محمد 1002","kh1002"]
[null,1003,2003,"2012-06-28",null,1869,1,2,1503,"محمد 1003",1503,"محمد 1003","kh1003"]
[null,1004,2004,"2012-05-01",null,1870,1,2,1504,"محمد 1004",1504,"محمد 1004","kh1004"]
[null,1005,2005,"2012-05-02",null,1872,1,2,1505,"محمد 1005",1505,"محمد 1005","kh1005"]
[null,1006,2006,"2012-05-03",null,1874,1,2,1506,"محمد 1006",1506,"محمد 1006","kh1006"]
[null,1007,2007,"2012-05-04",null,1876,1,2,1507,"محمد 1007",1507,"محمد 1007","kh1007"]
[null,1008,2008,"2012-05-05",null,1877,1,2,1508,"محمد 1008",1508,"محمد 1008","kh1008"]
[null,1009,2009,"2012-05-06",null,1879,1,2,1509,"محمد 1009",1509,"محمد 1009","kh1009"]
[null,1010,2010,"2012-05-07",null,1881,1,2,1510,"محمد 1010",1510,"محمد 1010","kh1010"]
[null,1011,2011,"2012-05-08",null,1882,1,2,1511,"محمد 1011",1511,"محمد 1011","kh1011"]
[null,1012,2012,"2012-05-09",null,1884,1,2,1512,"محمد 1012",1512,"محمد 1012","kh1012"]
[null,1013,2013,"2012-05-10",null,1886,1,2,1513,"محمد 1013",1513,"محمد 1013","kh1013"]
[null,1014,2014,"2012-05-11",null,1888,1,2,1514,"محمد 1014",1514,"محمد 1014","kh1014"]
[null,1015,2015,"2012-05-12",null,1889,1,2,1515,"محمد 1015",1515,"محمد 1015","kh1015"]
[null,1016,2016,"2012-05-13",null,1891,1,2,1516,"محمد 1016",1516,"محمد 1016","kh1016"]
[null,1017,2017,"2012-05-14",null,1893,1,2,1517,"محمد 1017",1517,"محمد 1017","kh1017"]
[null,1018,2018,"2012-05-15",null,1894,1,2,1518,"محمد 1018",1518,"محمد 1018","kh1018"]
[null,1019,2019,"2012-05-16",null,1896,1,2,1519,"محمد 1019",1519,"محمد 1019","kh1019"]
[null,1020,2020,"2012-05-17",null,1898,1,2,1520,"محمد 1020",1520,"محمد 1020","kh1020"]
[null,1021,2021,"2012-05-18",null,1900,1,2,1521,"محمد 1021",1521,"محمد 1021","kh1021"]
[null,1022,2022,"2012-05-19",null,1901,1,2,1522,"محمد 1022",1522,"محمد 1022","kh1022"]
[null,1023,2023,"2012-05-20",null,1903,1,2,1523,"محمد 1023",1523,"محمد 1023","kh1023"]
[null,1024,2024,"2012-05-21",null,1905,1,2,1524,"محمد 1024",1524,"محمد 1024","kh1024"]
[null,1025,2025,"2012-05-22",null,1907,1,2,1525,"محمد 1025",1525,"محمد 1025","kh1025"]
[null,1026,2026,"2012-05-23",null,1908,1,2,1526,"محمد 1026",1526,"محمد 1026","kh1026"]
[null,1027,2027,"2012-05-24",null,1910,1,2,1527,"محمد 1027",1527,"محمد 1027","kh1027"]
[null,1028,2028,"2012-05-25",null,1912,1,2,1528,"محمد 1028",1528,"محمد 1028","kh1028"]
[null,1029,2029,"2012-05-26",null,1913,1,2,1529,"محمد 1029",1529,"محمد 1029","kh1029"]
[null,1030,2030,"2012-05-27",null,1915,1,2,1530,"محمد 1030",1530,"محمد 1030","kh1030"]
[null,1031,2031,"2012-05-28",null,1917,1,2,1531,"محمد 1031",1531,"محمد 1031","kh1031"]
[null,1032,2032,"2012-05-29",null,1919,1,2,1532,"محمد 1032",1532,"محمد 1032","kh1032"]
[null,1033,2033,"2012-05-30",null,1920,1,2,1533,"محمد 1033",1533,"محمد 1033","kh1033"]
[null,1034,2034,"2012-05-31",null,1922,1,2,1534,"محمد 1034",1534,"محمد 1034","kh1034"]
[null,1035,2035,"2012-06-01",null,1924,1,2,1535,"محمد 1035",1535,"محمد 1035","kh1035"]
[null,1036,2036,"2012-06-02",null,1926,1,2,1536,"محمد 1036",1536,"محمد 1036","kh1036"]
[null,1037,2037,"2012-06-03",null,1927,1,2,1537,"محمد 1037",1537,"محمد 1037","kh1037"]
[null,1038,2038,"2012-06-04",null,1929,1,2,1538,"محمد 1038",1538,"محمد 1038","kh1038"]
[null,1039,2039,"2012-06-05",null,1931,1,2,1539,"محمد 1039",1539,"محمد 1039","kh1039"]
[null,1040,2040,"2012-06-06",null,1932,1,2,1540,"محمد 1040",1540,"محمد 1040","kh1040"]
[null,1041,2041,"2012-06-07",null,1934,1,2,1541,"محمد 1041",1541,"محمد 1041","kh1041"]
[null,1042,2042,"2012-06-08",null,1936,1,2,1542,"محمد 1042",1542,"محمد 1042","kh1042"]
[null,1043,2043,"2012-06-09",null,1938,1,2,1543,"محمد 1043",1543,"محمد 1043","kh1043"]
[null,1044,2044,"2012-06-10",null,1939,1,2,1544,"محمد 1044",1544,"محمد 1044","kh1044"]
[null,1045,2045,"2012-06-11",null,1941,1,2,1545,"محمد 1045",1545,"محمد 1045","kh1045"]
[null,1046,2046,"2012-06-12",null,1943,1,2,1546,"محمد 1046",1546,"محمد 1046","kh1046"]
[null,1047,2047,"2012-06-13",null,1944,1,2,1547,"محمد 1047",1547,"محمد 1047","kh1047"]
[null,1048,2048,"2012-06-14",null,1946,1,2,1548,"محمد 1048",1548,"محمد 1048","kh1048"]
[null,1049,2049,"2012-06-15",null,1948,1,2,1549,"محمد 1049",1549,"محمد 1049","kh1049"]
[null,1050,2050,"2012-06-16",null,1950,1,2,1550,"محمد 1050",1550,"محمد 1050","kh1050"]
[null,1051,2051,"2012-06-17",null,1951,1,2,1551,"محمد 1051",1551,"محمد 1051","kh1051"]
[null,1052,2052,"2012-06-18",null,1953,1,2,1552,"محمد 1052",1552,"محمد 1052","kh1052"]
[null,1053,2053,"2012-06-19",null,1955,1,2,1553,"محمد 1053",1553,"محمد 1053","kh1053"]
[null,1054,2054,"2012-06-20",null,1957,1,3,1554,"محمد 1054",1554,"محمد 1054","kh1054"]
[null,1055,2055,"2012-06-21",null,1958,1,3,1555,"محمد 1055",1555,"محمد 1055","kh1055"]
[null,1056,2056,"2012-06-22",null,1960,1,3,1556,"محمد 1056",1556,"محمد 1056","kh1056"]
[null,1057,2057,"2012-06-23",null,1962,1,3,1557,"محمد 1057",1557,"محمد 1057","kh1057"]
[null,1058,2058,"2012-06-24",null,1963,1,3,1558,"محمد 1058",1558,"محمد 1058","kh1058"]
[null,1059,2059,"2012-06-25",null,1965,1,3,1559,"محمد 1059",1559,"محمد 1059","kh1059"]
[null,1060,2060,"2012-06-26",null,1967,1,3,1560,"محمد 1060",1560,"محمد 1060","kh1060"]
[null,1061,2061,"2012-06-27",null,1969,1,3,1561,"محمد 1061",1561,"محمد 1061","kh1061"]
[null,1062,2062,"2012-06-28",null,1970,1,3,1562,"محمد 1062",1562,"محمد 1062","kh1062"]

{"sheet":"Histoire","index":2,"n_rows":98,"n_cols":4,"rows_kept":98,"cut":false,"hidden":false,"merged":[]}
[]
[]
[]
[]
[]
["N°","NOM","DATE","TOTAL"]
[{"$f":"IFERROR(IF(B7<>\"\",ROW(),\"\")-6,\"\")","v":1},"19 mohamed amine",{"$f":"#REF!","v":{"$error":"#REF!"}},{"$f":"#REF!","v":{"$error":"#REF!"}}]
[{"$f":"IFERROR(IF(B8<>\"\",ROW(),\"\")-6,\"\")","v":2},"15 salimani mm",{"$f":"#REF!","v":{"$error":"#REF!"}},{"$f":"#REF!","v":{"$error":"#REF!"}}]
[""]
[""]
[""]
[""]
[""]
[""]
[""]
[""]
[""]
[""]
[""]
[""]
[""]
[""]
[""]
[""]
[""]
[""]
[""]
[""]
[""]
[""]
[""]
[""]
[""]
[""]
[""]
[""]
[""]
[""]
[""]
[""]
[""]
[""]
[""]
[""]
[""]
[""]
[""]
[""]
[""]
[""]
[""]
[""]
[""]
[""]
[""]
[""]
[""]
[""]
[""]
[""]
[""]
[""]
[""]
[""]
[""]
[""]
[""]
[""]
[""]
[""]
[""]
[{"$f":"IFERROR(IF(B72<>\"\",ROW(),\"\")-6,\"\")","v":""}]
[""]
[""]
[""]
[""]
[""]
[""]
[""]
[""]
[""]
[""]
[""]
[""]
[""]
[""]
[""]
[""]
[""]
[""]
[""]
[""]
[""]
[""]
[""]
[""]
[""]
[""]

{"sheet":"data-ip","index":3,"n_rows":19,"n_cols":5,"rows_kept":19,"cut":false,"hidden":false,"merged":[[4,1,4,2],[15,2,15,3],[17,2,17,3],[16,2,16,3],[18,2,18,3]]}
[]
[]
[null,null,null,null,"TEL "]
[]
[]
[]
["N°","DISGANTION","QUA","PRIX","TOTAL"]
["01","djezzy",1,1000,1000]
["02","djezzy",1,1000,1000]
["03","djezzy",1,1000,1000]
["04"]
["05"]
["06"]
["07"]
["08"]
[null,null,"CREANCE",null,980]
[null,null,"TOTAL GENERAL",null,{"$f":"SUM(E8:E16)","v":3980}]
[null,null,"VERSSEMENT",null,"En attente"]
[null,null,"RESTE",null,{"$f":"IFERROR(E17-E18,\"\")","v":""}]

{"sheet":"DATA1","index":4,"n_rows":963,"n_cols":35,"rows_kept":963,"cut":false,"hidden":false,"merged":[]}
[null,"mohamed",null,null,null,null,null,{"$f":"SUMIFS(C4:C33,B4:B33,\"<=\"&F1,B4:B33,\">=\"&F1)","v":0},null,null,{"$f":"SUM(C:C)","v":0},{"$f":"M1-K1","v":0},{"$f":"SUM(D:D)","v":0},null,null,null,null,null,null,null,null,null,null,null,null,null,null,null,null,null,null,{"$f":"IFERROR(LOOKUP(2,1/((AI:AI=$AZ$1)*(B:B<>\"\")),(B:B)),\"\")","v":"التاريخ"},{"$f":"IFERROR(LOOKUP(2,1/((AI:AI=$AZ$1)*(C:C<>\"\")),(C:C)),\"\")","v":"تسديد جديد"}]
["رقم","التاريخ","تسديد جديد","اجمالي الفاتورة","الباقي","الصنف","الكمية","القيمة","الصنف2","الكمية2","القيمة2","الصنف3","الكمية3","القيمة3","الصنف4","الكمية4","القيمة4","الصنف5 ","الكمية5","القيمة5","الصنف6","الكمية6","القيمة6","الصنف7","الكمية7","القيمة7","الصنف8","الكمية8","القيمة8","ساعة",null,"تاريخ","دفع"]
[]
[]
[]
[null,null,null,null,null,null,null,null,null,null,null,null,null,null,null,null,null,null,null,null,null,null,null,null,null,null,null,null,null,null,null,null,null,null,0]
[]
[]
[]
[]
[{"$f":"IFERROR(IF(B11<>\"\",ROW(),\"\")-2,\"\")","v":""}]
[""]
[""]
[""]
[""]
[""]
[""]
[""]
[""]
[""]
[""]
[""]
[""]
[""]
[""]
[""]
[""]
[""]
[""]
[""]
[""]
[""]
[""]
[""]
[""]
[""]
[""]
[""]
[""]
[""]
[""]
[""]
[""]
[""]
[""]
[""]
[""]
[""]
[""]
[""]
[""]
[""]
[""]
[""]
[""]
[""]
[""]
[""]
[""]
[""]
[""]
[""]
[""]
[""]
[""]
[""]
[""]
[""]
[""]
[""]
[""]
[""]
[{"$f":"IFERROR(IF(B73<>\"\",ROW(),\"\")-2,\"\")","v":""}]
[""]
[""]
[""]
[""]
[""]
[""]
[""]
[""]
[""]
[""]
[""]
[""]
[""]
[""]
[""]
[""]
[""]
[""]
[""]
[""]
[""]
[""]
[""]
[""]
[""]
[""]
[""]
[""]
[""]
[""]
[""]
[""]
[""]
[""]
[""]
[""]
[""]
[""]
[""]
[""]
[""]
[""]
[""]
[""]
[""]
[""]
[""]
[""]
[""]
[""]
[""]
[""]
[""]
[""]
[""]
[""]
[""]
[""]
[""]
[""]
[""]
[""]
[""]
[{"$f":"IFERROR(IF(B137<>\"\",ROW(),\"\")-2,\"\")","v":""}]
[""]
[""]
[""]
[""]
[""]
[""]
[""]
[""]
[""]
[""]
[""]
[""]
[""]
[""]
[""]
[""]
[""]
[""]
[""]
[""]
[""]
[""]
[""]
[""]
[""]
[""]
[""]
[""]
[""]
[""]
[""]
[""]
[""]
[""]
[""]
[""]
[""]
[""]
[""]
[""]
[""]
[""]
[""]
[""]
[""]
[""]
[""]
[""]
[""]
[""]
[""]
[""]
[""]
[""]
[""]
[""]
[""]
[""]
[""]
[""]
[""]
[""]
[""]
[{"$f":"IFERROR(IF(B201<>\"\",ROW(),\"\")-2,\"\")","v":""}]
[""]
[""]
[""]
[""]
[""]
[""]
[""]
[""]
[""]
[""]
[""]
[""]
[""]
[""]
[""]
[""]
[""]
[""]
[""]
[""]
[""]
[""]
[""]
[""]
[""]
[""]
[""]
[""]
[""]
[""]
[""]
[""]
[""]
[""]
[""]
[""]
[""]
[""]
[""]
[""]
[""]
[""]
[""]
[""]
[""]
[""]
[""]
[""]
[""]
[""]
[""]
[""]
[""]
[""]
[""]
[""]
[""]
[""]
[""]
[""]
[""]
[""]
[""]
[{"$f":"IFERROR(IF(B265<>\"\",ROW(),\"\")-2,\"\")","v":""}]
[""]
[""]
[""]
[""]
[""]
[""]
[""]
[""]
[""]
[""]
[""]
[""]
[""]
[""]
[""]
[""]
[""]
[""]
[""]
[""]
[""]
[""]
[""]
[""]
[""]
[""]
[""]
[""]
[""]
[""]
[""]
[""]
[""]
[""]
[""]
[""]
[""]
[""]
[""]
[""]
[""]
[""]
[""]
[""]
[""]
[""]
[""]
[""]
[""]
[""]
[""]
[""]
[""]
[""]
[""]
[""]
[""]
[""]
[""]
[""]
[""]
[""]
[""]
[{"$f":"IFERROR(IF(B329<>\"\",ROW(),\"\")-2,\"\")","v":""}]
[""]
[""]
[""]
[""]
[""]
[""]
[""]
[""]
[""]
[""]
[""]
[""]
[""]
[""]
[""]
[""]
[""]
[""]
[""]
[""]
[""]
[""]
[""]
[""]
[""]
[""]
[""]
[""]
[""]
[""]
[""]
[""]
[""]
[""]
[""]
[""]
[""]
[""]
[""]
[""]
[""]
[""]
[""]
[""]
[""]
[""]
[""]
[""]
[""]
[""]
[""]
[""]
[""]
[""]
[""]
[""]
[""]
[""]
[""]
[""]
[""]
[""]
[""]
[{"$f":"IFERROR(IF(B393<>\"\",ROW(),\"\")-2,\"\")","v":""}]
[""]
[""]
[""]
[""]
[""]
[""]
[""]
[""]
[""]
[""]
[""]
[""]
[""]
[""]
[""]
[""]
[""]
[""]
[""]
[""]
[""]
[""]
[""]
[""]
[""]
[""]
[""]
[""]
[""]
[""]
[""]
[""]
[""]
[""]
[""]
[""]
[""]
[""]
[""]
[""]
[""]
[""]
[""]
[""]
[""]
[""]
[""]
[""]
[""]
[""]
[""]
[""]
[""]
[""]
[""]
[""]
[""]
[""]
[""]
[""]
[""]
[""]
[""]
[{"$f":"IFERROR(IF(B457<>\"\",ROW(),\"\")-2,\"\")","v":""}]
[""]
[""]
[""]
[""]
[""]
[""]
[""]
[""]
[""]
[""]
[""]
[""]
[""]
[""]
[""]
[""]
[""]
[""]
[""]
[""]
[""]
[""]
[""]
[""]
[""]
[""]
[""]
[""]
[""]
[""]
[""]
[""]
[""]
[""]
[""]
[""]
[""]
[""]
[""]
[""]
[""]
[""]
[""]
[""]
[""]
[""]
[""]
[""]
[""]
[""]
[""]
[""]
[""]
[""]
[""]
[""]
[""]
[""]
[""]
[""]
[""]
[""]
[""]
[{"$f":"IFERROR(IF(B521<>\"\",ROW(),\"\")-2,\"\")","v":""}]
[""]
[""]
[""]
[""]
[""]
[""]
[""]
[""]
[""]
[""]
[""]
[""]
[""]
[""]
[""]
[""]
[""]
[""]
[""]
[""]
[""]
[""]
[""]
[""]
[""]
[""]
[""]
[""]
[""]
[""]
[""]
[""]
[""]
[""]
[""]
[""]
[""]
[""]
[""]
[""]
[""]
[""]
[""]
[""]
[""]
[""]
[""]
[""]
[""]
[""]
[""]
[""]
[""]
[""]
[""]
[""]
[""]
[""]
[""]
[""]
[""]
[""]
[""]
[{"$f":"IFERROR(IF(B585<>\"\",ROW(),\"\")-2,\"\")","v":""}]
[""]
[""]
[""]
[""]
[""]
[""]
[""]
[""]
[""]
[""]
[""]
[""]
[""]
[""]
[""]
[""]
[""]
[""]
[""]
[""]
[""]
[""]
[""]
[""]
[""]
[""]
[""]
[""]
[""]
[""]
[""]
[""]
[""]
[""]
[""]
[""]
[""]
[""]
[""]
[""]
[""]
[""]
[""]
[""]
[""]
[""]
[""]
[""]
[""]
[""]
[""]
[""]
[""]
[""]
[""]
[""]
[""]
[""]
[""]
[""]
[""]
[""]
[""]
[{"$f":"IFERROR(IF(B649<>\"\",ROW(),\"\")-2,\"\")","v":""}]
[""]
[""]
[""]
[""]
[""]
[""]
[""]
[""]
[""]
[""]
[""]
[""]
[""]
[""]
[""]
[""]
[""]
[""]
[""]
[""]
[""]
[""]
[""]
[""]
[""]
[""]
[""]
[""]
[""]
[""]
[""]
[""]
[""]
[""]
[""]
[""]
[""]
[""]
[""]
[""]
[""]
[""]
[""]
[""]
[""]
[""]
[""]
[""]
[""]
[""]
[""]
[""]
[""]
[""]
[""]
[""]
[""]
[""]
[""]
[""]
[""]
[""]
[""]
[{"$f":"IFERROR(IF(B713<>\"\",ROW(),\"\")-2,\"\")","v":""}]
[""]
[""]
[""]
[""]
[""]
[""]
[""]
[""]
[""]
[""]
[""]
[""]
[""]
[""]
[""]
[""]
[""]
[""]
[""]
[""]
[""]
[""]
[""]
[""]
[""]
[""]
[""]
[""]
[""]
[""]
[""]
[""]
[""]
[""]
[""]
[""]
[""]
[""]
[""]
[""]
[""]
[""]
[""]
[""]
[""]
[""]
[""]
[""]
[""]
[""]
[""]
[""]
[""]
[""]
[""]
[""]
[""]
[""]
[""]
[""]
[""]
[""]
[""]
[{"$f":"IFERROR(IF(B777<>\"\",ROW(),\"\")-2,\"\")","v":""}]
[""]
[""]
[""]
[""]
[""]
[""]
[""]
[""]
[""]
[""]
[""]
[""]
[""]
[""]
[""]
[""]
[""]
[""]
[""]
[""]
[""]
[""]
[""]
[""]
[""]
[""]
[""]
[""]
[""]
[""]
[""]
[""]
[""]
[""]
[""]
[""]
[""]
[""]
[""]
[""]
[""]
[""]
[""]
[""]
[""]
[""]
[""]
[""]
[""]
[""]
[""]
[""]
[""]
[""]
[""]
[""]
[""]
[""]
[""]
[""]
[""]
[""]
[""]
[{"$f":"IFERROR(IF(B841<>\"\",ROW(),\"\")-2,\"\")","v":""}]
[""]
[""]
[""]
[""]
[""]
[""]
[""]
[""]
[""]
[""]
[""]
[""]
[""]
[""]
[""]
[""]
[""]
[""]
[""]
[""]
[""]
[""]
[""]
[""]
[""]
[""]
[""]
[""]
[""]
[""]
[""]
[""]
[""]
[""]
[""]
[""]
[""]
[""]
[""]
[""]
[""]
[""]
[""]
[""]
[""]
[""]
[""]
[""]
[""]
[""]
[""]
[""]
[""]
[""]
[""]
[""]
[""]
[""]
[""]
[""]
[""]
[""]
[""]
[{"$f":"IFERROR(IF(B905<>\"\",ROW(),\"\")-2,\"\")","v":""}]
[""]
[""]
[""]
[""]
[""]
[""]
[""]
[""]
[""]
[""]
[""]
[""]
[""]
[""]
[""]
[""]
[""]
[""]
[""]
[""]
[""]
[""]
[""]
[""]
[""]
[""]
[""]
[""]
[""]
[""]
[""]
[""]
[""]
[""]
[""]
[""]
[""]
[""]
[""]
[""]
[""]
[""]
[""]
[""]
[""]
[""]
[""]
[""]
[""]
[""]
[""]
[""]
[""]
[""]
[""]
[""]
[""]
[""]

{"sheet":"mohamed 01","index":5,"n_rows":963,"n_cols":35,"rows_kept":963,"cut":false,"hidden":false,"merged":[]}
[2,"mohamed",null,null,null,"En attente",null,{"$f":"SUMIFS(C4:C33,B4:B33,\"<=\"&F1,B4:B33,\">=\"&F1)","v":0},null,null,{"$f":"SUM(C:C)","v":8000},{"$f":"M1-K1","v":18740},{"$f":"SUM(D:D)","v":26740},null,null,null,null,null,null,null,null,null,null,null,null,null,null,null,null,null,null,{"$f":"IFERROR(LOOKUP(2,1/((AI:AI=$AZ$1)*(B:B<>\"\")),(B:B)),\"\")","v":"2020-05-22"},{"$f":"IFERROR(LOOKUP(2,1/((AI:AI=$AZ$1)*(C:C<>\"\")),(C:C)),\"\")","v":"En attente"}]
["رقم","التاريخ","تسديد جديد","اجمالي الفاتورة","الباقي","الصنف","الكمية","القيمة","الصنف2","الكمية2","القيمة2","الصنف3","الكمية3","القيمة3","الصنف4","الكمية4","القيمة4","الصنف5 ","الكمية5","القيمة5","الصنف6","الكمية6","القيمة6","الصنف7","الكمية7","القيمة7","الصنف8","الكمية8","القيمة8","ساعة",null,"تاريخ","دفع"]
[{"$f":"ROW()-2","v":1},"2020-05-22","En attente",2970,2970,"djezzy",1,1000,"mobillis",1,980,"ooredoo",1,990]
[2,"2020-05-22","En attente",1000,3970,"djezzy",1,1000,"mobillis",null,0,"ooredoo",null,0,null,null,null,null,null,null,null,null,null,null,null,null,null,null,null,null,null,"22/05/2020","En attente"]
[3,"2020-05-22",2000,null,1970,null,null,null,null,null,null,null,null,null,null,null,null,null,null,null,null,null,null,null,null,null,null,null,null,null,null,"22/05/2020","En attente"]
[4,"2020-05-22",6000,2970,940,"djezzy",1,1000,"mobillis",1,980,"ooredoo",1,990,null,null,null,null,null,null,null,null,null,null,null,null,null,null,null,null,null,"22/05/2020","En attente",null,0]
[5,"2020-05-22","En attente",2970,1910,"djezzy",1,1000,"mobillis",1,980,"ooredoo",1,990,null,null,null,null,null,null,null,null,null,null,null,null,null,null,null,null,null,"22/05/2020",6000]
[6,"2020-05-22","En attente",2970,4880,"djezzy",1,1000,"mobillis",1,980,"ooredoo",1,990,null,null,null,null,null,null,null,null,null,null,null,null,null,null,null,null,null,"22/05/2020","En attente"]
[7,"2020-05-22","En attente",2970,7850,"djezzy",1,1000,"mobillis",1,980,"ooredoo",1,990,null,null,null,null,null,null,null,null,null,null,null,null,null,null,null,null,null,"22/05/2020","En attente"]
[8,"2020-05-22","En attente",2970,10820,"djezzy",1,1000,"mobillis",1,980,"ooredoo",1,990,null,null,null,null,null,null,null,null,null,null,null,null,null,null,null,null,null,"22/05/2020","En attente"]
[9,"2020-05-22","En attente",2970,13790,"djezzy",1,1000,"mobillis",1,980,"ooredoo",1,990,null,null,null,null,null,null,null,null,null,null,null,null,null,null,null,null,null,"22/05/2020","En attente"]
[10,"2020-05-22","En attente",1980,15770,"djezzy",1,1000,"mobillis",1,980,"ooredoo",null,0,null,null,null,null,null,null,null,null,null,null,null,null,null,null,null,null,null,"22/05/2020","En attente"]
[11,"2020-05-22","En attente",2970,18740,"djezzy",1,1000,"mobillis",1,980,"ooredoo",1,990,null,null,null,null,null,null,null,null,null,null,null,null,null,null,null,null,null,"22/05/2020","En attente"]
[{"$f":"IFERROR(IF(B14<>\"\",ROW(),\"\")-2,\"\")","v":""}]
[""]
[""]
[{"$f":"IFERROR(IF(B17<>\"\",ROW(),\"\")-2,\"\")","v":""}]
[""]
[""]
[""]
[""]
[""]
[""]
[""]
[""]
[""]
[""]
[""]
[""]
[""]
[""]
[""]
[""]
[""]
[""]
[""]
[""]
[""]
[""]
[""]
[""]
[""]
[""]
[""]
[""]
[""]
[""]
[""]
[""]
[""]
[""]
[""]
[""]
[""]
[""]
[""]
[""]
[""]
[""]
[""]
[""]
[""]
[""]
[""]
[""]
[""]
[""]
[""]
[""]
[""]
[""]
[""]
[""]
[""]
[""]
[""]
[""]
[{"$f":"IFERROR(IF(B78<>\"\",ROW(),\"\")-2,\"\")","v":""}]
[""]
[""]
[""]
[""]
[""]
[""]
[""]
[""]
[""]
[""]
[""]
[""]
[""]
[""]
[""]
[""]
[""]
[""]
[""]
[""]
[""]
[""]
[""]
[""]
[""]
[""]
[""]
[""]
[""]
[""]
[""]
[""]
[""]
[""]
[""]
[""]
[""]
[""]
[""]
[""]
[""]
[""]
[""]
[""]
[""]
[""]
[""]
[""]
[""]
[""]
[""]
[""]
[""]
[""]
[""]
[""]
[""]
[""]
[""]
[""]
[""]
[""]
[""]
[{"$f":"IFERROR(IF(B142<>\"\",ROW(),\"\")-2,\"\")","v":""}]
[""]
[""]
[""]
[""]
[""]
[""]
[""]
[""]
[""]
[""]
[""]
[""]
[""]
[""]
[""]
[""]
[""]
[""]
[""]
[""]
[""]
[""]
[""]
[""]
[""]
[""]
[""]
[""]
[""]
[""]
[""]
[""]
[""]
[""]
[""]
[""]
[""]
[""]
[""]
[""]
[""]
[""]
[""]
[""]
[""]
[""]
[""]
[""]
[""]
[""]
[""]
[""]
[""]
[""]
[""]
[""]
[""]
[""]
[""]
[""]
[""]
[""]
[""]
[{"$f":"IFERROR(IF(B206<>\"\",ROW(),\"\")-2,\"\")","v":""}]
[""]
[""]
[""]
[""]
[""]
[""]
[""]
[""]
[""]
[""]
[""]
[""]
[""]
[""]
[""]
[""]
[""]
[""]
[""]
[""]
[""]
[""]
[""]
[""]
[""]
[""]
[""]
[""]
[""]
[""]
[""]
[""]
[""]
[""]
[""]
[""]
[""]
[""]
[""]
[""]
[""]
[""]
[""]
[""]
[""]
[""]
[""]
[""]
[""]
[""]
[""]
[""]
[""]
[""]
[""]
[""]
[""]
[""]
[""]
[""]
[""]
[""]
[""]
[{"$f":"IFERROR(IF(B270<>\"\",ROW(),\"\")-2,\"\")","v":""}]
[""]
[""]
[""]
[""]
[""]
[""]
[""]
[""]
[""]
[""]
[""]
[""]
[""]
[""]
[""]
[""]
[""]
[""]
[""]
[""]
[""]
[""]
[""]
[""]
[""]
[""]
[""]
[""]
[""]
[""]
[""]
[""]
[""]
[""]
[""]
[""]
[""]
[""]
[""]
[""]
[""]
[""]
[""]
[""]
[""]
[""]
[""]
[""]
[""]
[""]
[""]
[""]
[""]
[""]
[""]
[""]
[""]
[""]
[""]
[""]
[""]
[""]
[""]
[{"$f":"IFERROR(IF(B334<>\"\",ROW(),\"\")-2,\"\")","v":""}]
[""]
[""]
[""]
[""]
[""]
[""]
[""]
[""]
[""]
[""]
[""]
[""]
[""]
[""]
[""]
[""]
[""]
[""]
[""]
[""]
[""]
[""]
[""]
[""]
[""]
[""]
[""]
[""]
[""]
[""]
[""]
[""]
[""]
[""]
[""]
[""]
[""]
[""]
[""]
[""]
[""]
[""]
[""]
[""]
[""]
[""]
[""]
[""]
[""]
[""]
[""]
[""]
[""]
[""]
[""]
[""]
[""]
[""]
[""]
[""]
[""]
[""]
[""]
[{"$f":"IFERROR(IF(B398<>\"\",ROW(),\"\")-2,\"\")","v":""}]
[""]
[""]
[""]
[""]
[""]
[""]
[""]
[""]
[""]
[""]
[""]
[""]
[""]
[""]
[""]
[""]
[""]
[""]
[""]
[""]
[""]
[""]
[""]
[""]
[""]
[""]
[""]
[""]
[""]
[""]
[""]
[""]
[""]
[""]
[""]
[""]
[""]
[""]
[""]
[""]
[""]
[""]
[""]
[""]
[""]
[""]
[""]
[""]
[""]
[""]
[""]
[""]
[""]
[""]
[""]
[""]
[""]
[""]
[""]
[""]
[""]
[""]
[""]
[{"$f":"IFERROR(IF(B462<>\"\",ROW(),\"\")-2,\"\")","v":""}]
[""]
[""]
[""]
[""]
[""]
[""]
[""]
[""]
[""]
[""]
[""]
[""]
[""]
[""]
[""]
[""]
[""]
[""]
[""]
[""]
[""]
[""]
[""]
[""]
[""]
[""]
[""]
[""]
[""]
[""]
[""]
[""]
[""]
[""]
[""]
[""]
[""]
[""]
[""]
[""]
[""]
[""]
[""]
[""]
[""]
[""]
[""]
[""]
[""]
[""]
[""]
[""]
[""]
[""]
[""]
[""]
[""]
[""]
[""]
[""]
[""]
[""]
[""]
[{"$f":"IFERROR(IF(B526<>\"\",ROW(),\"\")-2,\"\")","v":""}]
[""]
[""]
[""]
[""]
[""]
[""]
[""]
[""]
[""]
[""]
[""]
[""]
[""]
[""]
[""]
[""]
[""]
[""]
[""]
[""]
[""]
[""]
[""]
[""]
[""]
[""]
[""]
[""]
[""]
[""]
[""]
[""]
[""]
[""]
[""]
[""]
[""]
[""]
[""]
[""]
[""]
[""]
[""]
[""]
[""]
[""]
[""]
[""]
[""]
[""]
[""]
[""]
[""]
[""]
[""]
[""]
[""]
[""]
[""]
[""]
[""]
[""]
[""]
[{"$f":"IFERROR(IF(B590<>\"\",ROW(),\"\")-2,\"\")","v":""}]
[""]
[""]
[""]
[""]
[""]
[""]
[""]
[""]
[""]
[""]
[""]
[""]
[""]
[""]
[""]
[""]
[""]
[""]
[""]
[""]
[""]
[""]
[""]
[""]
[""]
[""]
[""]
[""]
[""]
[""]
[""]
[""]
[""]
[""]
[""]
[""]
[""]
[""]
[""]
[""]
[""]
[""]
[""]
[""]
[""]
[""]
[""]
[""]
[""]
[""]
[""]
[""]
[""]
[""]
[""]
[""]
[""]
[""]
[""]
[""]
[""]
[""]
[""]
[{"$f":"IFERROR(IF(B654<>\"\",ROW(),\"\")-2,\"\")","v":""}]
[""]
[""]
[""]
[""]
[""]
[""]
[""]
[""]
[""]
[""]
[""]
[""]
[""]
[""]
[""]
[""]
[""]
[""]
[""]
[""]
[""]
[""]
[""]
[""]
[""]
[""]
[""]
[""]
[""]
[""]
[""]
[""]
[""]
[""]
[""]
[""]
[""]
[""]
[""]
[""]
[""]
[""]
[""]
[""]
[""]
[""]
[""]
[""]
[""]
[""]
[""]
[""]
[""]
[""]
[""]
[""]
[""]
[""]
[""]
[""]
[""]
[""]
[""]
[{"$f":"IFERROR(IF(B718<>\"\",ROW(),\"\")-2,\"\")","v":""}]
[""]
[""]
[""]
[""]
[""]
[""]
[""]
[""]
[""]
[""]
[""]
[""]
[""]
[""]
[""]
[""]
[""]
[""]
[""]
[""]
[""]
[""]
[""]
[""]
[""]
[""]
[""]
[""]
[""]
[""]
[""]
[""]
[""]
[""]
[""]
[""]
[""]
[""]
[""]
[""]
[""]
[""]
[""]
[""]
[""]
[""]
[""]
[""]
[""]
[""]
[""]
[""]
[""]
[""]
[""]
[""]
[""]
[""]
[""]
[""]
[""]
[""]
[""]
[{"$f":"IFERROR(IF(B782<>\"\",ROW(),\"\")-2,\"\")","v":""}]
[""]
[""]
[""]
[""]
[""]
[""]
[""]
[""]
[""]
[""]
[""]
[""]
[""]
[""]
[""]
[""]
[""]
[""]
[""]
[""]
[""]
[""]
[""]
[""]
[""]
[""]
[""]
[""]
[""]
[""]
[""]
[""]
[""]
[""]
[""]
[""]
[""]
[""]
[""]
[""]
[""]
[""]
[""]
[""]
[""]
[""]
[""]
[""]
[""]
[""]
[""]
[""]
[""]
[""]
[""]
[""]
[""]
[""]
[""]
[""]
[""]
[""]
[""]
[{"$f":"IFERROR(IF(B846<>\"\",ROW(),\"\")-2,\"\")","v":""}]
[""]
[""]
[""]
[""]
[""]
[""]
[""]
[""]
[""]
[""]
[""]
[""]
[""]
[""]
[""]
[""]
[""]
[""]
[""]
[""]
[""]
[""]
[""]
[""]
[""]
[""]
[""]
[""]
[""]
[""]
[""]
[""]
[""]
[""]
[""]
[""]
[""]
[""]
[""]
[""]
[""]
[""]
[""]
[""]
[""]
[""]
[""]
[""]
[""]
[""]
[""]
[""]
[""]
[""]
[""]
[""]
[""]
[""]
[""]
[""]
[""]
[""]
[""]
[{"$f":"IFERROR(IF(B910<>\"\",ROW(),\"\")-2,\"\")","v":""}]
[""]
[""]
[""]
[""]
[""]
[""]
[""]
[""]
[""]
[""]
[""]
[""]
[""]
[""]
[""]
[""]
[""]
[""]
[""]
[""]
[""]
[""]
[""]
[""]
[""]
[""]
[""]
[""]
[""]
[""]
[""]
[""]
[""]
[""]
[""]
[""]
[""]
[""]
[""]
[""]
[""]
[""]
[""]
[""]
[""]
[""]
[""]
[""]
[""]
[""]
[""]
[""]
[""]

{"sheet":"mohamed02","index":6,"n_rows":963,"n_cols":35,"rows_kept":963,"cut":false,"hidden":false,"merged":[]}
[3,"mohamed",null,null,null,"En attente",null,{"$f":"SUMIFS(C4:C33,B4:B33,\"<=\"&F1,B4:B33,\">=\"&F1)","v":0},null,null,{"$f":"SUM(C:C)","v":8000},{"$f":"M1-K1","v":18740},{"$f":"SUM(D:D)","v":26740},null,null,null,null,null,null,null,null,null,null,null,null,null,null,null,null,null,null,{"$f":"IFERROR(LOOKUP(2,1/((AI:AI=$AZ$1)*(B:B<>\"\")),(B:B)),\"\")","v":"2020-05-22"},{"$f":"IFERROR(LOOKUP(2,1/((AI:AI=$AZ$1)*(C:C<>\"\")),(C:C)),\"\")","v":"En attente"}]
["رقم","التاريخ","تسديد جديد","اجمالي الفاتورة","الباقي","الصنف","الكمية","القيمة","الصنف2","الكمية2","القيمة2","الصنف3","الكمية3","القيمة3","الصنف4","الكمية4","القيمة4","الصنف5 ","الكمية5","القيمة5","الصنف6","الكمية6","القيمة6","الصنف7","الكمية7","القيمة7","الصنف8","الكمية8","القيمة8","ساعة",null,"تاريخ","دفع"]
[{"$f":"ROW()-2","v":1},"2020-05-22","En attente",2970,2970,"djezzy",1,1000,"mobillis",1,980,"ooredoo",1,990]
[2,"2020-05-22","En attente",1000,3970,"djezzy",1,1000,"mobillis",null,0,"ooredoo",null,0,null,null,null,null,null,null,null,null,null,null,null,null,null,null,null,null,null,"22/05/2020","En attente"]
[3,"2020-05-22",2000,null,1970,null,null,null,null,null,null,null,null,null,null,null,null,null,null,null,null,null,null,null,null,null,null,null,null,null,null,"22/05/2020","En attente"]
[4,"2020-05-22",6000,2970,940,"djezzy",1,1000,"mobillis",1,980,"ooredoo",1,990,null,null,null,null,null,null,null,null,null,null,null,null,null,null,null,null,null,"22/05/2020","En attente",null,0]
[5,"2020-05-22","En attente",2970,1910,"djezzy",1,1000,"mobillis",1,980,"ooredoo",1,990,null,null,null,null,null,null,null,null,null,null,null,null,null,null,null,null,null,"22/05/2020",6000]
[6,"2020-05-22","En attente",2970,4880,"djezzy",1,1000,"mobillis",1,980,"ooredoo",1,990,null,null,null,null,null,null,null,null,null,null,null,null,null,null,null,null,null,"22/05/2020","En attente"]
[7,"2020-05-22","En attente",2970,7850,"djezzy",1,1000,"mobillis",1,980,"ooredoo",1,990,null,null,null,null,null,null,null,null,null,null,null,null,null,null,null,null,null,"22/05/2020","En attente"]
[8,"2020-05-22","En attente",2970,10820,"djezzy",1,1000,"mobillis",1,980,"ooredoo",1,990,null,null,null,null,null,null,null,null,null,null,null,null,null,null,null,null,null,"22/05/2020","En attente"]
[9,"2020-05-22","En attente",2970,13790,"djezzy",1,1000,"mobillis",1,980,"ooredoo",1,990,null,null,null,null,null,null,null,null,null,null,null,null,null,null,null,null,null,"22/05/2020","En attente"]
[10,"2020-05-22","En attente",1980,15770,"djezzy",1,1000,"mobillis",1,980,"ooredoo",null,0,null,null,null,null,null,null,null,null,null,null,null,null,null,null,null,null,null,"22/05/2020","En attente"]
[11,"2020-05-22","En attente",2970,18740,"djezzy",1,1000,"mobillis",1,980,"ooredoo",1,990,null,null,null,null,null,null,null,null,null,null,null,null,null,null,null,null,null,"22/05/2020","En attente"]
[{"$f":"IFERROR(IF(B14<>\"\",ROW(),\"\")-2,\"\")","v":""}]
[""]
[""]
[{"$f":"IFERROR(IF(B17<>\"\",ROW(),\"\")-2,\"\")","v":""}]
[""]
[""]
[""]
[""]
[""]
[""]
[""]
[""]
[""]
[""]
[""]
[""]
[""]
[""]
[""]
[""]
[""]
[""]
[""]
[""]
[""]
[""]
[""]
[""]
[""]
[""]
[""]
[""]
[""]
[""]
[""]
[""]
[""]
[""]
[""]
[""]
[""]
[""]
[""]
[""]
[""]
[""]
[""]
[""]
[""]
[""]
[""]
[""]
[""]
[""]
[""]
[""]
[""]
[""]
[""]
[""]
[""]
[""]
[""]
[""]
[{"$f":"IFERROR(IF(B78<>\"\",ROW(),\"\")-2,\"\")","v":""}]
[""]
[""]
[""]
[""]
[""]
[""]
[""]
[""]
[""]
[""]
[""]
[""]
[""]
[""]
[""]
[""]
[""]
[""]
[""]
[""]
[""]
[""]
[""]
[""]
[""]
[""]
[""]
[""]
[""]
[""]
[""]
[""]
[""]
[""]
[""]
[""]
[""]
[""]
[""]
[""]
[""]
[""]
[""]
[""]
[""]
[""]
[""]
[""]
[""]
[""]
[""]
[""]
[""]
[""]
[""]
[""]
[""]
[""]
[""]
[""]
[""]
[""]
[""]
[{"$f":"IFERROR(IF(B142<>\"\",ROW(),\"\")-2,\"\")","v":""}]
[""]
[""]
[""]
[""]
[""]
[""]
[""]
[""]
[""]
[""]
[""]
[""]
[""]
[""]
[""]
[""]
[""]
[""]
[""]
[""]
[""]
[""]
[""]
[""]
[""]
[""]
[""]
[""]
[""]
[""]
[""]
[""]
[""]
[""]
[""]
[""]
[""]
[""]
[""]
[""]
[""]
[""]
[""]
[""]
[""]
[""]
[""]
[""]
[""]
[""]
[""]
[""]
[""]
[""]
[""]
[""]
[""]
[""]
[""]
[""]
[""]
[""]
[""]
[{"$f":"IFERROR(IF(B206<>\"\",ROW(),\"\")-2,\"\")","v":""}]
[""]
[""]
[""]
[""]
[""]
[""]
[""]
[""]
[""]
[""]
[""]
[""]
[""]
[""]
[""]
[""]
[""]
[""]
[""]
[""]
[""]
[""]
[""]
[""]
[""]
[""]
[""]
[""]
[""]
[""]
[""]
[""]
[""]
[""]
[""]
[""]
[""]
[""]
[""]
[""]
[""]
[""]
[""]
[""]
[""]
[""]
[""]
[""]
[""]
[""]
[""]
[""]
[""]
[""]
[""]
[""]
[""]
[""]
[""]
[""]
[""]
[""]
[""]
[{"$f":"IFERROR(IF(B270<>\"\",ROW(),\"\")-2,\"\")","v":""}]
[""]
[""]
[""]
[""]
[""]
[""]
[""]
[""]
[""]
[""]
[""]
[""]
[""]
[""]
[""]
[""]
[""]
[""]
[""]
[""]
[""]
[""]
[""]
[""]
[""]
[""]
[""]
[""]
[""]
[""]
[""]
[""]
[""]
[""]
[""]
[""]
[""]
[""]
[""]
[""]
[""]
[""]
[""]
[""]
[""]
[""]
[""]
[""]
[""]
[""]
[""]
[""]
[""]
[""]
[""]
[""]
[""]
[""]
[""]
[""]
[""]
[""]
[""]
[{"$f":"IFERROR(IF(B334<>\"\",ROW(),\"\")-2,\"\")","v":""}]
[""]
[""]
[""]
[""]
[""]
[""]
[""]
[""]
[""]
[""]
[""]
[""]
[""]
[""]
[""]
[""]
[""]
[""]
[""]
[""]
[""]
[""]
[""]
[""]
[""]
[""]
[""]
[""]
[""]
[""]
[""]
[""]
[""]
[""]
[""]
[""]
[""]
[""]
[""]
[""]
[""]
[""]
[""]
[""]
[""]
[""]
[""]
[""]
[""]
[""]
[""]
[""]
[""]
[""]
[""]
[""]
[""]
[""]
[""]
[""]
[""]
[""]
[""]
[{"$f":"IFERROR(IF(B398<>\"\",ROW(),\"\")-2,\"\")","v":""}]
[""]
[""]
[""]
[""]
[""]
[""]
[""]
[""]
[""]
[""]
[""]
[""]
[""]
[""]
[""]
[""]
[""]
[""]
[""]
[""]
[""]
[""]
[""]
[""]
[""]
[""]
[""]
[""]
[""]
[""]
[""]
[""]
[""]
[""]
[""]
[""]
[""]
[""]
[""]
[""]
[""]
[""]
[""]
[""]
[""]
[""]
[""]
[""]
[""]
[""]
[""]
[""]
[""]
[""]
[""]
[""]
[""]
[""]
[""]
[""]
[""]
[""]
[""]
[{"$f":"IFERROR(IF(B462<>\"\",ROW(),\"\")-2,\"\")","v":""}]
[""]
[""]
[""]
[""]
[""]
[""]
[""]
[""]
[""]
[""]
[""]
[""]
[""]
[""]
[""]
[""]
[""]
[""]
[""]
[""]
[""]
[""]
[""]
[""]
[""]
[""]
[""]
[""]
[""]
[""]
[""]
[""]
[""]
[""]
[""]
[""]
[""]
[""]
[""]
[""]
[""]
[""]
[""]
[""]
[""]
[""]
[""]
[""]
[""]
[""]
[""]
[""]
[""]
[""]
[""]
[""]
[""]
[""]
[""]
[""]
[""]
[""]
[""]
[{"$f":"IFERROR(IF(B526<>\"\",ROW(),\"\")-2,\"\")","v":""}]
[""]
[""]
[""]
[""]
[""]
[""]
[""]
[""]
[""]
[""]
[""]
[""]
[""]
[""]
[""]
[""]
[""]
[""]
[""]
[""]
[""]
[""]
[""]
[""]
[""]
[""]
[""]
[""]
[""]
[""]
[""]
[""]
[""]
[""]
[""]
[""]
[""]
[""]
[""]
[""]
[""]
[""]
[""]
[""]
[""]
[""]
[""]
[""]
[""]
[""]
[""]
[""]
[""]
[""]
[""]
[""]
[""]
[""]
[""]
[""]
[""]
[""]
[""]
[{"$f":"IFERROR(IF(B590<>\"\",ROW(),\"\")-2,\"\")","v":""}]
[""]
[""]
[""]
[""]
[""]
[""]
[""]
[""]
[""]
[""]
[""]
[""]
[""]
[""]
[""]
[""]
[""]
[""]
[""]
[""]
[""]
[""]
[""]
[""]
[""]
[""]
[""]
[""]
[""]
[""]
[""]
[""]
[""]
[""]
[""]
[""]
[""]
[""]
[""]
[""]
[""]
[""]
[""]
[""]
[""]
[""]
[""]
[""]
[""]
[""]
[""]
[""]
[""]
[""]
[""]
[""]
[""]
[""]
[""]
[""]
[""]
[""]
[""]
[{"$f":"IFERROR(IF(B654<>\"\",ROW(),\"\")-2,\"\")","v":""}]
[""]
[""]
[""]
[""]
[""]
[""]
[""]
[""]
[""]
[""]
[""]
[""]
[""]
[""]
[""]
[""]
[""]
[""]
[""]
[""]
[""]
[""]
[""]
[""]
[""]
[""]
[""]
[""]
[""]
[""]
[""]
[""]
[""]
[""]
[""]
[""]
[""]
[""]
[""]
[""]
[""]
[""]
[""]
[""]
[""]
[""]
[""]
[""]
[""]
[""]
[""]
[""]
[""]
[""]
[""]
[""]
[""]
[""]
[""]
[""]
[""]
[""]
[""]
[{"$f":"IFERROR(IF(B718<>\"\",ROW(),\"\")-2,\"\")","v":""}]
[""]
[""]
[""]
[""]
[""]
[""]
[""]
[""]
[""]
[""]
[""]
[""]
[""]
[""]
[""]
[""]
[""]
[""]
[""]
[""]
[""]
[""]
[""]
[""]
[""]
[""]
[""]
[""]
[""]
[""]
[""]
[""]
[""]
[""]
[""]
[""]
[""]
[""]
[""]
[""]
[""]
[""]
[""]
[""]
[""]
[""]
[""]
[""]
[""]
[""]
[""]
[""]
[""]
[""]
[""]
[""]
[""]
[""]
[""]
[""]
[""]
[""]
[""]
[{"$f":"IFERROR(IF(B782<>\"\",ROW(),\"\")-2,\"\")","v":""}]
[""]
[""]
[""]
[""]
[""]
[""]
[""]
[""]
[""]
[""]
[""]
[""]
[""]
[""]
[""]
[""]
[""]
[""]
[""]
[""]
[""]
[""]
[""]
[""]
[""]
[""]
[""]
[""]
[""]
[""]
[""]
[""]
[""]
[""]
[""]
[""]
[""]
[""]
[""]
[""]
[""]
[""]
[""]
[""]
[""]
[""]
[""]
[""]
[""]
[""]
[""]
[""]
[""]
[""]
[""]
[""]
[""]
[""]
[""]
[""]
[""]
[""]
[""]
[{"$f":"IFERROR(IF(B846<>\"\",ROW(),\"\")-2,\"\")","v":""}]
[""]
[""]
[""]
[""]
[""]
[""]
[""]
[""]
[""]
[""]
[""]
[""]
[""]
[""]
[""]
[""]
[""]
[""]
[""]
[""]
[""]
[""]
[""]
[""]
[""]
[""]
[""]
[""]
[""]
[""]
[""]
[""]
[""]
[""]
[""]
[""]
[""]
[""]
[""]
[""]
[""]
[""]
[""]
[""]
[""]
[""]
[""]
[""]
[""]
[""]
[""]
[""]
[""]
[""]
[""]
[""]
[""]
[""]
[""]
[""]
[""]
[""]
[""]
[{"$f":"IFERROR(IF(B910<>\"\",ROW(),\"\")-2,\"\")","v":""}]
[""]
[""]
[""]
[""]
[""]
[""]
[""]
[""]
[""]
[""]
[""]
[""]
[""]
[""]
[""]
[""]
[""]
[""]
[""]
[""]
[""]
[""]
[""]
[""]
[""]
[""]
[""]
[""]
[""]
[""]
[""]
[""]
[""]
[""]
[""]
[""]
[""]
[""]
[""]
[""]
[""]
[""]
[""]
[""]
[""]
[""]
[""]
[""]
[""]
[""]
[""]
[""]
[""]

{"sheet":"mohamed03","index":7,"n_rows":963,"n_cols":35,"rows_kept":963,"cut":false,"hidden":false,"merged":[]}
[4,"mohamed",null,null,null,"En attente",null,{"$f":"SUMIFS(C4:C33,B4:B33,\"<=\"&F1,B4:B33,\">=\"&F1)","v":0},null,null,{"$f":"SUM(C:C)","v":8000},{"$f":"M1-K1","v":18740},{"$f":"SUM(D:D)","v":26740},null,null,null,null,null,null,null,null,null,null,null,null,null,null,null,null,null,null,{"$f":"IFERROR(LOOKUP(2,1/((AI:AI=$AZ$1)*(B:B<>\"\")),(B:B)),\"\")","v":"2020-05-22"},{"$f":"IFERROR(LOOKUP(2,1/((AI:AI=$AZ$1)*(C:C<>\"\")),(C:C)),\"\")","v":"En attente"}]
["رقم","التاريخ","تسديد جديد","اجمالي الفاتورة","الباقي","الصنف","الكمية","القيمة","الصنف2","الكمية2","القيمة2","الصنف3","الكمية3","القيمة3","الصنف4","الكمية4","القيمة4","الصنف5 ","الكمية5","القيمة5","الصنف6","الكمية6","القيمة6","الصنف7","الكمية7","القيمة7","الصنف8","الكمية8","القيمة8","ساعة",null,"تاريخ","دفع"]
[{"$f":"ROW()-2","v":1},"2020-05-22","En attente",2970,2970,"djezzy",1,1000,"mobillis",1,980,"ooredoo",1,990]
[2,"2020-05-22","En attente",1000,3970,"djezzy",1,1000,"mobillis",null,0,"ooredoo",null,0,null,null,null,null,null,null,null,null,null,null,null,null,null,null,null,null,null,"22/05/2020","En attente"]
[3,"2020-05-22",2000,null,1970,null,null,null,null,null,null,null,null,null,null,null,null,null,null,null,null,null,null,null,null,null,null,null,null,null,null,"22/05/2020","En attente"]
[4,"2020-05-22",6000,2970,940,"djezzy",1,1000,"mobillis",1,980,"ooredoo",1,990,null,null,null,null,null,null,null,null,null,null,null,null,null,null,null,null,null,"22/05/2020","En attente",null,0]
[5,"2020-05-22","En attente",2970,1910,"djezzy",1,1000,"mobillis",1,980,"ooredoo",1,990,null,null,null,null,null,null,null,null,null,null,null,null,null,null,null,null,null,"22/05/2020",6000]
[6,"2020-05-22","En attente",2970,4880,"djezzy",1,1000,"mobillis",1,980,"ooredoo",1,990,null,null,null,null,null,null,null,null,null,null,null,null,null,null,null,null,null,"22/05/2020","En attente"]
[7,"2020-05-22","En attente",2970,7850,"djezzy",1,1000,"mobillis",1,980,"ooredoo",1,990,null,null,null,null,null,null,null,null,null,null,null,null,null,null,null,null,null,"22/05/2020","En attente"]
[8,"2020-05-22","En attente",2970,10820,"djezzy",1,1000,"mobillis",1,980,"ooredoo",1,990,null,null,null,null,null,null,null,null,null,null,null,null,null,null,null,null,null,"22/05/2020","En attente"]
[9,"2020-05-22","En attente",2970,13790,"djezzy",1,1000,"mobillis",1,980,"ooredoo",1,990,null,null,null,null,null,null,null,null,null,null,null,null,null,null,null,null,null,"22/05/2020","En attente"]
[10,"2020-05-22","En attente",1980,15770,"djezzy",1,1000,"mobillis",1,980,"ooredoo",null,0,null,null,null,null,null,null,null,null,null,null,null,null,null,null,null,null,null,"22/05/2020","En attente"]
[11,"2020-05-22","En attente",2970,18740,"djezzy",1,1000,"mobillis",1,980,"ooredoo",1,990,null,null,null,null,null,null,null,null,null,null,null,null,null,null,null,null,null,"22/05/2020","En attente"]
[{"$f":"IFERROR(IF(B14<>\"\",ROW(),\"\")-2,\"\")","v":""}]
[""]
[""]
[{"$f":"IFERROR(IF(B17<>\"\",ROW(),\"\")-2,\"\")","v":""}]
[""]
[""]
[""]
[""]
[""]
[""]
[""]
[""]
[""]
[""]
[""]
[""]
[""]
[""]
[""]
[""]
[""]
[""]
[""]
[""]
[""]
[""]
[""]
[""]
[""]
[""]
[""]
[""]
[""]
[""]
[""]
[""]
[""]
[""]
[""]
[""]
[""]
[""]
[""]
[""]
[""]
[""]
[""]
[""]
[""]
[""]
[""]
[""]
[""]
[""]
[""]
[""]
[""]
[""]
[""]
[""]
[""]
[""]
[""]
[""]
[{"$f":"IFERROR(IF(B78<>\"\",ROW(),\"\")-2,\"\")","v":""}]
[""]
[""]
[""]
[""]
[""]
[""]
[""]
[""]
[""]
[""]
[""]
[""]
[""]
[""]
[""]
[""]
[""]
[""]
[""]
[""]
[""]
[""]
[""]
[""]
[""]
[""]
[""]
[""]
[""]
[""]
[""]
[""]
[""]
[""]
[""]
[""]
[""]
[""]
[""]
[""]
[""]
[""]
[""]
[""]
[""]
[""]
[""]
[""]
[""]
[""]
[""]
[""]
[""]
[""]
[""]
[""]
[""]
[""]
[""]
[""]
[""]
[""]
[""]
[{"$f":"IFERROR(IF(B142<>\"\",ROW(),\"\")-2,\"\")","v":""}]
[""]
[""]
[""]
[""]
[""]
[""]
[""]
[""]
[""]
[""]
[""]
[""]
[""]
[""]
[""]
[""]
[""]
[""]
[""]
[""]
[""]
[""]
[""]
[""]
[""]
[""]
[""]
[""]
[""]
[""]
[""]
[""]
[""]
[""]
[""]
[""]
[""]
[""]
[""]
[""]
[""]
[""]
[""]
[""]
[""]
[""]
[""]
[""]
[""]
[""]
[""]
[""]
[""]
[""]
[""]
[""]
[""]
[""]
[""]
[""]
[""]
[""]
[""]
[{"$f":"IFERROR(IF(B206<>\"\",ROW(),\"\")-2,\"\")","v":""}]
[""]
[""]
[""]
[""]
[""]
[""]
[""]
[""]
[""]
[""]
[""]
[""]
[""]
[""]
[""]
[""]
[""]
[""]
[""]
[""]
[""]
[""]
[""]
[""]
[""]
[""]
[""]
[""]
[""]
[""]
[""]
[""]
[""]
[""]
[""]
[""]
[""]
[""]
[""]
[""]
[""]
[""]
[""]
[""]
[""]
[""]
[""]
[""]
[""]
[""]
[""]
[""]
[""]
[""]
[""]
[""]
[""]
[""]
[""]
[""]
[""]
[""]
[""]
[{"$f":"IFERROR(IF(B270<>\"\",ROW(),\"\")-2,\"\")","v":""}]
[""]
[""]
[""]
[""]
[""]
[""]
[""]
[""]
[""]
[""]
[""]
[""]
[""]
[""]
[""]
[""]
[""]
[""]
[""]
[""]
[""]
[""]
[""]
[""]
[""]
[""]
[""]
[""]
[""]
[""]
[""]
[""]
[""]
[""]
[""]
[""]
[""]
[""]
[""]
[""]
[""]
[""]
[""]
[""]
[""]
[""]
[""]
[""]
[""]
[""]
[""]
[""]
[""]
[""]
[""]
[""]
[""]
[""]
[""]
[""]
[""]
[""]
[""]
[{"$f":"IFERROR(IF(B334<>\"\",ROW(),\"\")-2,\"\")","v":""}]
[""]
[""]
[""]
[""]
[""]
[""]
[""]
[""]
[""]
[""]
[""]
[""]
[""]
[""]
[""]
[""]
[""]
[""]
[""]
[""]
[""]
[""]
[""]
[""]
[""]
[""]
[""]
[""]
[""]
[""]
[""]
[""]
[""]
[""]
[""]
[""]
[""]
[""]
[""]
[""]
[""]
[""]
[""]
[""]
[""]
[""]
[""]
[""]
[""]
[""]
[""]
[""]
[""]
[""]
[""]
[""]
[""]
[""]
[""]
[""]
[""]
[""]
[""]
[{"$f":"IFERROR(IF(B398<>\"\",ROW(),\"\")-2,\"\")","v":""}]
[""]
[""]
[""]
[""]
[""]
[""]
[""]
[""]
[""]
[""]
[""]
[""]
[""]
[""]
[""]
[""]
[""]
[""]
[""]
[""]
[""]
[""]
[""]
[""]
[""]
[""]
[""]
[""]
[""]
[""]
[""]
[""]
[""]
[""]
[""]
[""]
[""]
[""]
[""]
[""]
[""]
[""]
[""]
[""]
[""]
[""]
[""]
[""]
[""]
[""]
[""]
[""]
[""]
[""]
[""]
[""]
[""]
[""]
[""]
[""]
[""]
[""]
[""]
[{"$f":"IFERROR(IF(B462<>\"\",ROW(),\"\")-2,\"\")","v":""}]
[""]
[""]
[""]
[""]
[""]
[""]
[""]
[""]
[""]
[""]
[""]
[""]
[""]
[""]
[""]
[""]
[""]
[""]
[""]
[""]
[""]
[""]
[""]
[""]
[""]
[""]
[""]
[""]
[""]
[""]
[""]
[""]
[""]
[""]
[""]
[""]
[""]
[""]
[""]
[""]
[""]
[""]
[""]
[""]
[""]
[""]
[""]
[""]
[""]
[""]
[""]
[""]
[""]
[""]
[""]
[""]
[""]
[""]
[""]
[""]
[""]
[""]
[""]
[{"$f":"IFERROR(IF(B526<>\"\",ROW(),\"\")-2,\"\")","v":""}]
[""]
[""]
[""]
[""]
[""]
[""]
[""]
[""]
[""]
[""]
[""]
[""]
[""]
[""]
[""]
[""]
[""]
[""]
[""]
[""]
[""]
[""]
[""]
[""]
[""]
[""]
[""]
[""]
[""]
[""]
[""]
[""]
[""]
[""]
[""]
[""]
[""]
[""]
[""]
[""]
[""]
[""]
[""]
[""]
[""]
[""]
[""]
[""]
[""]
[""]
[""]
[""]
[""]
[""]
[""]
[""]
[""]
[""]
[""]
[""]
[""]
[""]
[""]
[{"$f":"IFERROR(IF(B590<>\"\",ROW(),\"\")-2,\"\")","v":""}]
[""]
[""]
[""]
[""]
[""]
[""]
[""]
[""]
[""]
[""]
[""]
[""]
[""]
[""]
[""]
[""]
[""]
[""]
[""]
[""]
[""]
[""]
[""]
[""]
[""]
[""]
[""]
[""]
[""]
[""]
[""]
[""]
[""]
[""]
[""]
[""]
[""]
[""]
[""]
[""]
[""]
[""]
[""]
[""]
[""]
[""]
[""]
[""]
[""]
[""]
[""]
[""]
[""]
[""]
[""]
[""]
[""]
[""]
[""]
[""]
[""]
[""]
[""]
[{"$f":"IFERROR(IF(B654<>\"\",ROW(),\"\")-2,\"\")","v":""}]
[""]
[""]
[""]
[""]
[""]
[""]
[""]
[""]
[""]
[""]
[""]
[""]
[""]
[""]
[""]
[""]
[""]
[""]
[""]
[""]
[""]
[""]
[""]
[""]
[""]
[""]
[""]
[""]
[""]
[""]
[""]
[""]
[""]
[""]
[""]
[""]
[""]
[""]
[""]
[""]
[""]
[""]
[""]
[""]
[""]
[""]
[""]
[""]
[""]
[""]
[""]
[""]
[""]
[""]
[""]
[""]
[""]
[""]
[""]
[""]
[""]
[""]
[""]
[{"$f":"IFERROR(IF(B718<>\"\",ROW(),\"\")-2,\"\")","v":""}]
[""]
[""]
[""]
[""]
[""]
[""]
[""]
[""]
[""]
[""]
[""]
[""]
[""]
[""]
[""]
[""]
[""]
[""]
[""]
[""]
[""]
[""]
[""]
[""]
[""]
[""]
[""]
[""]
[""]
[""]
[""]
[""]
[""]
[""]
[""]
[""]
[""]
[""]
[""]
[""]
[""]
[""]
[""]
[""]
[""]
[""]
[""]
[""]
[""]
[""]
[""]
[""]
[""]
[""]
[""]
[""]
[""]
[""]
[""]
[""]
[""]
[""]
[""]
[{"$f":"IFERROR(IF(B782<>\"\",ROW(),\"\")-2,\"\")","v":""}]
[""]
[""]
[""]
[""]
[""]
[""]
[""]
[""]
[""]
[""]
[""]
[""]
[""]
[""]
[""]
[""]
[""]
[""]
[""]
[""]
[""]
[""]
[""]
[""]
[""]
[""]
[""]
[""]
[""]
[""]
[""]
[""]
[""]
[""]
[""]
[""]
[""]
[""]
[""]
[""]
[""]
[""]
[""]
[""]
[""]
[""]
[""]
[""]
[""]
[""]
[""]
[""]
[""]
[""]
[""]
[""]
[""]
[""]
[""]
[""]
[""]
[""]
[""]
[{"$f":"IFERROR(IF(B846<>\"\",ROW(),\"\")-2,\"\")","v":""}]
[""]
[""]
[""]
[""]
[""]
[""]
[""]
[""]
[""]
[""]
[""]
[""]
[""]
[""]
[""]
[""]
[""]
[""]
[""]
[""]
[""]
[""]
[""]
[""]
[""]
[""]
[""]
[""]
[""]
[""]
[""]
[""]
[""]
[""]
[""]
[""]
[""]
[""]
[""]
[""]
[""]
[""]
[""]
[""]
[""]
[""]
[""]
[""]
[""]
[""]
[""]
[""]
[""]
[""]
[""]
[""]
[""]
[""]
[""]
[""]
[""]
[""]
[""]
[{"$f":"IFERROR(IF(B910<>\"\",ROW(),\"\")-2,\"\")","v":""}]
[""]
[""]
[""]
[""]
[""]
[""]
[""]
[""]
[""]
[""]
[""]
[""]
[""]
[""]
[""]
[""]
[""]
[""]
[""]
[""]
[""]
[""]
[""]
[""]
[""]
[""]
[""]
[""]
[""]
[""]
[""]
[""]
[""]
[""]
[""]
[""]
[""]
[""]
[""]
[""]
[""]
[""]
[""]
[""]
[""]
[""]
[""]
[""]
[""]
[""]
[""]
[""]
[""]

{"sheet":"mohamed04","index":8,"n_rows":963,"n_cols":35,"rows_kept":963,"cut":false,"hidden":false,"merged":[]}
[5,"mohamed",null,null,null,"En attente",null,{"$f":"SUMIFS(C4:C33,B4:B33,\"<=\"&F1,B4:B33,\">=\"&F1)","v":0},null,null,{"$f":"SUM(C:C)","v":8000},{"$f":"M1-K1","v":18740},{"$f":"SUM(D:D)","v":26740},null,null,null,null,null,null,null,null,null,null,null,null,null,null,null,null,null,null,{"$f":"IFERROR(LOOKUP(2,1/((AI:AI=$AZ$1)*(B:B<>\"\")),(B:B)),\"\")","v":"2020-05-22"},{"$f":"IFERROR(LOOKUP(2,1/((AI:AI=$AZ$1)*(C:C<>\"\")),(C:C)),\"\")","v":"En attente"}]
["رقم","التاريخ","تسديد جديد","اجمالي الفاتورة","الباقي","الصنف","الكمية","القيمة","الصنف2","الكمية2","القيمة2","الصنف3","الكمية3","القيمة3","الصنف4","الكمية4","القيمة4","الصنف5 ","الكمية5","القيمة5","الصنف6","الكمية6","القيمة6","الصنف7","الكمية7","القيمة7","الصنف8","الكمية8","القيمة8","ساعة",null,"تاريخ","دفع"]
[{"$f":"ROW()-2","v":1},"2020-05-22","En attente",2970,2970,"djezzy",1,1000,"mobillis",1,980,"ooredoo",1,990]
[2,"2020-05-22","En attente",1000,3970,"djezzy",1,1000,"mobillis",null,0,"ooredoo",null,0,null,null,null,null,null,null,null,null,null,null,null,null,null,null,null,null,null,"22/05/2020","En attente"]
[3,"2020-05-22",2000,null,1970,null,null,null,null,null,null,null,null,null,null,null,null,null,null,null,null,null,null,null,null,null,null,null,null,null,null,"22/05/2020","En attente"]
[4,"2020-05-22",6000,2970,940,"djezzy",1,1000,"mobillis",1,980,"ooredoo",1,990,null,null,null,null,null,null,null,null,null,null,null,null,null,null,null,null,null,"22/05/2020","En attente",null,0]
[5,"2020-05-22","En attente",2970,1910,"djezzy",1,1000,"mobillis",1,980,"ooredoo",1,990,null,null,null,null,null,null,null,null,null,null,null,null,null,null,null,null,null,"22/05/2020",6000]
[6,"2020-05-22","En attente",2970,4880,"djezzy",1,1000,"mobillis",1,980,"ooredoo",1,990,null,null,null,null,null,null,null,null,null,null,null,null,null,null,null,null,null,"22/05/2020","En attente"]
[7,"2020-05-22","En attente",2970,7850,"djezzy",1,1000,"mobillis",1,980,"ooredoo",1,990,null,null,null,null,null,null,null,null,null,null,null,null,null,null,null,null,null,"22/05/2020","En attente"]
[8,"2020-05-22","En attente",2970,10820,"djezzy",1,1000,"mobillis",1,980,"ooredoo",1,990,null,null,null,null,null,null,null,null,null,null,null,null,null,null,null,null,null,"22/05/2020","En attente"]
[9,"2020-05-22","En attente",2970,13790,"djezzy",1,1000,"mobillis",1,980,"ooredoo",1,990,null,null,null,null,null,null,null,null,null,null,null,null,null,null,null,null,null,"22/05/2020","En attente"]
[10,"2020-05-22","En attente",1980,15770,"djezzy",1,1000,"mobillis",1,980,"ooredoo",null,0,null,null,null,null,null,null,null,null,null,null,null,null,null,null,null,null,null,"22/05/2020","En attente"]
[11,"2020-05-22","En attente",2970,18740,"djezzy",1,1000,"mobillis",1,980,"ooredoo",1,990,null,null,null,null,null,null,null,null,null,null,null,null,null,null,null,null,null,"22/05/2020","En attente"]
[{"$f":"IFERROR(IF(B14<>\"\",ROW(),\"\")-2,\"\")","v":""}]
[""]
[""]
[{"$f":"IFERROR(IF(B17<>\"\",ROW(),\"\")-2,\"\")","v":""}]
[""]
[""]
[""]
[""]
[""]
[""]
[""]
[""]
[""]
[""]
[""]
[""]
[""]
[""]
[""]
[""]
[""]
[""]
[""]
[""]
[""]
[""]
[""]
[""]
[""]
[""]
[""]
[""]
[""]
[""]
[""]
[""]
[""]
[""]
[""]
[""]
[""]
[""]
[""]
[""]
[""]
[""]
[""]
[""]
[""]
[""]
[""]
[""]
[""]
[""]
[""]
[""]
[""]
[""]
[""]
[""]
[""]
[""]
[""]
[""]
[{"$f":"IFERROR(IF(B78<>\"\",ROW(),\"\")-2,\"\")","v":""}]
[""]
[""]
[""]
[""]
[""]
[""]
[""]
[""]
[""]
[""]
[""]
[""]
[""]
[""]
[""]
[""]
[""]
[""]
[""]
[""]
[""]
[""]
[""]
[""]
[""]
[""]
[""]
[""]
[""]
[""]
[""]
[""]
[""]
[""]
[""]
[""]
[""]
[""]
[""]
[""]
[""]
[""]
[""]
[""]
[""]
[""]
[""]
[""]
[""]
[""]
[""]
[""]
[""]
[""]
[""]
[""]
[""]
[""]
[""]
[""]
[""]
[""]
[""]
[{"$f":"IFERROR(IF(B142<>\"\",ROW(),\"\")-2,\"\")","v":""}]
[""]
[""]
[""]
[""]
[""]
[""]
[""]
[""]
[""]
[""]
[""]
[""]
[""]
[""]
[""]
[""]
[""]
[""]
[""]
[""]
[""]
[""]
[""]
[""]
[""]
[""]
[""]
[""]
[""]
[""]
[""]
[""]
[""]
[""]
[""]
[""]
[""]
[""]
[""]
[""]
[""]
[""]
[""]
[""]
[""]
[""]
[""]
[""]
[""]
[""]
[""]
[""]
[""]
[""]
[""]
[""]
[""]
[""]
[""]
[""]
[""]
[""]
[""]
[{"$f":"IFERROR(IF(B206<>\"\",ROW(),\"\")-2,\"\")","v":""}]
[""]
[""]
[""]
[""]
[""]
[""]
[""]
[""]
[""]
[""]
[""]
[""]
[""]
[""]
[""]
[""]
[""]
[""]
[""]
[""]
[""]
[""]
[""]
[""]
[""]
[""]
[""]
[""]
[""]
[""]
[""]
[""]
[""]
[""]
[""]
[""]
[""]
[""]
[""]
[""]
[""]
[""]
[""]
[""]
[""]
[""]
[""]
[""]
[""]
[""]
[""]
[""]
[""]
[""]
[""]
[""]
[""]
[""]
[""]
[""]
[""]
[""]
[""]
[{"$f":"IFERROR(IF(B270<>\"\",ROW(),\"\")-2,\"\")","v":""}]
[""]
[""]
[""]
[""]
[""]
[""]
[""]
[""]
[""]
[""]
[""]
[""]
[""]
[""]
[""]
[""]
[""]
[""]
[""]
[""]
[""]
[""]
[""]
[""]
[""]
[""]
[""]
[""]
[""]
[""]
[""]
[""]
[""]
[""]
[""]
[""]
[""]
[""]
[""]
[""]
[""]
[""]
[""]
[""]
[""]
[""]
[""]
[""]
[""]
[""]
[""]
[""]
[""]
[""]
[""]
[""]
[""]
[""]
[""]
[""]
[""]
[""]
[""]
[{"$f":"IFERROR(IF(B334<>\"\",ROW(),\"\")-2,\"\")","v":""}]
[""]
[""]
[""]
[""]
[""]
[""]
[""]
[""]
[""]
[""]
[""]
[""]
[""]
[""]
[""]
[""]
[""]
[""]
[""]
[""]
[""]
[""]
[""]
[""]
[""]
[""]
[""]
[""]
[""]
[""]
[""]
[""]
[""]
[""]
[""]
[""]
[""]
[""]
[""]
[""]
[""]
[""]
[""]
[""]
[""]
[""]
[""]
[""]
[""]
[""]
[""]
[""]
[""]
[""]
[""]
[""]
[""]
[""]
[""]
[""]
[""]
[""]
[""]
[{"$f":"IFERROR(IF(B398<>\"\",ROW(),\"\")-2,\"\")","v":""}]
[""]
[""]
[""]
[""]
[""]
[""]
[""]
[""]
[""]
[""]
[""]
[""]
[""]
[""]
[""]
[""]
[""]
[""]
[""]
[""]
[""]
[""]
[""]
[""]
[""]
[""]
[""]
[""]
[""]
[""]
[""]
[""]
[""]
[""]
[""]
[""]
[""]
[""]
[""]
[""]
[""]
[""]
[""]
[""]
[""]
[""]
[""]
[""]
[""]
[""]
[""]
[""]
[""]
[""]
[""]
[""]
[""]
[""]
[""]
[""]
[""]
[""]
[""]
[{"$f":"IFERROR(IF(B462<>\"\",ROW(),\"\")-2,\"\")","v":""}]
[""]
[""]
[""]
[""]
[""]
[""]
[""]
[""]
[""]
[""]
[""]
[""]
[""]
[""]
[""]
[""]
[""]
[""]
[""]
[""]
[""]
[""]
[""]
[""]
[""]
[""]
[""]
[""]
[""]
[""]
[""]
[""]
[""]
[""]
[""]
[""]
[""]
[""]
[""]
[""]
[""]
[""]
[""]
[""]
[""]
[""]
[""]
[""]
[""]
[""]
[""]
[""]
[""]
[""]
[""]
[""]
[""]
[""]
[""]
[""]
[""]
[""]
[""]
[{"$f":"IFERROR(IF(B526<>\"\",ROW(),\"\")-2,\"\")","v":""}]
[""]
[""]
[""]
[""]
[""]
[""]
[""]
[""]
[""]
[""]
[""]
[""]
[""]
[""]
[""]
[""]
[""]
[""]
[""]
[""]
[""]
[""]
[""]
[""]
[""]
[""]
[""]
[""]
[""]
[""]
[""]
[""]
[""]
[""]
[""]
[""]
[""]
[""]
[""]
[""]
[""]
[""]
[""]
[""]
[""]
[""]
[""]
[""]
[""]
[""]
[""]
[""]
[""]
[""]
[""]
[""]
[""]
[""]
[""]
[""]
[""]
[""]
[""]
[{"$f":"IFERROR(IF(B590<>\"\",ROW(),\"\")-2,\"\")","v":""}]
[""]
[""]
[""]
[""]
[""]
[""]
[""]
[""]
[""]
[""]
[""]
[""]
[""]
[""]
[""]
[""]
[""]
[""]
[""]
[""]
[""]
[""]
[""]
[""]
[""]
[""]
[""]
[""]
[""]
[""]
[""]
[""]
[""]
[""]
[""]
[""]
[""]
[""]
[""]
[""]
[""]
[""]
[""]
[""]
[""]
[""]
[""]
[""]
[""]
[""]
[""]
[""]
[""]
[""]
[""]
[""]
[""]
[""]
[""]
[""]
[""]
[""]
[""]
[{"$f":"IFERROR(IF(B654<>\"\",ROW(),\"\")-2,\"\")","v":""}]
[""]
[""]
[""]
[""]
[""]
[""]
[""]
[""]
[""]
[""]
[""]
[""]
[""]
[""]
[""]
[""]
[""]
[""]
[""]
[""]
[""]
[""]
[""]
[""]
[""]
[""]
[""]
[""]
[""]
[""]
[""]
[""]
[""]
[""]
[""]
[""]
[""]
[""]
[""]
[""]
[""]
[""]
[""]
[""]
[""]
[""]
[""]
[""]
[""]
[""]
[""]
[""]
[""]
[""]
[""]
[""]
[""]
[""]
[""]
[""]
[""]
[""]
[""]
[{"$f":"IFERROR(IF(B718<>\"\",ROW(),\"\")-2,\"\")","v":""}]
[""]
[""]
[""]
[""]
[""]
[""]
[""]
[""]
[""]
[""]
[""]
[""]
[""]
[""]
[""]
[""]
[""]
[""]
[""]
[""]
[""]
[""]
[""]
[""]
[""]
[""]
[""]
[""]
[""]
[""]
[""]
[""]
[""]
[""]
[""]
[""]
[""]
[""]
[""]
[""]
[""]
[""]
[""]
[""]
[""]
[""]
[""]
[""]
[""]
[""]
[""]
[""]
[""]
[""]
[""]
[""]
[""]
[""]
[""]
[""]
[""]
[""]
[""]
[{"$f":"IFERROR(IF(B782<>\"\",ROW(),\"\")-2,\"\")","v":""}]
[""]
[""]
[""]
[""]
[""]
[""]
[""]
[""]
[""]
[""]
[""]
[""]
[""]
[""]
[""]
[""]
[""]
[""]
[""]
[""]
[""]
[""]
[""]
[""]
[""]
[""]
[""]
[""]
[""]
[""]
[""]
[""]
[""]
[""]
[""]
[""]
[""]
[""]
[""]
[""]
[""]
[""]
[""]
[""]
[""]
[""]
[""]
[""]
[""]
[""]
[""]
[""]
[""]
[""]
[""]
[""]
[""]
[""]
[""]
[""]
[""]
[""]
[""]
[{"$f":"IFERROR(IF(B846<>\"\",ROW(),\"\")-2,\"\")","v":""}]
[""]
[""]
[""]
[""]
[""]
[""]
[""]
[""]
[""]
[""]
[""]
[""]
[""]
[""]
[""]
[""]
[""]
[""]
[""]
[""]
[""]
[""]
[""]
[""]
[""]
[""]
[""]
[""]
[""]
[""]
[""]
[""]
[""]
[""]
[""]
[""]
[""]
[""]
[""]
[""]
[""]
[""]
[""]
[""]
[""]
[""]
[""]
[""]
[""]
[""]
[""]
[""]
[""]
[""]
[""]
[""]
[""]
[""]
[""]
[""]
[""]
[""]
[""]
[{"$f":"IFERROR(IF(B910<>\"\",ROW(),\"\")-2,\"\")","v":""}]
[""]
[""]
[""]
[""]
[""]
[""]
[""]
[""]
[""]
[""]
[""]
[""]
[""]
[""]
[""]
[""]
[""]
[""]
[""]
[""]
[""]
[""]
[""]
[""]
[""]
[""]
[""]
[""]
[""]
[""]
[""]
[""]
[""]
[""]
[""]
[""]
[""]
[""]
[""]
[""]
[""]
[""]
[""]
[""]
[""]
[""]
[""]
[""]
[""]
[""]
[""]
[""]
[""]

{"sheet":"mohamed05","index":9,"n_rows":963,"n_cols":35,"rows_kept":963,"cut":false,"hidden":false,"merged":[]}
[6,"mohamed",null,null,null,"En attente",null,{"$f":"SUMIFS(C4:C33,B4:B33,\"<=\"&F1,B4:B33,\">=\"&F1)","v":0},null,null,{"$f":"SUM(C:C)","v":8000},{"$f":"M1-K1","v":18740},{"$f":"SUM(D:D)","v":26740},null,null,null,null,null,null,null,null,null,null,null,null,null,null,null,null,null,null,{"$f":"IFERROR(LOOKUP(2,1/((AI:AI=$AZ$1)*(B:B<>\"\")),(B:B)),\"\")","v":"2020-05-22"},{"$f":"IFERROR(LOOKUP(2,1/((AI:AI=$AZ$1)*(C:C<>\"\")),(C:C)),\"\")","v":"En attente"}]
["رقم","التاريخ","تسديد جديد","اجمالي الفاتورة","الباقي","الصنف","الكمية","القيمة","الصنف2","الكمية2","القيمة2","الصنف3","الكمية3","القيمة3","الصنف4","الكمية4","القيمة4","الصنف5 ","الكمية5","القيمة5","الصنف6","الكمية6","القيمة6","الصنف7","الكمية7","القيمة7","الصنف8","الكمية8","القيمة8","ساعة",null,"تاريخ","دفع"]
[{"$f":"ROW()-2","v":1},"2020-05-22","En attente",2970,2970,"djezzy",1,1000,"mobillis",1,980,"ooredoo",1,990]
[2,"2020-05-22","En attente",1000,3970,"djezzy",1,1000,"mobillis",null,0,"ooredoo",null,0,null,null,null,null,null,null,null,null,null,null,null,null,null,null,null,null,null,"22/05/2020","En attente"]
[3,"2020-05-22",2000,null,1970,null,null,null,null,null,null,null,null,null,null,null,null,null,null,null,null,null,null,null,null,null,null,null,null,null,null,"22/05/2020","En attente"]
[4,"2020-05-22",6000,2970,940,"djezzy",1,1000,"mobillis",1,980,"ooredoo",1,990,null,null,null,null,null,null,null,null,null,null,null,null,null,null,null,null,null,"22/05/2020","En attente",null,0]
[5,"2020-05-22","En attente",2970,1910,"djezzy",1,1000,"mobillis",1,980,"ooredoo",1,990,null,null,null,null,null,null,null,null,null,null,null,null,null,null,null,null,null,"22/05/2020",6000]
[6,"2020-05-22","En attente",2970,4880,"djezzy",1,1000,"mobillis",1,980,"ooredoo",1,990,null,null,null,null,null,null,null,null,null,null,null,null,null,null,null,null,null,"22/05/2020","En attente"]
[7,"2020-05-22","En attente",2970,7850,"djezzy",1,1000,"mobillis",1,980,"ooredoo",1,990,null,null,null,null,null,null,null,null,null,null,null,null,null,null,null,null,null,"22/05/2020","En attente"]
[8,"2020-05-22","En attente",2970,10820,"djezzy",1,1000,"mobillis",1,980,"ooredoo",1,990,null,null,null,null,null,null,null,null,null,null,null,null,null,null,null,null,null,"22/05/2020","En attente"]
[9,"2020-05-22","En attente",2970,13790,"djezzy",1,1000,"mobillis",1,980,"ooredoo",1,990,null,null,null,null,null,null,null,null,null,null,null,null,null,null,null,null,null,"22/05/2020","En attente"]
[10,"2020-05-22","En attente",1980,15770,"djezzy",1,1000,"mobillis",1,980,"ooredoo",null,0,null,null,null,null,null,null,null,null,null,null,null,null,null,null,null,null,null,"22/05/2020","En attente"]
[11,"2020-05-22","En attente",2970,18740,"djezzy",1,1000,"mobillis",1,980,"ooredoo",1,990,null,null,null,null,null,null,null,null,null,null,null,null,null,null,null,null,null,"22/05/2020","En attente"]
[{"$f":"IFERROR(IF(B14<>\"\",ROW(),\"\")-2,\"\")","v":""}]
[""]
[""]
[{"$f":"IFERROR(IF(B17<>\"\",ROW(),\"\")-2,\"\")","v":""}]
[""]
[""]
[""]
[""]
[""]
[""]
[""]
[""]
[""]
[""]
[""]
[""]
[""]
[""]
[""]
[""]
[""]
[""]
[""]
[""]
[""]
[""]
[""]
[""]
[""]
[""]
[""]
[""]
[""]
[""]
[""]
[""]
[""]
[""]
[""]
[""]
[""]
[""]
[""]
[""]
[""]
[""]
[""]
[""]
[""]
[""]
[""]
[""]
[""]
[""]
[""]
[""]
[""]
[""]
[""]
[""]
[""]
[""]
[""]
[""]
[{"$f":"IFERROR(IF(B78<>\"\",ROW(),\"\")-2,\"\")","v":""}]
[""]
[""]
[""]
[""]
[""]
[""]
[""]
[""]
[""]
[""]
[""]
[""]
[""]
[""]
[""]
[""]
[""]
[""]
[""]
[""]
[""]
[""]
[""]
[""]
[""]
[""]
[""]
[""]
[""]
[""]
[""]
[""]
[""]
[""]
[""]
[""]
[""]
[""]
[""]
[""]
[""]
[""]
[""]
[""]
[""]
[""]
[""]
[""]
[""]
[""]
[""]
[""]
[""]
[""]
[""]
[""]
[""]
[""]
[""]
[""]
[""]
[""]
[""]
[{"$f":"IFERROR(IF(B142<>\"\",ROW(),\"\")-2,\"\")","v":""}]
[""]
[""]
[""]
[""]
[""]
[""]
[""]
[""]
[""]
[""]
[""]
[""]
[""]
[""]
[""]
[""]
[""]
[""]
[""]
[""]
[""]
[""]
[""]
[""]
[""]
[""]
[""]
[""]
[""]
[""]
[""]
[""]
[""]
[""]
[""]
[""]
[""]
[""]
[""]
[""]
[""]
[""]
[""]
[""]
[""]
[""]
[""]
[""]
[""]
[""]
[""]
[""]
[""]
[""]
[""]
[""]
[""]
[""]
[""]
[""]
[""]
[""]
[""]
[{"$f":"IFERROR(IF(B206<>\"\",ROW(),\"\")-2,\"\")","v":""}]
[""]
[""]
[""]
[""]
[""]
[""]
[""]
[""]
[""]
[""]
[""]
[""]
[""]
[""]
[""]
[""]
[""]
[""]
[""]
[""]
[""]
[""]
[""]
[""]
[""]
[""]
[""]
[""]
[""]
[""]
[""]
[""]
[""]
[""]
[""]
[""]
[""]
[""]
[""]
[""]
[""]
[""]
[""]
[""]
[""]
[""]
[""]
[""]
[""]
[""]
[""]
[""]
[""]
[""]
[""]
[""]
[""]
[""]
[""]
[""]
[""]
[""]
[""]
[{"$f":"IFERROR(IF(B270<>\"\",ROW(),\"\")-2,\"\")","v":""}]
[""]
[""]
[""]
[""]
[""]
[""]
[""]
[""]
[""]
[""]
[""]
[""]
[""]
[""]
[""]
[""]
[""]
[""]
[""]
[""]
[""]
[""]
[""]
[""]
[""]
[""]
[""]
[""]
[""]
[""]
[""]
[""]
[""]
[""]
[""]
[""]
[""]
[""]
[""]
[""]
[""]
[""]
[""]
[""]
[""]
[""]
[""]
[""]
[""]
[""]
[""]
[""]
[""]
[""]
[""]
[""]
[""]
[""]
[""]
[""]
[""]
[""]
[""]
[{"$f":"IFERROR(IF(B334<>\"\",ROW(),\"\")-2,\"\")","v":""}]
[""]
[""]
[""]
[""]
[""]
[""]
[""]
[""]
[""]
[""]
[""]
[""]
[""]
[""]
[""]
[""]
[""]
[""]
[""]
[""]
[""]
[""]
[""]
[""]
[""]
[""]
[""]
[""]
[""]
[""]
[""]
[""]
[""]
[""]
[""]
[""]
[""]
[""]
[""]
[""]
[""]
[""]
[""]
[""]
[""]
[""]
[""]
[""]
[""]
[""]
[""]
[""]
[""]
[""]
[""]
[""]
[""]
[""]
[""]
[""]
[""]
[""]
[""]
[{"$f":"IFERROR(IF(B398<>\"\",ROW(),\"\")-2,\"\")","v":""}]
[""]
[""]
[""]
[""]
[""]
[""]
[""]
[""]
[""]
[""]
[""]
[""]
[""]
[""]
[""]
[""]
[""]
[""]
[""]
[""]
[""]
[""]
[""]
[""]
[""]
[""]
[""]
[""]
[""]
[""]
[""]
[""]
[""]
[""]
[""]
[""]
[""]
[""]
[""]
[""]
[""]
[""]
[""]
[""]
[""]
[""]
[""]
[""]
[""]
[""]
[""]
[""]
[""]
[""]
[""]
[""]
[""]
[""]
[""]
[""]
[""]
[""]
[""]
[{"$f":"IFERROR(IF(B462<>\"\",ROW(),\"\")-2,\"\")","v":""}]
[""]
[""]
[""]
[""]
[""]
[""]
[""]
[""]
[""]
[""]
[""]
[""]
[""]
[""]
[""]
[""]
[""]
[""]
[""]
[""]
[""]
[""]
[""]
[""]
[""]
[""]
[""]
[""]
[""]
[""]
[""]
[""]
[""]
[""]
[""]
[""]
[""]
[""]
[""]
[""]
[""]
[""]
[""]
[""]
[""]
[""]
[""]
[""]
[""]
[""]
[""]
[""]
[""]
[""]
[""]
[""]
[""]
[""]
[""]
[""]
[""]
[""]
[""]
[{"$f":"IFERROR(IF(B526<>\"\",ROW(),\"\")-2,\"\")","v":""}]
[""]
[""]
[""]
[""]
[""]
[""]
[""]
[""]
[""]
[""]
[""]
[""]
[""]
[""]
[""]
[""]
[""]
[""]
[""]
[""]
[""]
[""]
[""]
[""]
[""]
[""]
[""]
[""]
[""]
[""]
[""]
[""]
[""]
[""]
[""]
[""]
[""]
[""]
[""]
[""]
[""]
[""]
[""]
[""]
[""]
[""]
[""]
[""]
[""]
[""]
[""]
[""]
[""]
[""]
[""]
[""]
[""]
[""]
[""]
[""]
[""]
[""]
[""]
[{"$f":"IFERROR(IF(B590<>\"\",ROW(),\"\")-2,\"\")","v":""}]
[""]
[""]
[""]
[""]
[""]
[""]
[""]
[""]
[""]
[""]
[""]
[""]
[""]
[""]
[""]
[""]
[""]
[""]
[""]
[""]
[""]
[""]
[""]
[""]
[""]
[""]
[""]
[""]
[""]
[""]
[""]
[""]
[""]
[""]
[""]
[""]
[""]
[""]
[""]
[""]
[""]
[""]
[""]
[""]
[""]
[""]
[""]
[""]
[""]
[""]
[""]
[""]
[""]
[""]
[""]
[""]
[""]
[""]
[""]
[""]
[""]
[""]
[""]
[{"$f":"IFERROR(IF(B654<>\"\",ROW(),\"\")-2,\"\")","v":""}]
[""]
[""]
[""]
[""]
[""]
[""]
[""]
[""]
[""]
[""]
[""]
[""]
[""]
[""]
[""]
[""]
[""]
[""]
[""]
[""]
[""]
[""]
[""]
[""]
[""]
[""]
[""]
[""]
[""]
[""]
[""]
[""]
[""]
[""]
[""]
[""]
[""]
[""]
[""]
[""]
[""]
[""]
[""]
[""]
[""]
[""]
[""]
[""]
[""]
[""]
[""]
[""]
[""]
[""]
[""]
[""]
[""]
[""]
[""]
[""]
[""]
[""]
[""]
[{"$f":"IFERROR(IF(B718<>\"\",ROW(),\"\")-2,\"\")","v":""}]
[""]
[""]
[""]
[""]
[""]
[""]
[""]
[""]
[""]
[""]
[""]
[""]
[""]
[""]
[""]
[""]
[""]
[""]
[""]
[""]
[""]
[""]
[""]
[""]
[""]
[""]
[""]
[""]
[""]
[""]
[""]
[""]
[""]
[""]
[""]
[""]
[""]
[""]
[""]
[""]
[""]
[""]
[""]
[""]
[""]
[""]
[""]
[""]
[""]
[""]
[""]
[""]
[""]
[""]
[""]
[""]
[""]
[""]
[""]
[""]
[""]
[""]
[""]
[{"$f":"IFERROR(IF(B782<>\"\",ROW(),\"\")-2,\"\")","v":""}]
[""]
[""]
[""]
[""]
[""]
[""]
[""]
[""]
[""]
[""]
[""]
[""]
[""]
[""]
[""]
[""]
[""]
[""]
[""]
[""]
[""]
[""]
[""]
[""]
[""]
[""]
[""]
[""]
[""]
[""]
[""]
[""]
[""]
[""]
[""]
[""]
[""]
[""]
[""]
[""]
[""]
[""]
[""]
[""]
[""]
[""]
[""]
[""]
[""]
[""]
[""]
[""]
[""]
[""]
[""]
[""]
[""]
[""]
[""]
[""]
[""]
[""]
[""]
[{"$f":"IFERROR(IF(B846<>\"\",ROW(),\"\")-2,\"\")","v":""}]
[""]
[""]
[""]
[""]
[""]
[""]
[""]
[""]
[""]
[""]
[""]
[""]
[""]
[""]
[""]
[""]
[""]
[""]
[""]
[""]
[""]
[""]
[""]
[""]
[""]
[""]
[""]
[""]
[""]
[""]
[""]
[""]
[""]
[""]
[""]
[""]
[""]
[""]
[""]
[""]
[""]
[""]
[""]
[""]
[""]
[""]
[""]
[""]
[""]
[""]
[""]
[""]
[""]
[""]
[""]
[""]
[""]
[""]
[""]
[""]
[""]
[""]
[""]
[{"$f":"IFERROR(IF(B910<>\"\",ROW(),\"\")-2,\"\")","v":""}]
[""]
[""]
[""]
[""]
[""]
[""]
[""]
[""]
[""]
[""]
[""]
[""]
[""]
[""]
[""]
[""]
[""]
[""]
[""]
[""]
[""]
[""]
[""]
[""]
[""]
[""]
[""]
[""]
[""]
[""]
[""]
[""]
[""]
[""]
[""]
[""]
[""]
[""]
[""]
[""]
[""]
[""]
[""]
[""]
[""]
[""]
[""]
[""]
[""]
[""]
[""]
[""]
[""]

{"sheet":"mohamed06","index":10,"n_rows":963,"n_cols":35,"rows_kept":963,"cut":false,"hidden":false,"merged":[]}
[7,"mohamed",null,null,null,"En attente",null,{"$f":"SUMIFS(C4:C33,B4:B33,\"<=\"&F1,B4:B33,\">=\"&F1)","v":0},null,null,{"$f":"SUM(C:C)","v":8000},{"$f":"M1-K1","v":18740},{"$f":"SUM(D:D)","v":26740},null,null,null,null,null,null,null,null,null,null,null,null,null,null,null,null,null,null,{"$f":"IFERROR(LOOKUP(2,1/((AI:AI=$AZ$1)*(B:B<>\"\")),(B:B)),\"\")","v":"2020-05-22"},{"$f":"IFERROR(LOOKUP(2,1/((AI:AI=$AZ$1)*(C:C<>\"\")),(C:C)),\"\")","v":"En attente"}]
["رقم","التاريخ","تسديد جديد","اجمالي الفاتورة","الباقي","الصنف","الكمية","القيمة","الصنف2","الكمية2","القيمة2","الصنف3","الكمية3","القيمة3","الصنف4","الكمية4","القيمة4","الصنف5 ","الكمية5","القيمة5","الصنف6","الكمية6","القيمة6","الصنف7","الكمية7","القيمة7","الصنف8","الكمية8","القيمة8","ساعة",null,"تاريخ","دفع"]
[{"$f":"ROW()-2","v":1},"2020-05-22","En attente",2970,2970,"djezzy",1,1000,"mobillis",1,980,"ooredoo",1,990]
[2,"2020-05-22","En attente",1000,3970,"djezzy",1,1000,"mobillis",null,0,"ooredoo",null,0,null,null,null,null,null,null,null,null,null,null,null,null,null,null,null,null,null,"22/05/2020","En attente"]
[3,"2020-05-22",2000,null,1970,null,null,null,null,null,null,null,null,null,null,null,null,null,null,null,null,null,null,null,null,null,null,null,null,null,null,"22/05/2020","En attente"]
[4,"2020-05-22",6000,2970,940,"djezzy",1,1000,"mobillis",1,980,"ooredoo",1,990,null,null,null,null,null,null,null,null,null,null,null,null,null,null,null,null,null,"22/05/2020","En attente",null,0]
[5,"2020-05-22","En attente",2970,1910,"djezzy",1,1000,"mobillis",1,980,"ooredoo",1,990,null,null,null,null,null,null,null,null,null,null,null,null,null,null,null,null,null,"22/05/2020",6000]
[6,"2020-05-22","En attente",2970,4880,"djezzy",1,1000,"mobillis",1,980,"ooredoo",1,990,null,null,null,null,null,null,null,null,null,null,null,null,null,null,null,null,null,"22/05/2020","En attente"]
[7,"2020-05-22","En attente",2970,7850,"djezzy",1,1000,"mobillis",1,980,"ooredoo",1,990,null,null,null,null,null,null,null,null,null,null,null,null,null,null,null,null,null,"22/05/2020","En attente"]
[8,"2020-05-22","En attente",2970,10820,"djezzy",1,1000,"mobillis",1,980,"ooredoo",1,990,null,null,null,null,null,null,null,null,null,null,null,null,null,null,null,null,null,"22/05/2020","En attente"]
[9,"2020-05-22","En attente",2970,13790,"djezzy",1,1000,"mobillis",1,980,"ooredoo",1,990,null,null,null,null,null,null,null,null,null,null,null,null,null,null,null,null,null,"22/05/2020","En attente"]
[10,"2020-05-22","En attente",1980,15770,"djezzy",1,1000,"mobillis",1,980,"ooredoo",null,0,null,null,null,null,null,null,null,null,null,null,null,null,null,null,null,null,null,"22/05/2020","En attente"]
[11,"2020-05-22","En attente",2970,18740,"djezzy",1,1000,"mobillis",1,980,"ooredoo",1,990,null,null,null,null,null,null,null,null,null,null,null,null,null,null,null,null,null,"22/05/2020","En attente"]
[{"$f":"IFERROR(IF(B14<>\"\",ROW(),\"\")-2,\"\")","v":""}]
[""]
[""]
[{"$f":"IFERROR(IF(B17<>\"\",ROW(),\"\")-2,\"\")","v":""}]
[""]
[""]
[""]
[""]
[""]
[""]
[""]
[""]
[""]
[""]
[""]
[""]
[""]
[""]
[""]
[""]
[""]
[""]
[""]
[""]
[""]
[""]
[""]
[""]
[""]
[""]
[""]
[""]
[""]
[""]
[""]
[""]
[""]
[""]
[""]
[""]
[""]
[""]
[""]
[""]
[""]
[""]
[""]
[""]
[""]
[""]
[""]
[""]
[""]
[""]
[""]
[""]
[""]
[""]
[""]
[""]
[""]
[""]
[""]
[""]
[{"$f":"IFERROR(IF(B78<>\"\",ROW(),\"\")-2,\"\")","v":""}]
[""]
[""]
[""]
[""]
[""]
[""]
[""]
[""]
[""]
[""]
[""]
[""]
[""]
[""]
[""]
[""]
[""]
[""]
[""]
[""]
[""]
[""]
[""]
[""]
[""]
[""]
[""]
[""]
[""]
[""]
[""]
[""]
[""]
[""]
[""]
[""]
[""]
[""]
[""]
[""]
[""]
[""]
[""]
[""]
[""]
[""]
[""]
[""]
[""]
[""]
[""]
[""]
[""]
[""]
[""]
[""]
[""]
[""]
[""]
[""]
[""]
[""]
[""]
[{"$f":"IFERROR(IF(B142<>\"\",ROW(),\"\")-2,\"\")","v":""}]
[""]
[""]
[""]
[""]
[""]
[""]
[""]
[""]
[""]
[""]
[""]
[""]
[""]
[""]
[""]
[""]
[""]
[""]
[""]
[""]
[""]
[""]
[""]
[""]
[""]
[""]
[""]
[""]
[""]
[""]
[""]
[""]
[""]
[""]
[""]
[""]
[""]
[""]
[""]
[""]
[""]
[""]
[""]
[""]
[""]
[""]
[""]
[""]
[""]
[""]
[""]
[""]
[""]
[""]
[""]
[""]
[""]
[""]
[""]
[""]
[""]
[""]
[""]
[{"$f":"IFERROR(IF(B206<>\"\",ROW(),\"\")-2,\"\")","v":""}]
[""]
[""]
[""]
[""]
[""]
[""]
[""]
[""]
[""]
[""]
[""]
[""]
[""]
[""]
[""]
[""]
[""]
[""]
[""]
[""]
[""]
[""]
[""]
[""]
[""]
[""]
[""]
[""]
[""]
[""]
[""]
[""]
[""]
[""]
[""]
[""]
[""]
[""]
[""]
[""]
[""]
[""]
[""]
[""]
[""]
[""]
[""]
[""]
[""]
[""]
[""]
[""]
[""]
[""]
[""]
[""]
[""]
[""]
[""]
[""]
[""]
[""]
[""]
[{"$f":"IFERROR(IF(B270<>\"\",ROW(),\"\")-2,\"\")","v":""}]
[""]
[""]
[""]
[""]
[""]
[""]
[""]
[""]
[""]
[""]
[""]
[""]
[""]
[""]
[""]
[""]
[""]
[""]
[""]
[""]
[""]
[""]
[""]
[""]
[""]
[""]
[""]
[""]
[""]
[""]
[""]
[""]
[""]
[""]
[""]
[""]
[""]
[""]
[""]
[""]
[""]
[""]
[""]
[""]
[""]
[""]
[""]
[""]
[""]
[""]
[""]
[""]
[""]
[""]
[""]
[""]
[""]
[""]
[""]
[""]
[""]
[""]
[""]
[{"$f":"IFERROR(IF(B334<>\"\",ROW(),\"\")-2,\"\")","v":""}]
[""]
[""]
[""]
[""]
[""]
[""]
[""]
[""]
[""]
[""]
[""]
[""]
[""]
[""]
[""]
[""]
[""]
[""]
[""]
[""]
[""]
[""]
[""]
[""]
[""]
[""]
[""]
[""]
[""]
[""]
[""]
[""]
[""]
[""]
[""]
[""]
[""]
[""]
[""]
[""]
[""]
[""]
[""]
[""]
[""]
[""]
[""]
[""]
[""]
[""]
[""]
[""]
[""]
[""]
[""]
[""]
[""]
[""]
[""]
[""]
[""]
[""]
[""]
[{"$f":"IFERROR(IF(B398<>\"\",ROW(),\"\")-2,\"\")","v":""}]
[""]
[""]
[""]
[""]
[""]
[""]
[""]
[""]
[""]
[""]
[""]
[""]
[""]
[""]
[""]
[""]
[""]
[""]
[""]
[""]
[""]
[""]
[""]
[""]
[""]
[""]
[""]
[""]
[""]
[""]
[""]
[""]
[""]
[""]
[""]
[""]
[""]
[""]
[""]
[""]
[""]
[""]
[""]
[""]
[""]
[""]
[""]
[""]
[""]
[""]
[""]
[""]
[""]
[""]
[""]
[""]
[""]
[""]
[""]
[""]
[""]
[""]
[""]
[{"$f":"IFERROR(IF(B462<>\"\",ROW(),\"\")-2,\"\")","v":""}]
[""]
[""]
[""]
[""]
[""]
[""]
[""]
[""]
[""]
[""]
[""]
[""]
[""]
[""]
[""]
[""]
[""]
[""]
[""]
[""]
[""]
[""]
[""]
[""]
[""]
[""]
[""]
[""]
[""]
[""]
[""]
[""]
[""]
[""]
[""]
[""]
[""]
[""]
[""]
[""]
[""]
[""]
[""]
[""]
[""]
[""]
[""]
[""]
[""]
[""]
[""]
[""]
[""]
[""]
[""]
[""]
[""]
[""]
[""]
[""]
[""]
[""]
[""]
[{"$f":"IFERROR(IF(B526<>\"\",ROW(),\"\")-2,\"\")","v":""}]
[""]
[""]
[""]
[""]
[""]
[""]
[""]
[""]
[""]
[""]
[""]
[""]
[""]
[""]
[""]
[""]
[""]
[""]
[""]
[""]
[""]
[""]
[""]
[""]
[""]
[""]
[""]
[""]
[""]
[""]
[""]
[""]
[""]
[""]
[""]
[""]
[""]
[""]
[""]
[""]
[""]
[""]
[""]
[""]
[""]
[""]
[""]
[""]
[""]
[""]
[""]
[""]
[""]
[""]
[""]
[""]
[""]
[""]
[""]
[""]
[""]
[""]
[""]
[{"$f":"IFERROR(IF(B590<>\"\",ROW(),\"\")-2,\"\")","v":""}]
[""]
[""]
[""]
[""]
[""]
[""]
[""]
[""]
[""]
[""]
[""]
[""]
[""]
[""]
[""]
[""]
[""]
[""]
[""]
[""]
[""]
[""]
[""]
[""]
[""]
[""]
[""]
[""]
[""]
[""]
[""]
[""]
[""]
[""]
[""]
[""]
[""]
[""]
[""]
[""]
[""]
[""]
[""]
[""]
[""]
[""]
[""]
[""]
[""]
[""]
[""]
[""]
[""]
[""]
[""]
[""]
[""]
[""]
[""]
[""]
[""]
[""]
[""]
[{"$f":"IFERROR(IF(B654<>\"\",ROW(),\"\")-2,\"\")","v":""}]
[""]
[""]
[""]
[""]
[""]
[""]
[""]
[""]
[""]
[""]
[""]
[""]
[""]
[""]
[""]
[""]
[""]
[""]
[""]
[""]
[""]
[""]
[""]
[""]
[""]
[""]
[""]
[""]
[""]
[""]
[""]
[""]
[""]
[""]
[""]
[""]
[""]
[""]
[""]
[""]
[""]
[""]
[""]
[""]
[""]
[""]
[""]
[""]
[""]
[""]
[""]
[""]
[""]
[""]
[""]
[""]
[""]
[""]
[""]
[""]
[""]
[""]
[""]
[{"$f":"IFERROR(IF(B718<>\"\",ROW(),\"\")-2,\"\")","v":""}]
[""]
[""]
[""]
[""]
[""]
[""]
[""]
[""]
[""]
[""]
[""]
[""]
[""]
[""]
[""]
[""]
[""]
[""]
[""]
[""]
[""]
[""]
[""]
[""]
[""]
[""]
[""]
[""]
[""]
[""]
[""]
[""]
[""]
[""]
[""]
[""]
[""]
[""]
[""]
[""]
[""]
[""]
[""]
[""]
[""]
[""]
[""]
[""]
[""]
[""]
[""]
[""]
[""]
[""]
[""]
[""]
[""]
[""]
[""]
[""]
[""]
[""]
[""]
[{"$f":"IFERROR(IF(B782<>\"\",ROW(),\"\")-2,\"\")","v":""}]
[""]
[""]
[""]
[""]
[""]
[""]
[""]
[""]
[""]
[""]
[""]
[""]
[""]
[""]
[""]
[""]
[""]
[""]
[""]
[""]
[""]
[""]
[""]
[""]
[""]
[""]
[""]
[""]
[""]
[""]
[""]
[""]
[""]
[""]
[""]
[""]
[""]
[""]
[""]
[""]
[""]
[""]
[""]
[""]
[""]
[""]
[""]
[""]
[""]
[""]
[""]
[""]
[""]
[""]
[""]
[""]
[""]
[""]
[""]
[""]
[""]
[""]
[""]
[{"$f":"IFERROR(IF(B846<>\"\",ROW(),\"\")-2,\"\")","v":""}]
[""]
[""]
[""]
[""]
[""]
[""]
[""]
[""]
[""]
[""]
[""]
[""]
[""]
[""]
[""]
[""]
[""]
[""]
[""]
[""]
[""]
[""]
[""]
[""]
[""]
[""]
[""]
[""]
[""]
[""]
[""]
[""]
[""]
[""]
[""]
[""]
[""]
[""]
[""]
[""]
[""]
[""]
[""]
[""]
[""]
[""]
[""]
[""]
[""]
[""]
[""]
[""]
[""]
[""]
[""]
[""]
[""]
[""]
[""]
[""]
[""]
[""]
[""]
[{"$f":"IFERROR(IF(B910<>\"\",ROW(),\"\")-2,\"\")","v":""}]
[""]
[""]
[""]
[""]
[""]
[""]
[""]
[""]
[""]
[""]
[""]
[""]
[""]
[""]
[""]
[""]
[""]
[""]
[""]
[""]
[""]
[""]
[""]
[""]
[""]
[""]
[""]
[""]
[""]
[""]
[""]
[""]
[""]
[""]
[""]
[""]
[""]
[""]
[""]
[""]
[""]
[""]
[""]
[""]
[""]
[""]
[""]
[""]
[""]
[""]
[""]
[""]
[""]

{"sheet":"mohamed07","index":11,"n_rows":963,"n_cols":35,"rows_kept":963,"cut":false,"hidden":false,"merged":[]}
[8,"mohamed",null,null,null,"En attente",null,{"$f":"SUMIFS(C4:C33,B4:B33,\"<=\"&F1,B4:B33,\">=\"&F1)","v":0},null,null,{"$f":"SUM(C:C)","v":8000},{"$f":"M1-K1","v":18740},{"$f":"SUM(D:D)","v":26740},null,null,null,null,null,null,null,null,null,null,null,null,null,null,null,null,null,null,{"$f":"IFERROR(LOOKUP(2,1/((AI:AI=$AZ$1)*(B:B<>\"\")),(B:B)),\"\")","v":"2020-05-22"},{"$f":"IFERROR(LOOKUP(2,1/((AI:AI=$AZ$1)*(C:C<>\"\")),(C:C)),\"\")","v":"En attente"}]
["رقم","التاريخ","تسديد جديد","اجمالي الفاتورة","الباقي","الصنف","الكمية","القيمة","الصنف2","الكمية2","القيمة2","الصنف3","الكمية3","القيمة3","الصنف4","الكمية4","القيمة4","الصنف5 ","الكمية5","القيمة5","الصنف6","الكمية6","القيمة6","الصنف7","الكمية7","القيمة7","الصنف8","الكمية8","القيمة8","ساعة",null,"تاريخ","دفع"]
[{"$f":"ROW()-2","v":1},"2020-05-22","En attente",2970,2970,"djezzy",1,1000,"mobillis",1,980,"ooredoo",1,990]
[2,"2020-05-22","En attente",1000,3970,"djezzy",1,1000,"mobillis",null,0,"ooredoo",null,0,null,null,null,null,null,null,null,null,null,null,null,null,null,null,null,null,null,"22/05/2020","En attente"]
[3,"2020-05-22",2000,null,1970,null,null,null,null,null,null,null,null,null,null,null,null,null,null,null,null,null,null,null,null,null,null,null,null,null,null,"22/05/2020","En attente"]
[4,"2020-05-22",6000,2970,940,"djezzy",1,1000,"mobillis",1,980,"ooredoo",1,990,null,null,null,null,null,null,null,null,null,null,null,null,null,null,null,null,null,"22/05/2020","En attente",null,0]
[5,"2020-05-22","En attente",2970,1910,"djezzy",1,1000,"mobillis",1,980,"ooredoo",1,990,null,null,null,null,null,null,null,null,null,null,null,null,null,null,null,null,null,"22/05/2020",6000]
[6,"2020-05-22","En attente",2970,4880,"djezzy",1,1000,"mobillis",1,980,"ooredoo",1,990,null,null,null,null,null,null,null,null,null,null,null,null,null,null,null,null,null,"22/05/2020","En attente"]
[7,"2020-05-22","En attente",2970,7850,"djezzy",1,1000,"mobillis",1,980,"ooredoo",1,990,null,null,null,null,null,null,null,null,null,null,null,null,null,null,null,null,null,"22/05/2020","En attente"]
[8,"2020-05-22","En attente",2970,10820,"djezzy",1,1000,"mobillis",1,980,"ooredoo",1,990,null,null,null,null,null,null,null,null,null,null,null,null,null,null,null,null,null,"22/05/2020","En attente"]
[9,"2020-05-22","En attente",2970,13790,"djezzy",1,1000,"mobillis",1,980,"ooredoo",1,990,null,null,null,null,null,null,null,null,null,null,null,null,null,null,null,null,null,"22/05/2020","En attente"]
[10,"2020-05-22","En attente",1980,15770,"djezzy",1,1000,"mobillis",1,980,"ooredoo",null,0,null,null,null,null,null,null,null,null,null,null,null,null,null,null,null,null,null,"22/05/2020","En attente"]
[11,"2020-05-22","En attente",2970,18740,"djezzy",1,1000,"mobillis",1,980,"ooredoo",1,990,null,null,null,null,null,null,null,null,null,null,null,null,null,null,null,null,null,"22/05/2020","En attente"]
[{"$f":"IFERROR(IF(B14<>\"\",ROW(),\"\")-2,\"\")","v":""}]
[""]
[""]
[{"$f":"IFERROR(IF(B17<>\"\",ROW(),\"\")-2,\"\")","v":""}]
[""]
[""]
[""]
[""]
[""]
[""]
[""]
[""]
[""]
[""]
[""]
[""]
[""]
[""]
[""]
[""]
[""]
[""]
[""]
[""]
[""]
[""]
[""]
[""]
[""]
[""]
[""]
[""]
[""]
[""]
[""]
[""]
[""]
[""]
[""]
[""]
[""]
[""]
[""]
[""]
[""]
[""]
[""]
[""]
[""]
[""]
[""]
[""]
[""]
[""]
[""]
[""]
[""]
[""]
[""]
[""]
[""]
[""]
[""]
[""]
[{"$f":"IFERROR(IF(B78<>\"\",ROW(),\"\")-2,\"\")","v":""}]
[""]
[""]
[""]
[""]
[""]
[""]
[""]
[""]
[""]
[""]
[""]
[""]
[""]
[""]
[""]
[""]
[""]
[""]
[""]
[""]
[""]
[""]
[""]
[""]
[""]
[""]
[""]
[""]
[""]
[""]
[""]
[""]
[""]
[""]
[""]
[""]
[""]
[""]
[""]
[""]
[""]
[""]
[""]
[""]
[""]
[""]
[""]
[""]
[""]
[""]
[""]
[""]
[""]
[""]
[""]
[""]
[""]
[""]
[""]
[""]
[""]
[""]
[""]
[{"$f":"IFERROR(IF(B142<>\"\",ROW(),\"\")-2,\"\")","v":""}]
[""]
[""]
[""]
[""]
[""]
[""]
[""]
[""]
[""]
[""]
[""]
[""]
[""]
[""]
[""]
[""]
[""]
[""]
[""]
[""]
[""]
[""]
[""]
[""]
[""]
[""]
[""]
[""]
[""]
[""]
[""]
[""]
[""]
[""]
[""]
[""]
[""]
[""]
[""]
[""]
[""]
[""]
[""]
[""]
[""]
[""]
[""]
[""]
[""]
[""]
[""]
[""]
[""]
[""]
[""]
[""]
[""]
[""]
[""]
[""]
[""]
[""]
[""]
[{"$f":"IFERROR(IF(B206<>\"\",ROW(),\"\")-2,\"\")","v":""}]
[""]
[""]
[""]
[""]
[""]
[""]
[""]
[""]
[""]
[""]
[""]
[""]
[""]
[""]
[""]
[""]
[""]
[""]
[""]
[""]
[""]
[""]
[""]
[""]
[""]
[""]
[""]
[""]
[""]
[""]
[""]
[""]
[""]
[""]
[""]
[""]
[""]
[""]
[""]
[""]
[""]
[""]
[""]
[""]
[""]
[""]
[""]
[""]
[""]
[""]
[""]
[""]
[""]
[""]
[""]
[""]
[""]
[""]
[""]
[""]
[""]
[""]
[""]
[{"$f":"IFERROR(IF(B270<>\"\",ROW(),\"\")-2,\"\")","v":""}]
[""]
[""]
[""]
[""]
[""]
[""]
[""]
[""]
[""]
[""]
[""]
[""]
[""]
[""]
[""]
[""]
[""]
[""]
[""]
[""]
[""]
[""]
[""]
[""]
[""]
[""]
[""]
[""]
[""]
[""]
[""]
[""]
[""]
[""]
[""]
[""]
[""]
[""]
[""]
[""]
[""]
[""]
[""]
[""]
[""]
[""]
[""]
[""]
[""]
[""]
[""]
[""]
[""]
[""]
[""]
[""]
[""]
[""]
[""]
[""]
[""]
[""]
[""]
[{"$f":"IFERROR(IF(B334<>\"\",ROW(),\"\")-2,\"\")","v":""}]
[""]
[""]
[""]
[""]
[""]
[""]
[""]
[""]
[""]
[""]
[""]
[""]
[""]
[""]
[""]
[""]
[""]
[""]
[""]
[""]
[""]
[""]
[""]
[""]
[""]
[""]
[""]
[""]
[""]
[""]
[""]
[""]
[""]
[""]
[""]
[""]
[""]
[""]
[""]
[""]
[""]
[""]
[""]
[""]
[""]
[""]
[""]
[""]
[""]
[""]
[""]
[""]
[""]
[""]
[""]
[""]
[""]
[""]
[""]
[""]
[""]
[""]
[""]
[{"$f":"IFERROR(IF(B398<>\"\",ROW(),\"\")-2,\"\")","v":""}]
[""]
[""]
[""]
[""]
[""]
[""]
[""]
[""]
[""]
[""]
[""]
[""]
[""]
[""]
[""]
[""]
[""]
[""]
[""]
[""]
[""]
[""]
[""]
[""]
[""]
[""]
[""]
[""]
[""]
[""]
[""]
[""]
[""]
[""]
[""]
[""]
[""]
[""]
[""]
[""]
[""]
[""]
[""]
[""]
[""]
[""]
[""]
[""]
[""]
[""]
[""]
[""]
[""]
[""]
[""]
[""]
[""]
[""]
[""]
[""]
[""]
[""]
[""]
[{"$f":"IFERROR(IF(B462<>\"\",ROW(),\"\")-2,\"\")","v":""}]
[""]
[""]
[""]
[""]
[""]
[""]
[""]
[""]
[""]
[""]
[""]
[""]
[""]
[""]
[""]
[""]
[""]
[""]
[""]
[""]
[""]
[""]
[""]
[""]
[""]
[""]
[""]
[""]
[""]
[""]
[""]
[""]
[""]
[""]
[""]
[""]
[""]
[""]
[""]
[""]
[""]
[""]
[""]
[""]
[""]
[""]
[""]
[""]
[""]
[""]
[""]
[""]
[""]
[""]
[""]
[""]
[""]
[""]
[""]
[""]
[""]
[""]
[""]
[{"$f":"IFERROR(IF(B526<>\"\",ROW(),\"\")-2,\"\")","v":""}]
[""]
[""]
[""]
[""]
[""]
[""]
[""]
[""]
[""]
[""]
[""]
[""]
[""]
[""]
[""]
[""]
[""]
[""]
[""]
[""]
[""]
[""]
[""]
[""]
[""]
[""]
[""]
[""]
[""]
[""]
[""]
[""]
[""]
[""]
[""]
[""]
[""]
[""]
[""]
[""]
[""]
[""]
[""]
[""]
[""]
[""]
[""]
[""]
[""]
[""]
[""]
[""]
[""]
[""]
[""]
[""]
[""]
[""]
[""]
[""]
[""]
[""]
[""]
[{"$f":"IFERROR(IF(B590<>\"\",ROW(),\"\")-2,\"\")","v":""}]
[""]
[""]
[""]
[""]
[""]
[""]
[""]
[""]
[""]
[""]
[""]
[""]
[""]
[""]
[""]
[""]
[""]
[""]
[""]
[""]
[""]
[""]
[""]
[""]
[""]
[""]
[""]
[""]
[""]
[""]
[""]
[""]
[""]
[""]
[""]
[""]
[""]
[""]
[""]
[""]
[""]
[""]
[""]
[""]
[""]
[""]
[""]
[""]
[""]
[""]
[""]
[""]
[""]
[""]
[""]
[""]
[""]
[""]
[""]
[""]
[""]
[""]
[""]
[{"$f":"IFERROR(IF(B654<>\"\",ROW(),\"\")-2,\"\")","v":""}]
[""]
[""]
[""]
[""]
[""]
[""]
[""]
[""]
[""]
[""]
[""]
[""]
[""]
[""]
[""]
[""]
[""]
[""]
[""]
[""]
[""]
[""]
[""]
[""]
[""]
[""]
[""]
[""]
[""]
[""]
[""]
[""]
[""]
[""]
[""]
[""]
[""]
[""]
[""]
[""]
[""]
[""]
[""]
[""]
[""]
[""]
[""]
[""]
[""]
[""]
[""]
[""]
[""]
[""]
[""]
[""]
[""]
[""]
[""]
[""]
[""]
[""]
[""]
[{"$f":"IFERROR(IF(B718<>\"\",ROW(),\"\")-2,\"\")","v":""}]
[""]
[""]
[""]
[""]
[""]
[""]
[""]
[""]
[""]
[""]
[""]
[""]
[""]
[""]
[""]
[""]
[""]
[""]
[""]
[""]
[""]
[""]
[""]
[""]
[""]
[""]
[""]
[""]
[""]
[""]
[""]
[""]
[""]
[""]
[""]
[""]
[""]
[""]
[""]
[""]
[""]
[""]
[""]
[""]
[""]
[""]
[""]
[""]
[""]
[""]
[""]
[""]
[""]
[""]
[""]
[""]
[""]
[""]
[""]
[""]
[""]
[""]
[""]
[{"$f":"IFERROR(IF(B782<>\"\",ROW(),\"\")-2,\"\")","v":""}]
[""]
[""]
[""]
[""]
[""]
[""]
[""]
[""]
[""]
[""]
[""]
[""]
[""]
[""]
[""]
[""]
[""]
[""]
[""]
[""]
[""]
[""]
[""]
[""]
[""]
[""]
[""]
[""]
[""]
[""]
[""]
[""]
[""]
[""]
[""]
[""]
[""]
[""]
[""]
[""]
[""]
[""]
[""]
[""]
[""]
[""]
[""]
[""]
[""]
[""]
[""]
[""]
[""]
[""]
[""]
[""]
[""]
[""]
[""]
[""]
[""]
[""]
[""]
[{"$f":"IFERROR(IF(B846<>\"\",ROW(),\"\")-2,\"\")","v":""}]
[""]
[""]
[""]
[""]
[""]
[""]
[""]
[""]
[""]
[""]
[""]
[""]
[""]
[""]
[""]
[""]
[""]
[""]
[""]
[""]
[""]
[""]
[""]
[""]
[""]
[""]
[""]
[""]
[""]
[""]
[""]
[""]
[""]
[""]
[""]
[""]
[""]
[""]
[""]
[""]
[""]
[""]
[""]
[""]
[""]
[""]
[""]
[""]
[""]
[""]
[""]
[""]
[""]
[""]
[""]
[""]
[""]
[""]
[""]
[""]
[""]
[""]
[""]
[{"$f":"IFERROR(IF(B910<>\"\",ROW(),\"\")-2,\"\")","v":""}]
[""]
[""]
[""]
[""]
[""]
[""]
[""]
[""]
[""]
[""]
[""]
[""]
[""]
[""]
[""]
[""]
[""]
[""]
[""]
[""]
[""]
[""]
[""]
[""]
[""]
[""]
[""]
[""]
[""]
[""]
[""]
[""]
[""]
[""]
[""]
[""]
[""]
[""]
[""]
[""]
[""]
[""]
[""]
[""]
[""]
[""]
[""]
[""]
[""]
[""]
[""]
[""]
[""]

{"sheet":"mohamed08","index":12,"n_rows":963,"n_cols":35,"rows_kept":963,"cut":false,"hidden":false,"merged":[]}
[9,"mohamed",null,null,null,"En attente",null,{"$f":"SUMIFS(C4:C33,B4:B33,\"<=\"&F1,B4:B33,\">=\"&F1)","v":0},null,null,{"$f":"SUM(C:C)","v":8000},{"$f":"M1-K1","v":18740},{"$f":"SUM(D:D)","v":26740},null,null,null,null,null,null,null,null,null,null,null,null,null,null,null,null,null,null,{"$f":"IFERROR(LOOKUP(2,1/((AI:AI=$AZ$1)*(B:B<>\"\")),(B:B)),\"\")","v":"2020-05-22"},{"$f":"IFERROR(LOOKUP(2,1/((AI:AI=$AZ$1)*(C:C<>\"\")),(C:C)),\"\")","v":"En attente"}]
["رقم","التاريخ","تسديد جديد","اجمالي الفاتورة","الباقي","الصنف","الكمية","القيمة","الصنف2","الكمية2","القيمة2","الصنف3","الكمية3","القيمة3","الصنف4","الكمية4","القيمة4","الصنف5 ","الكمية5","القيمة5","الصنف6","الكمية6","القيمة6","الصنف7","الكمية7","القيمة7","الصنف8","الكمية8","القيمة8","ساعة",null,"تاريخ","دفع"]
[{"$f":"ROW()-2","v":1},"2020-05-22","En attente",2970,2970,"djezzy",1,1000,"mobillis",1,980,"ooredoo",1,990]
[2,"2020-05-22","En attente",1000,3970,"djezzy",1,1000,"mobillis",null,0,"ooredoo",null,0,null,null,null,null,null,null,null,null,null,null,null,null,null,null,null,null,null,"22/05/2020","En attente"]
[3,"2020-05-22",2000,null,1970,null,null,null,null,null,null,null,null,null,null,null,null,null,null,null,null,null,null,null,null,null,null,null,null,null,null,"22/05/2020","En attente"]
[4,"2020-05-22",6000,2970,940,"djezzy",1,1000,"mobillis",1,980,"ooredoo",1,990,null,null,null,null,null,null,null,null,null,null,null,null,null,null,null,null,null,"22/05/2020","En attente",null,0]
[5,"2020-05-22","En attente",2970,1910,"djezzy",1,1000,"mobillis",1,980,"ooredoo",1,990,null,null,null,null,null,null,null,null,null,null,null,null,null,null,null,null,null,"22/05/2020",6000]
[6,"2020-05-22","En attente",2970,4880,"djezzy",1,1000,"mobillis",1,980,"ooredoo",1,990,null,null,null,null,null,null,null,null,null,null,null,null,null,null,null,null,null,"22/05/2020","En attente"]
[7,"2020-05-22","En attente",2970,7850,"djezzy",1,1000,"mobillis",1,980,"ooredoo",1,990,null,null,null,null,null,null,null,null,null,null,null,null,null,null,null,null,null,"22/05/2020","En attente"]
[8,"2020-05-22","En attente",2970,10820,"djezzy",1,1000,"mobillis",1,980,"ooredoo",1,990,null,null,null,null,null,null,null,null,null,null,null,null,null,null,null,null,null,"22/05/2020","En attente"]
[9,"2020-05-22","En attente",2970,13790,"djezzy",1,1000,"mobillis",1,980,"ooredoo",1,990,null,null,null,null,null,null,null,null,null,null,null,null,null,null,null,null,null,"22/05/2020","En attente"]
[10,"2020-05-22","En attente",1980,15770,"djezzy",1,1000,"mobillis",1,980,"ooredoo",null,0,null,null,null,null,null,null,null,null,null,null,null,null,null,null,null,null,null,"22/05/2020","En attente"]
[11,"2020-05-22","En attente",2970,18740,"djezzy",1,1000,"mobillis",1,980,"ooredoo",1,990,null,null,null,null,null,null,null,null,null,null,null,null,null,null,null,null,null,"22/05/2020","En attente"]
[{"$f":"IFERROR(IF(B14<>\"\",ROW(),\"\")-2,\"\")","v":""}]
[""]
[""]
[{"$f":"IFERROR(IF(B17<>\"\",ROW(),\"\")-2,\"\")","v":""}]
[""]
[""]
[""]
[""]
[""]
[""]
[""]
[""]
[""]
[""]
[""]
[""]
[""]
[""]
[""]
[""]
[""]
[""]
[""]
[""]
[""]
[""]
[""]
[""]
[""]
[""]
[""]
[""]
[""]
[""]
[""]
[""]
[""]
[""]
[""]
[""]
[""]
[""]
[""]
[""]
[""]
[""]
[""]
[""]
[""]
[""]
[""]
[""]
[""]
[""]
[""]
[""]
[""]
[""]
[""]
[""]
[""]
[""]
[""]
[""]
[{"$f":"IFERROR(IF(B78<>\"\",ROW(),\"\")-2,\"\")","v":""}]
[""]
[""]
[""]
[""]
[""]
[""]
[""]
[""]
[""]
[""]
[""]
[""]
[""]
[""]
[""]
[""]
[""]
[""]
[""]
[""]
[""]
[""]
[""]
[""]
[""]
[""]
[""]
[""]
[""]
[""]
[""]
[""]
[""]
[""]
[""]
[""]
[""]
[""]
[""]
[""]
[""]
[""]
[""]
[""]
[""]
[""]
[""]
[""]
[""]
[""]
[""]
[""]
[""]
[""]
[""]
[""]
[""]
[""]
[""]
[""]
[""]
[""]
[""]
[{"$f":"IFERROR(IF(B142<>\"\",ROW(),\"\")-2,\"\")","v":""}]
[""]
[""]
[""]
[""]
[""]
[""]
[""]
[""]
[""]
[""]
[""]
[""]
[""]
[""]
[""]
[""]
[""]
[""]
[""]
[""]
[""]
[""]
[""]
[""]
[""]
[""]
[""]
[""]
[""]
[""]
[""]
[""]
[""]
[""]
[""]
[""]
[""]
[""]
[""]
[""]
[""]
[""]
[""]
[""]
[""]
[""]
[""]
[""]
[""]
[""]
[""]
[""]
[""]
[""]
[""]
[""]
[""]
[""]
[""]
[""]
[""]
[""]
[""]
[{"$f":"IFERROR(IF(B206<>\"\",ROW(),\"\")-2,\"\")","v":""}]
[""]
[""]
[""]
[""]
[""]
[""]
[""]
[""]
[""]
[""]
[""]
[""]
[""]
[""]
[""]
[""]
[""]
[""]
[""]
[""]
[""]
[""]
[""]
[""]
[""]
[""]
[""]
[""]
[""]
[""]
[""]
[""]
[""]
[""]
[""]
[""]
[""]
[""]
[""]
[""]
[""]
[""]
[""]
[""]
[""]
[""]
[""]
[""]
[""]
[""]
[""]
[""]
[""]
[""]
[""]
[""]
[""]
[""]
[""]
[""]
[""]
[""]
[""]
[{"$f":"IFERROR(IF(B270<>\"\",ROW(),\"\")-2,\"\")","v":""}]
[""]
[""]
[""]
[""]
[""]
[""]
[""]
[""]
[""]
[""]
[""]
[""]
[""]
[""]
[""]
[""]
[""]
[""]
[""]
[""]
[""]
[""]
[""]
[""]
[""]
[""]
[""]
[""]
[""]
[""]
[""]
[""]
[""]
[""]
[""]
[""]
[""]
[""]
[""]
[""]
[""]
[""]
[""]
[""]
[""]
[""]
[""]
[""]
[""]
[""]
[""]
[""]
[""]
[""]
[""]
[""]
[""]
[""]
[""]
[""]
[""]
[""]
[""]
[{"$f":"IFERROR(IF(B334<>\"\",ROW(),\"\")-2,\"\")","v":""}]
[""]
[""]
[""]
[""]
[""]
[""]
[""]
[""]
[""]
[""]
[""]
[""]
[""]
[""]
[""]
[""]
[""]
[""]
[""]
[""]
[""]
[""]
[""]
[""]
[""]
[""]
[""]
[""]
[""]
[""]
[""]
[""]
[""]
[""]
[""]
[""]
[""]
[""]
[""]
[""]
[""]
[""]
[""]
[""]
[""]
[""]
[""]
[""]
[""]
[""]
[""]
[""]
[""]
[""]
[""]
[""]
[""]
[""]
[""]
[""]
[""]
[""]
[""]
[{"$f":"IFERROR(IF(B398<>\"\",ROW(),\"\")-2,\"\")","v":""}]
[""]
[""]
[""]
[""]
[""]
[""]
[""]
[""]
[""]
[""]
[""]
[""]
[""]
[""]
[""]
[""]
[""]
[""]
[""]
[""]
[""]
[""]
[""]
[""]
[""]
[""]
[""]
[""]
[""]
[""]
[""]
[""]
[""]
[""]
[""]
[""]
[""]
[""]
[""]
[""]
[""]
[""]
[""]
[""]
[""]
[""]
[""]
[""]
[""]
[""]
[""]
[""]
[""]
[""]
[""]
[""]
[""]
[""]
[""]
[""]
[""]
[""]
[""]
[{"$f":"IFERROR(IF(B462<>\"\",ROW(),\"\")-2,\"\")","v":""}]
[""]
[""]
[""]
[""]
[""]
[""]
[""]
[""]
[""]
[""]
[""]
[""]
[""]
[""]
[""]
[""]
[""]
[""]
[""]
[""]
[""]
[""]
[""]
[""]
[""]
[""]
[""]
[""]
[""]
[""]
[""]
[""]
[""]
[""]
[""]
[""]
[""]
[""]
[""]
[""]
[""]
[""]
[""]
[""]
[""]
[""]
[""]
[""]
[""]
[""]
[""]
[""]
[""]
[""]
[""]
[""]
[""]
[""]
[""]
[""]
[""]
[""]
[""]
[{"$f":"IFERROR(IF(B526<>\"\",ROW(),\"\")-2,\"\")","v":""}]
[""]
[""]
[""]
[""]
[""]
[""]
[""]
[""]
[""]
[""]
[""]
[""]
[""]
[""]
[""]
[""]
[""]
[""]
[""]
[""]
[""]
[""]
[""]
[""]
[""]
[""]
[""]
[""]
[""]
[""]
[""]
[""]
[""]
[""]
[""]
[""]
[""]
[""]
[""]
[""]
[""]
[""]
[""]
[""]
[""]
[""]
[""]
[""]
[""]
[""]
[""]
[""]
[""]
[""]
[""]
[""]
[""]
[""]
[""]
[""]
[""]
[""]
[""]
[{"$f":"IFERROR(IF(B590<>\"\",ROW(),\"\")-2,\"\")","v":""}]
[""]
[""]
[""]
[""]
[""]
[""]
[""]
[""]
[""]
[""]
[""]
[""]
[""]
[""]
[""]
[""]
[""]
[""]
[""]
[""]
[""]
[""]
[""]
[""]
[""]
[""]
[""]
[""]
[""]
[""]
[""]
[""]
[""]
[""]
[""]
[""]
[""]
[""]
[""]
[""]
[""]
[""]
[""]
[""]
[""]
[""]
[""]
[""]
[""]
[""]
[""]
[""]
[""]
[""]
[""]
[""]
[""]
[""]
[""]
[""]
[""]
[""]
[""]
[{"$f":"IFERROR(IF(B654<>\"\",ROW(),\"\")-2,\"\")","v":""}]
[""]
[""]
[""]
[""]
[""]
[""]
[""]
[""]
[""]
[""]
[""]
[""]
[""]
[""]
[""]
[""]
[""]
[""]
[""]
[""]
[""]
[""]
[""]
[""]
[""]
[""]
[""]
[""]
[""]
[""]
[""]
[""]
[""]
[""]
[""]
[""]
[""]
[""]
[""]
[""]
[""]
[""]
[""]
[""]
[""]
[""]
[""]
[""]
[""]
[""]
[""]
[""]
[""]
[""]
[""]
[""]
[""]
[""]
[""]
[""]
[""]
[""]
[""]
[{"$f":"IFERROR(IF(B718<>\"\",ROW(),\"\")-2,\"\")","v":""}]
[""]
[""]
[""]
[""]
[""]
[""]
[""]
[""]
[""]
[""]
[""]
[""]
[""]
[""]
[""]
[""]
[""]
[""]
[""]
[""]
[""]
[""]
[""]
[""]
[""]
[""]
[""]
[""]
[""]
[""]
[""]
[""]
[""]
[""]
[""]
[""]
[""]
[""]
[""]
[""]
[""]
[""]
[""]
[""]
[""]
[""]
[""]
[""]
[""]
[""]
[""]
[""]
[""]
[""]
[""]
[""]
[""]
[""]
[""]
[""]
[""]
[""]
[""]
[{"$f":"IFERROR(IF(B782<>\"\",ROW(),\"\")-2,\"\")","v":""}]
[""]
[""]
[""]
[""]
[""]
[""]
[""]
[""]
[""]
[""]
[""]
[""]
[""]
[""]
[""]
[""]
[""]
[""]
[""]
[""]
[""]
[""]
[""]
[""]
[""]
[""]
[""]
[""]
[""]
[""]
[""]
[""]
[""]
[""]
[""]
[""]
[""]
[""]
[""]
[""]
[""]
[""]
[""]
[""]
[""]
[""]
[""]
[""]
[""]
[""]
[""]
[""]
[""]
[""]
[""]
[""]
[""]
[""]
[""]
[""]
[""]
[""]
[""]
[{"$f":"IFERROR(IF(B846<>\"\",ROW(),\"\")-2,\"\")","v":""}]
[""]
[""]
[""]
[""]
[""]
[""]
[""]
[""]
[""]
[""]
[""]
[""]
[""]
[""]
[""]
[""]
[""]
[""]
[""]
[""]
[""]
[""]
[""]
[""]
[""]
[""]
[""]
[""]
[""]
[""]
[""]
[""]
[""]
[""]
[""]
[""]
[""]
[""]
[""]
[""]
[""]
[""]
[""]
[""]
[""]
[""]
[""]
[""]
[""]
[""]
[""]
[""]
[""]
[""]
[""]
[""]
[""]
[""]
[""]
[""]
[""]
[""]
[""]
[{"$f":"IFERROR(IF(B910<>\"\",ROW(),\"\")-2,\"\")","v":""}]
[""]
[""]
[""]
[""]
[""]
[""]
[""]
[""]
[""]
[""]
[""]
[""]
[""]
[""]
[""]
[""]
[""]
[""]
[""]
[""]
[""]
[""]
[""]
[""]
[""]
[""]
[""]
[""]
[""]
[""]
[""]
[""]
[""]
[""]
[""]
[""]
[""]
[""]
[""]
[""]
[""]
[""]
[""]
[""]
[""]
[""]
[""]
[""]
[""]
[""]
[""]
[""]
[""]