{"text_format":"1","workbook":"xlsx","n_sheets":2,"sheets":["All","One"],"not_rendered":{"charts":0,"images":1,"macros":0,"external_links":0,"defined_names":1,"comments":0,"pivot_tables":0},"unopened":[],"bounds":{"document_bytes":16777216,"sheet_cells":100000,"rows_first":2000,"rows_last":500,"rows_between":2000,"halvings":0,"cell_chars":16384,"cell_head_chars":4096},"cells_cut":0,"cells_raw":0,"read":"whole","date_system":"1900"}

{"sheet":"All","index":0,"n_rows":202,"n_cols":53,"rows_kept":202,"cut":false,"hidden":false,"merged":[[0,43,0,45],[0,7,1,7],[0,4,1,4],[0,46,1,46],[0,48,1,48],[0,25,0,27],[0,28,0,30],[0,31,0,33],[0,34,0,36],[0,37,0,39],[0,40,0,42],[0,6,1,6],[0,13,0,15],[0,16,0,18],[0,19,0,21],[0,22,0,24],[0,50,1,50],[0,49,1,49],[0,47,1,47],[0,51,1,51],[0,52,1,52],[0,10,0,12],[0,9,1,9],[0,5,1,5],[0,0,1,0],[0,1,1,1],[0,2,1,2],[0,3,1,3],[0,8,1,8]]}
[null,"الاسم","رقم الهوية","رقم الجوال","نوع السداد","المديونية الاساسية","خصم إلتزام السداد","المديونية في حالة إلتزام السداد","عدد الاقسام","بداية السداد / تاريخ السداد","القسط (1)",null,null,"القسط (2)",null,null,"القسط (3)",null,null,"القسط (4)",null,null,"القسط (5)",null,null,"القسط (6)",null,null,"القسط (7)",null,null,"القسط (8)",null,null,"القسط (9)",null,null,"القسط (10)",null,null,"القسط (11)",null,null,"القسط (12)",null,null,{"$f":"F1","v":"المديونية الاساسية"},{"$f":"G1","v":"خصم إلتزام السداد"},{"$f":"H1","v":"المديونية في حالة إلتزام السداد"},"المحصل","رصيد باقي المديونية بدون خصم","رصيد باقي المديونية معمد الخصم","الملاحظات"]
[null,null,null,null,null,null,null,null,null,null,"المبلغ","رقم الايصال","التاريخ","المبلغ","رقم الايصال","التاريخ","المبلغ","رقم الايصال","التاريخ","المبلغ","رقم الايصال","التاريخ","المبلغ","رقم الايصال","التاريخ","المبلغ","رقم الايصال","التاريخ","المبلغ","رقم الايصال","التاريخ","المبلغ","رقم الايصال","التاريخ","المبلغ","رقم الايصال","التاريخ","المبلغ","رقم الايصال","التاريخ","المبلغ","رقم الايصال","التاريخ","المبلغ","رقم الايصال","التاريخ"]
[1,"احمد السيد على ابراهيم","C3","c5","تقسيط",130000,30000,{"$f":"F3-G3","v":100000},10,"2020-05-25",2000,15,"2020-06-01",35,20,"2020-06-05","A1","A2","2020-06-11","A4","A5","A6","A7","A8","A9","A10","A11","A12","A13","A14","A15","A16","A17","A18","A19","A20","A21","A22","A23","A24","A25","A26","A27","A28","A29","A30",{"$f":"F3","v":130000},{"$f":"G3","v":30000},{"$f":"H3","v":100000},{"$f":"SUM(K3,N3,Q3,T3,W3,Z3,AF3,AC3,AI3,AL3,AO3,AR3)","v":2035},{"$f":"F3-AX3","v":127965},{"$f":"H3-AX3","v":97965}]
[2,"سمير فاروق ابراهيم على","C4","c6","تقسيط",70000,13000,{"$f":"F4-G4","v":57000},9,"2020-05-30",15000,44,"2020-06-02",null,null,null,null,null,null,null,null,null,null,null,null,null,null,null,null,null,null,null,null,null,null,null,null,null,null,null,null,null,null,null,null,null,70000,13000,57000,{"$f":"SUM(K4+N4+Q4+T4+W4+Z4+AF4+AC4+AI4+AL4+AO4+AR4)","v":15000},{"$f":"F4-AX4","v":55000},42000]
[3,"اسماء احمد حاتم جودة","C5","c7","تقسيط",12000,0,{"$f":"F5-G5","v":12000},8,"2020-03-16",3500,34,"2020-06-03",null,null,null,null,null,null,null,null,null,null,null,null,null,null,null,null,null,null,null,null,null,null,null,null,null,null,null,null,null,null,null,null,null,12000,0,12000,3500,8500,8500]
[4,"حسنى على ابراهيم","C6","c8","آجل",80000,12,79988,null,"2020-04-16",2200,65,"2020-06-04",null,null,null,null,null,null,null,null,null,null,null,null,null,null,null,null,null,null,null,null,null,null,null,null,null,null,null,null,null,null,null,null,null,80000,12,79988,{"$f":"SUM(K6+N6+Q6+T6+W6+Z6+AF6+AC6+AI6+AL6+AO6+AR6)","v":2200},{"$f":"F6-AX6","v":77800},{"$f":"H6-AX6","v":77788}]
[5,"b1","C7","c9","آجل",{"$f":"F6/1000","v":80},{"$f":"G6/1000","v":1.2E-2},79.988,{"$f":"I6/1000","v":0},{"$f":"J6/1000","v":43.936999999999998},{"$f":"K6/1000","v":2.2000000000000002},{"$f":"L6/1000","v":6.5000000000000002E-2},{"$f":"M6/1000","v":43.985999999999997},{"$f":"N6/1000","v":0},{"$f":"O6/1000","v":0},{"$f":"P6/1000","v":0},{"$f":"Q6/1000","v":0},{"$f":"R6/1000","v":0},{"$f":"S6/1000","v":0},{"$f":"T6/1000","v":0},{"$f":"U6/1000","v":0},{"$f":"V6/1000","v":0},{"$f":"W6/1000","v":0},{"$f":"X6/1000","v":0},{"$f":"Y6/1000","v":0},{"$f":"Z6/1000","v":0},{"$f":"AA6/1000","v":0},{"$f":"AB6/1000","v":0},{"$f":"AC6/1000","v":0},{"$f":"AD6/1000","v":0},{"$f":"AE6/1000","v":0},{"$f":"AF6/1000","v":0},{"$f":"AG6/1000","v":0},{"$f":"AH6/1000","v":0},{"$f":"AI6/1000","v":0},{"$f":"AJ6/1000","v":0},{"$f":"AK6/1000","v":0},{"$f":"AL6/1000","v":0},{"$f":"AM6/1000","v":0},{"$f":"AN6/1000","v":0},{"$f":"AO6/1000","v":0},{"$f":"AP6/1000","v":0},{"$f":"AQ6/1000","v":0},{"$f":"AR6/1000","v":0},{"$f":"AS6/1000","v":0},{"$f":"AT6/1000","v":0},80,1.2E-2,79.988,2.2000000000000002,77.8,77.787999999999997]
[6,null,null,null,"c8","c9","c10","c11","c12","c13",null,null,null,null,null,null,null,null,null,null,null,null,null,null,null,null,null,null,null,null,null,null,null,null,null,null,null,null,null,null,null,null,null,null,null,null,"c9","c10","c11",0,{"$error":"#VALUE!"},{"$error":"#VALUE!"}]
[7,null,null,null,null,null,null,null,null,null,null,null,null,null,null,null,null,null,null,null,null,null,null,null,null,null,null,null,null,null,null,null,null,null,null,null,null,null,null,null,null,null,null,null,null,null,0,0,0,{"$f":"SUM(K9+N9+Q9+T9+W9+Z9+AF9+AC9+AI9+AL9+AO9+AR9)","v":0},{"$f":"F9-AX9","v":0},{"$f":"H9-AX9","v":0}]
[8,null,null,null,null,null,null,null,null,null,{"$f":"COLUMN()-3","v":8},{"$f":"COLUMN()-3","v":9},10,11,null,null,null,null,null,null,null,null,null,null,null,null,null,null,null,null,null,null,null,null,null,null,null,null,null,null,null,null,null,null,null,null,0,0,0,19,-19,-19]
[9,null,null,null,null,null,null,null,null,null,null,null,null,null,null,null,null,null,null,null,null,null,null,null,null,null,null,null,null,null,null,null,null,null,null,null,null,null,null,null,null,null,null,null,null,null,0,0,0,0,0,0]
[10,null,null,null,null,null,null,null,null,null,null,null,null,null,null,null,null,null,null,null,null,null,null,null,null,null,null,null,null,null,null,null,null,null,null,null,null,null,null,null,null,null,null,null,null,null,0,0,0,0,0,0]
[11,null,null,null,null,null,null,null,null,null,null,null,null,null,null,null,null,null,null,null,null,null,null,null,null,null,null,null,null,null,null,null,null,null,null,null,null,null,null,null,null,null,null,null,null,null,0,0,0,0,0,0]
[12,null,null,null,null,null,null,null,null,null,null,null,null,null,null,null,null,null,null,null,null,null,null,null,null,null,null,null,null,null,null,null,null,null,null,null,null,null,null,null,null,null,null,null,null,null,0,0,0,0,0,0]
[13,null,null,null,null,null,null,null,null,null,null,null,null,null,null,null,null,null,null,null,null,null,null,null,null,null,null,null,null,null,null,null,null,null,null,null,null,null,null,null,null,null,null,null,null,null,0,0,0,0,0,0]
[14,null,null,null,null,null,null,null,null,null,null,null,null,null,null,null,null,null,null,null,null,null,null,null,null,null,null,null,null,null,null,null,null,null,null,null,null,null,null,null,null,null,null,null,null,null,0,0,0,0,0,0]
[15,null,null,null,null,null,null,null,null,null,null,null,null,null,null,null,null,null,null,null,null,null,null,null,null,null,null,null,null,null,null,null,null,null,null,null,null,null,null,null,null,null,null,null,null,null,0,0,0,0,0,0]
[16,null,null,null,null,null,null,null,null,null,null,null,null,null,null,null,null,null,null,null,null,null,null,null,null,null,null,null,null,null,null,null,null,null,null,null,null,null,null,null,null,null,null,null,null,null,0,0,0,0,0,0]
[17,null,null,null,null,null,null,null,null,null,null,null,null,null,null,null,null,null,null,null,null,null,null,null,null,null,null,null,null,null,null,null,null,null,null,null,null,null,null,null,null,null,null,null,null,null,0,0,0,0,0,0]
[18,null,null,null,null,null,null,null,null,null,null,null,null,null,null,null,null,null,null,null,null,null,null,null,null,null,null,null,null,null,null,null,null,null,null,null,null,null,null,null,null,null,null,null,null,null,0,0,0,0,0,0]
[19,null,null,null,null,null,null,null,null,null,null,null,null,null,null,null,null,null,null,null,null,null,null,null,null,null,null,null,null,null,null,null,null,null,null,null,null,null,null,null,null,null,null,null,null,null,0,0,0,0,0,0]
[20,null,null,null,null,null,null,null,null,null,null,null,null,null,null,null,null,null,null,null,null,null,null,null,null,null,null,null,null,null,null,null,null,null,null,null,null,null,null,null,null,null,null,null,null,null,0,0,0,0,0,0]
[21,null,null,null,null,null,null,null,null,null,null,null,null,null,null,null,null,null,null,null,null,null,null,null,null,null,null,null,null,null,null,null,null,null,null,null,null,null,null,null,null,null,null,null,null,null,0,0,0,0,0,0]
[22,null,null,null,null,null,null,null,null,null,null,null,null,null,null,null,null,null,null,null,null,null,null,null,null,null,null,null,null,null,null,null,null,null,null,null,null,null,null,null,null,null,null,null,null,null,0,0,0,0,0,0]
[23,null,null,null,null,null,null,null,null,null,null,null,null,null,null,null,null,null,null,null,null,null,null,null,null,null,null,null,null,null,null,null,null,null,null,null,null,null,null,null,null,null,null,null,null,null,0,0,0,0,0,0]
[24,null,null,null,null,null,null,null,null,null,null,null,null,null,null,null,null,null,null,null,null,null,null,null,null,null,null,null,null,null,null,null,null,null,null,null,null,null,null,null,null,null,null,null,null,null,0,0,0,0,0,0]
[25,null,null,null,null,null,null,null,null,null,null,null,null,null,null,null,null,null,null,null,null,null,null,null,null,null,null,null,null,null,null,null,null,null,null,null,null,null,null,null,null,null,null,null,null,null,0,0,0,0,0,0]
[26,null,null,null,null,null,null,null,null,null,null,null,null,null,null,null,null,null,null,null,null,null,null,null,null,null,null,null,null,null,null,null,null,null,null,null,null,null,null,null,null,null,null,null,null,null,0,0,0,0,0,0]
[27,null,null,null,null,null,null,null,null,null,null,null,null,null,null,null,null,null,null,null,null,null,null,null,null,null,null,null,null,null,null,null,null,null,null,null,null,null,null,null,null,null,null,null,null,null,0,0,0,0,0,0]
[28,null,null,null,null,null,null,null,null,null,null,null,null,null,null,null,null,null,null,null,null,null,null,null,null,null,null,null,null,null,null,null,null,null,null,null,null,null,null,null,null,null,null,null,null,null,0,0,0,0,0,0]
[29,null,null,null,null,null,null,null,null,null,null,null,null,null,null,null,null,null,null,null,null,null,null,null,null,null,null,null,null,null,null,null,null,null,null,null,null,null,null,null,null,null,null,null,null,null,0,0,0,0,0,0]
[30,null,null,null,null,null,null,null,null,null,null,null,null,null,null,null,null,null,null,null,null,null,null,null,null,null,null,null,null,null,null,null,null,null,null,null,null,null,null,null,null,null,null,null,null,null,0,0,0,0,0,0]
[31,null,null,null,null,null,null,null,null,null,null,null,null,null,null,null,null,null,null,null,null,null,null,null,null,null,null,null,null,null,null,null,null,null,null,null,null,null,null,null,null,null,null,null,null,null,0,0,0,0,0,0]
[32,null,null,null,null,null,null,null,null,null,null,null,null,null,null,null,null,null,null,null,null,null,null,null,null,null,null,null,null,null,null,null,null,null,null,null,null,null,null,null,null,null,null,null,null,null,0,0,0,0,0,0]
[33,null,null,null,null,null,null,null,null,null,null,null,null,null,null,null,null,null,null,null,null,null,null,null,null,null,null,null,null,null,null,null,null,null,null,null,null,null,null,null,null,null,null,null,null,null,0,0,0,0,0,0]
[34,null,null,null,null,null,null,null,null,null,null,null,null,null,null,null,null,null,null,null,null,null,null,null,null,null,null,null,null,null,null,null,null,null,null,null,null,null,null,null,null,null,null,null,null,null,0,0,0,0,0,0]
[35,null,null,null,null,null,null,null,null,null,null,null,null,null,null,null,null,null,null,null,null,null,null,null,null,null,null,null,null,null,null,null,null,null,null,null,null,null,null,null,null,null,null,null,null,null,0,0,0,0,0,0]
[36,null,null,null,null,null,null,null,null,null,null,null,null,null,null,null,null,null,null,null,null,null,null,null,null,null,null,null,null,null,null,null,null,null,null,null,null,null,null,null,null,null,null,null,null,null,0,0,0,0,0,0]
[37,null,null,null,null,null,null,null,null,null,null,null,null,null,null,null,null,null,null,null,null,null,null,null,null,null,null,null,null,null,null,null,null,null,null,null,null,null,null,null,null,null,null,null,null,null,0,0,0,0,0,0]
[38,null,null,null,null,null,null,null,null,null,null,null,null,null,null,null,null,null,null,null,null,null,null,null,null,null,null,null,null,null,null,null,null,null,null,null,null,null,null,null,null,null,null,null,null,null,0,0,0,0,0,0]
[39,null,null,null,null,null,null,null,null,null,null,null,null,null,null,null,null,null,null,null,null,null,null,null,null,null,null,null,null,null,null,null,null,null,null,null,null,null,null,null,null,null,null,null,null,null,0,0,0,0,0,0]
[40,null,null,null,null,null,null,null,null,null,null,null,null,null,null,null,null,null,null,null,null,null,null,null,null,null,null,null,null,null,null,null,null,null,null,null,null,null,null,null,null,null,null,null,null,null,0,0,0,0,0,0]
[41,null,null,null,null,null,null,null,null,null,null,null,null,null,null,null,null,null,null,null,null,null,null,null,null,null,null,null,null,null,null,null,null,null,null,null,null,null,null,null,null,null,null,null,null,null,0,0,0,0,0,0]
[42,null,null,null,null,null,null,null,null,null,null,null,null,null,null,null,null,null,null,null,null,null,null,null,null,null,null,null,null,null,null,null,null,null,null,null,null,null,null,null,null,null,null,null,null,null,0,0,0,0,0,0]
[43,null,null,null,null,null,null,null,null,null,null,null,null,null,null,null,null,null,null,null,null,null,null,null,null,null,null,null,null,null,null,null,null,null,null,null,null,null,null,null,null,null,null,null,null,null,0,0,0,0,0,0]
[44,null,null,null,null,null,null,null,null,null,null,null,null,null,null,null,null,null,null,null,null,null,null,null,null,null,null,null,null,null,null,null,null,null,null,null,null,null,null,null,null,null,null,null,null,null,0,0,0,0,0,0]
[45,null,null,null,null,null,null,null,null,null,null,null,null,null,null,null,null,null,null,null,null,null,null,null,null,null,null,null,null,null,null,null,null,null,null,null,null,null,null,null,null,null,null,null,null,null,0,0,0,0,0,0]
[46,null,null,null,null,null,null,null,null,null,null,null,null,null,null,null,null,null,null,null,null,null,null,null,null,null,null,null,null,null,null,null,null,null,null,null,null,null,null,null,null,null,null,null,null,null,0,0,0,0,0,0]
[47,null,null,null,null,null,null,null,null,null,null,null,null,null,null,null,null,null,null,null,null,null,null,null,null,null,null,null,null,null,null,null,null,null,null,null,null,null,null,null,null,null,null,null,null,null,0,0,0,0,0,0]
[48,null,null,null,null,null,null,null,null,null,null,null,null,null,null,null,null,null,null,null,null,null,null,null,null,null,null,null,null,null,null,null,null,null,null,null,null,null,null,null,null,null,null,null,null,null,0,0,0,0,0,0]
[49,null,null,null,null,null,null,null,null,null,null,null,null,null,null,null,null,null,null,null,null,null,null,null,null,null,null,null,null,null,null,null,null,null,null,null,null,null,null,null,null,null,null,null,null,null,0,0,0,0,0,0]
[50,null,null,null,null,null,null,null,null,null,null,null,null,null,null,null,null,null,null,null,null,null,null,null,null,null,null,null,null,null,null,null,null,null,null,null,null,null,null,null,null,null,null,null,null,null,0,0,0,0,0,0]
[51,null,null,null,null,null,null,null,null,null,null,null,null,null,null,null,null,null,null,null,null,null,null,null,null,null,null,null,null,null,null,null,null,null,null,null,null,null,null,null,null,null,null,null,null,null,0,0,0,0,0,0]
[52,null,null,null,null,null,null,null,null,null,null,null,null,null,null,null,null,null,null,null,null,null,null,null,null,null,null,null,null,null,null,null,null,null,null,null,null,null,null,null,null,null,null,null,null,null,0,0,0,0,0,0]
[53,null,null,null,null,null,null,null,null,null,null,null,null,null,null,null,null,null,null,null,null,null,null,null,null,null,null,null,null,null,null,null,null,null,null,null,null,null,null,null,null,null,null,null,null,null,0,0,0,0,0,0]
[54,null,null,null,null,null,null,null,null,null,null,null,null,null,null,null,null,null,null,null,null,null,null,null,null,null,null,null,null,null,null,null,null,null,null,null,null,null,null,null,null,null,null,null,null,null,0,0,0,0,0,0]
[55,null,null,null,null,null,null,null,null,null,null,null,null,null,null,null,null,null,null,null,null,null,null,null,null,null,null,null,null,null,null,null,null,null,null,null,null,null,null,null,null,null,null,null,null,null,0,0,0,0,0,0]
[56,null,null,null,null,null,null,null,null,null,null,null,null,null,null,null,null,null,null,null,null,null,null,null,null,null,null,null,null,null,null,null,null,null,null,null,null,null,null,null,null,null,null,null,null,null,0,0,0,0,0,0]
[57,null,null,null,null,null,null,null,null,null,null,null,null,null,null,null,null,null,null,null,null,null,null,null,null,null,null,null,null,null,null,null,null,null,null,null,null,null,null,null,null,null,null,null,null,null,0,0,0,0,0,0]
[58,null,null,null,null,null,null,null,null,null,null,null,null,null,null,null,null,null,null,null,null,null,null,null,null,null,null,null,null,null,null,null,null,null,null,null,null,null,null,null,null,null,null,null,null,null,0,0,0,0,0,0]
{"$rows_left_out":143}
{"sheet":"One","index":1,"n_rows":22,"n_cols":8,"rows_kept":22,"cut":false,"hidden":false,"merged":[[21,2,22,7],[19,4,19,5],[17,4,17,5],[18,4,18,5],[2,5,2,7]]}
[]
[]
[null,"الاسم","احمد السيد على ابراهيم",null,null,"الاقساط"]
[null,"رقم الهوية",{"$f":"OFFSET(INDEX(All!$C$3:$C$100,MATCH($C$3,All!$B$3:$B$100,0)),,0)","v":"C3"},null,"م","المبلغ","رقم الايصال","التاريخ"]
[null,"رقم الجوال",{"$f":"OFFSET(INDEX(All!$C$3:$C$100,MATCH($C$3,All!$B$3:$B$100,0)),,1)","v":"c5"},null,1,{"$f":"OFFSET(INDEX(All!$C$3:$C$100,MATCH($C$3,All!$B$3:$B$100,0)),,COLUMNS($A$1:A1)+7+(ROWS($A$1:A1)-1)*3)","v":2000},{"$f":"OFFSET(INDEX(All!$C$3:$C$100,MATCH($C$3,All!$B$3:$B$100,0)),,COLUMNS($A$1:B1)+7+(ROWS($A$1:B1)-1)*3)","v":15},{"$f":"IF(OFFSET(INDEX(All!$C$3:$C$100,MATCH($C$3,All!$B$3:$B$100,0)),,COLUMNS($A$1:C1)+7+(ROWS($A$1:C1)-1)*3)=0,\"\",OFFSET(INDEX(All!$C$3:$C$100,MATCH($C$3,All!$B$3:$B$100,0)),,COLUMNS($A$1:C1)+7+(ROWS($A$1:C1)-1)*3))","v":"2020-06-01"}]
[null,null,null,null,2,{"$f":"OFFSET(INDEX(All!$C$3:$C$100,MATCH($C$3,All!$B$3:$B$100,0)),,COLUMNS($A$1:A2)+7+(ROWS($A$1:A2)-1)*3)","v":35},{"$f":"OFFSET(INDEX(All!$C$3:$C$100,MATCH($C$3,All!$B$3:$B$100,0)),,COLUMNS($A$1:B2)+7+(ROWS($A$1:B2)-1)*3)","v":20},{"$f":"IF(OFFSET(INDEX(All!$C$3:$C$100,MATCH($C$3,All!$B$3:$B$100,0)),,COLUMNS($A$1:C2)+7+(ROWS($A$1:C2)-1)*3)=0,\"\",OFFSET(INDEX(All!$C$3:$C$100,MATCH($C$3,All!$B$3:$B$100,0)),,COLUMNS($A$1:C2)+7+(ROWS($A$1:C2)-1)*3))","v":"2020-06-05"}]
[null,null,null,null,3,{"$f":"OFFSET(INDEX(All!$C$3:$C$100,MATCH($C$3,All!$B$3:$B$100,0)),,COLUMNS($A$1:A3)+7+(ROWS($A$1:A3)-1)*3)","v":"A1"},{"$f":"OFFSET(INDEX(All!$C$3:$C$100,MATCH($C$3,All!$B$3:$B$100,0)),,COLUMNS($A$1:B3)+7+(ROWS($A$1:B3)-1)*3)","v":"A2"},{"$f":"IF(OFFSET(INDEX(All!$C$3:$C$100,MATCH($C$3,All!$B$3:$B$100,0)),,COLUMNS($A$1:C3)+7+(ROWS($A$1:C3)-1)*3)=0,\"\",OFFSET(INDEX(All!$C$3:$C$100,MATCH($C$3,All!$B$3:$B$100,0)),,COLUMNS($A$1:C3)+7+(ROWS($A$1:C3)-1)*3))","v":"2020-06-11"}]
[null,"نوع السداد",{"$f":"OFFSET(INDEX(All!$C$3:$C$100,MATCH($C$3,All!$B$3:$B$100,0)),,ROWS($A$1:A2))","v":"تقسيط"},null,4,{"$f":"OFFSET(INDEX(All!$C$3:$C$100,MATCH($C$3,All!$B$3:$B$100,0)),,COLUMNS($A$1:A4)+7+(ROWS($A$1:A4)-1)*3)","v":"A4"},{"$f":"OFFSET(INDEX(All!$C$3:$C$100,MATCH($C$3,All!$B$3:$B$100,0)),,COLUMNS($A$1:B4)+7+(ROWS($A$1:B4)-1)*3)","v":"A5"},{"$f":"IF(OFFSET(INDEX(All!$C$3:$C$100,MATCH($C$3,All!$B$3:$B$100,0)),,COLUMNS($A$1:C4)+7+(ROWS($A$1:C4)-1)*3)=0,\"\",OFFSET(INDEX(All!$C$3:$C$100,MATCH($C$3,All!$B$3:$B$100,0)),,COLUMNS($A$1:C4)+7+(ROWS($A$1:C4)-1)*3))","v":"A6"}]
[null,"المديونية الاساسية",{"$f":"OFFSET(INDEX(All!$C$3:$C$100,MATCH($C$3,All!$B$3:$B$100,0)),,ROWS($A$1:A3))","v":130000},null,5,{"$f":"OFFSET(INDEX(All!$C$3:$C$100,MATCH($C$3,All!$B$3:$B$100,0)),,COLUMNS($A$1:A5)+7+(ROWS($A$1:A5)-1)*3)","v":"A7"},{"$f":"OFFSET(INDEX(All!$C$3:$C$100,MATCH($C$3,All!$B$3:$B$100,0)),,COLUMNS($A$1:B5)+7+(ROWS($A$1:B5)-1)*3)","v":"A8"},{"$f":"IF(OFFSET(INDEX(All!$C$3:$C$100,MATCH($C$3,All!$B$3:$B$100,0)),,COLUMNS($A$1:C5)+7+(ROWS($A$1:C5)-1)*3)=0,\"\",OFFSET(INDEX(All!$C$3:$C$100,MATCH($C$3,All!$B$3:$B$100,0)),,COLUMNS($A$1:C5)+7+(ROWS($A$1:C5)-1)*3))","v":"A9"}]
[null,"خصم إلتزام السداد",{"$f":"OFFSET(INDEX(All!$C$3:$C$100,MATCH($C$3,All!$B$3:$B$100,0)),,ROWS($A$1:A4))","v":30000},null,6,{"$f":"OFFSET(INDEX(All!$C$3:$C$100,MATCH($C$3,All!$B$3:$B$100,0)),,COLUMNS($A$1:A6)+7+(ROWS($A$1:A6)-1)*3)","v":"A10"},{"$f":"OFFSET(INDEX(All!$C$3:$C$100,MATCH($C$3,All!$B$3:$B$100,0)),,COLUMNS($A$1:B6)+7+(ROWS($A$1:B6)-1)*3)","v":"A11"},{"$f":"IF(OFFSET(INDEX(All!$C$3:$C$100,MATCH($C$3,All!$B$3:$B$100,0)),,COLUMNS($A$1:C6)+7+(ROWS($A$1:C6)-1)*3)=0,\"\",OFFSET(INDEX(All!$C$3:$C$100,MATCH($C$3,All!$B$3:$B$100,0)),,COLUMNS($A$1:C6)+7+(ROWS($A$1:C6)-1)*3))","v":"A12"}]
[null,"المديونية في حالة إلتزام السداد",{"$f":"OFFSET(INDEX(All!$C$3:$C$100,MATCH($C$3,All!$B$3:$B$100,0)),,ROWS($A$1:A5))","v":100000},null,7,{"$f":"OFFSET(INDEX(All!$C$3:$C$100,MATCH($C$3,All!$B$3:$B$100,0)),,COLUMNS($A$1:A7)+7+(ROWS($A$1:A7)-1)*3)","v":"A13"},{"$f":"OFFSET(INDEX(All!$C$3:$C$100,MATCH($C$3,All!$B$3:$B$100,0)),,COLUMNS($A$1:B7)+7+(ROWS($A$1:B7)-1)*3)","v":"A14"},{"$f":"IF(OFFSET(INDEX(All!$C$3:$C$100,MATCH($C$3,All!$B$3:$B$100,0)),,COLUMNS($A$1:C7)+7+(ROWS($A$1:C7)-1)*3)=0,\"\",OFFSET(INDEX(All!$C$3:$C$100,MATCH($C$3,All!$B$3:$B$100,0)),,COLUMNS($A$1:C7)+7+(ROWS($A$1:C7)-1)*3))","v":"A15"}]
[null,"عدد الاقسام",{"$f":"OFFSET(INDEX(All!$C$3:$C$100,MATCH($C$3,All!$B$3:$B$100,0)),,ROWS($A$1:A6))","v":10},null,8,{"$f":"OFFSET(INDEX(All!$C$3:$C$100,MATCH($C$3,All!$B$3:$B$100,0)),,COLUMNS($A$1:A8)+7+(ROWS($A$1:A8)-1)*3)","v":"A16"},{"$f":"OFFSET(INDEX(All!$C$3:$C$100,MATCH($C$3,All!$B$3:$B$100,0)),,COLUMNS($A$1:B8)+7+(ROWS($A$1:B8)-1)*3)","v":"A17"},{"$f":"IF(OFFSET(INDEX(All!$C$3:$C$100,MATCH($C$3,All!$B$3:$B$100,0)),,COLUMNS($A$1:C8)+7+(ROWS($A$1:C8)-1)*3)=0,\"\",OFFSET(INDEX(All!$C$3:$C$100,MATCH($C$3,All!$B$3:$B$100,0)),,COLUMNS($A$1:C8)+7+(ROWS($A$1:C8)-1)*3))","v":"A18"}]
[null,"بداية السداد / تاريخ السداد",{"$f":"OFFSET(INDEX(All!$C$3:$C$100,MATCH($C$3,All!$B$3:$B$100,0)),,ROWS($A$1:A7))","v":43976},null,9,{"$f":"OFFSET(INDEX(All!$C$3:$C$100,MATCH($C$3,All!$B$3:$B$100,0)),,COLUMNS($A$1:A9)+7+(ROWS($A$1:A9)-1)*3)","v":"A19"},{"$f":"OFFSET(INDEX(All!$C$3:$C$100,MATCH($C$3,All!$B$3:$B$100,0)),,COLUMNS($A$1:B9)+7+(ROWS($A$1:B9)-1)*3)","v":"A20"},{"$f":"IF(OFFSET(INDEX(All!$C$3:$C$100,MATCH($C$3,All!$B$3:$B$100,0)),,COLUMNS($A$1:C9)+7+(ROWS($A$1:C9)-1)*3)=0,\"\",OFFSET(INDEX(All!$C$3:$C$100,MATCH($C$3,All!$B$3:$B$100,0)),,COLUMNS($A$1:C9)+7+(ROWS($A$1:C9)-1)*3))","v":"A21"}]
[null,null,null,null,10,{"$f":"OFFSET(INDEX(All!$C$3:$C$100,MATCH($C$3,All!$B$3:$B$100,0)),,COLUMNS($A$1:A10)+7+(ROWS($A$1:A10)-1)*3)","v":"A22"},{"$f":"OFFSET(INDEX(All!$C$3:$C$100,MATCH($C$3,All!$B$3:$B$100,0)),,COLUMNS($A$1:B10)+7+(ROWS($A$1:B10)-1)*3)","v":"A23"},{"$f":"IF(OFFSET(INDEX(All!$C$3:$C$100,MATCH($C$3,All!$B$3:$B$100,0)),,COLUMNS($A$1:C10)+7+(ROWS($A$1:C10)-1)*3)=0,\"\",OFFSET(INDEX(All!$C$3:$C$100,MATCH($C$3,All!$B$3:$B$100,0)),,COLUMNS($A$1:C10)+7+(ROWS($A$1:C10)-1)*3))","v":"A24"}]
[null,{"$f":"B11","v":"المديونية في حالة إلتزام السداد"},{"$f":"OFFSET(INDEX(All!$C$3:$C$100,MATCH($C$3,All!$B$3:$B$100,0)),,6)","v":10},null,11,{"$f":"OFFSET(INDEX(All!$C$3:$C$100,MATCH($C$3,All!$B$3:$B$100,0)),,COLUMNS($A$1:A11)+7+(ROWS($A$1:A11)-1)*3)","v":"A25"},{"$f":"OFFSET(INDEX(All!$C$3:$C$100,MATCH($C$3,All!$B$3:$B$100,0)),,COLUMNS($A$1:B11)+7+(ROWS($A$1:B11)-1)*3)","v":"A26"},{"$f":"IF(OFFSET(INDEX(All!$C$3:$C$100,MATCH($C$3,All!$B$3:$B$100,0)),,COLUMNS($A$1:C11)+7+(ROWS($A$1:C11)-1)*3)=0,\"\",OFFSET(INDEX(All!$C$3:$C$100,MATCH($C$3,All!$B$3:$B$100,0)),,COLUMNS($A$1:C11)+7+(ROWS($A$1:C11)-1)*3))","v":"A27"}]
[null,null,null,null,12,{"$f":"OFFSET(INDEX(All!$C$3:$C$100,MATCH($C$3,All!$B$3:$B$100,0)),,COLUMNS($A$1:A12)+7+(ROWS($A$1:A12)-1)*3)","v":"A28"},{"$f":"OFFSET(INDEX(All!$C$3:$C$100,MATCH($C$3,All!$B$3:$B$100,0)),,COLUMNS($A$1:B12)+7+(ROWS($A$1:B12)-1)*3)","v":"A29"},{"$f":"IF(OFFSET(INDEX(All!$C$3:$C$100,MATCH($C$3,All!$B$3:$B$100,0)),,COLUMNS($A$1:C12)+7+(ROWS($A$1:C12)-1)*3)=0,\"\",OFFSET(INDEX(All!$C$3:$C$100,MATCH($C$3,All!$B$3:$B$100,0)),,COLUMNS($A$1:C12)+7+(ROWS($A$1:C12)-1)*3))","v":"A30"}]
[]
[null,null,null,null,"المحصل",null,{"$f":"OFFSET(INDEX(All!$C$3:$C$100,MATCH($C$3,All!$B$3:$B$100,0)),,47)","v":2035}]
[null,null,null,null,"رصيد باقي المديونية بدون خصم",null,{"$f":"OFFSET(INDEX(All!$C$3:$C$100,MATCH($C$3,All!$B$3:$B$100,0)),,48)","v":127965}]
[null,null,null,null,"رصيد باقي المديونية معمد الخصم",null,{"$f":"OFFSET(INDEX(All!$C$3:$C$100,MATCH($C$3,All!$B$3:$B$100,0)),,49)","v":97965}]
[]
[null,"الملاحظات"]