{"text_format":"1","workbook":"xlsx","n_sheets":3,"sheets":["Minho","Laho","Repport"],"not_rendered":{"charts":0,"images":0,"macros":1,"external_links":0,"defined_names":0,"comments":0,"pivot_tables":0},"unopened":[],"bounds":{"document_bytes":16777216,"sheet_cells":100000,"rows_first":2000,"rows_last":500,"rows_between":2000,"halvings":0,"cell_chars":16384,"cell_head_chars":4096},"cells_cut":0,"cells_raw":0,"read":"whole","date_system":"1900"}

{"sheet":"Minho","index":0,"n_rows":59,"n_cols":27,"rows_kept":59,"cut":false,"hidden":false,"merged":[]}
["التاريخ","الاسم","رقم","tamn","moha","noon","saso","zin","ayad","ali","momo","salim","kamal","hoda","dodo","magd","bosy","zoao","sony","tosh","nofa","raoo","lolo","lmya","mmm","nnnn","Adel"]
["2020-05-15","اسر السيد",100,1,5,3,1,1,1,1,1,1,1,1,1,1,1,1,1,1,1,1,1,1,1,1,1]
["2020-05-16","مدحت صالح",200,1,5,3,1,1,1,1,1,1,1,1,1,1,1,1,1,1,1,1,1,1,1,1,1]
["2020-05-30",null,null,1.5,5,3,1,1,1,1,1,1,1,1,1,1,1,1,1,1,1,1,1,1,1,1,1]
["2020-05-18",null,null,1,5,3,1,1,1,1,1,1,1,1,1,1,1,1,1,1,1,1,1,1,1,1,1]
["2020-05-19",null,null,1,5,3,1,1,1,1,1,1,1,1,1,1,1,1,1,1,1,1,1,1,1,1,1]
["2020-05-20",null,null,1,5,3,1,1,1,1,1,1,1,1,1,1,1,1,1,1,1,1,1,1,1,1,1]
["2020-05-27",null,null,1,5,3,1,1,1,1,1,1,1,1,1,1,1,1,1,1,1,1,1,1,1,1,1]
["2020-05-22",null,null,1,5,3,1,1,1,1,1,1,1,1,1,1,1,1,1,1,1,1,1,1,1,1,1]
["2020-05-23",null,null,1,5,3,1,1,1,1,1,1,1,1,1,1,1,1,1,1,1,1,1,1,1,1,1]
["2020-05-24",null,null,1,5,3,1,1,1,1,1,1,1,1,1,1,1,1,1,1,1,1,1,1,1,1,1]
["2020-05-25",null,null,1,5,3,1,1,1,1,1,1,1,1,1,1,1,1,1,1,1,1,1,1,1,1,1]
["2020-05-26",null,null,1,5,3,1,1,1,1,1,1,1,1,1,1,1,1,1,1,1,1,1,1,1,1,1]
["2020-05-27",null,null,1,5,3,1,1,1,1,1,1,1,1,1,1,1,1,1,1,1,1,1,1,1,1,1]
["2020-05-24",null,null,15,5,3,1,1,1,1,1,1,1,1,1,1,1,1,1,1,1,1,1,1,1,1,1]
["2020-05-29",null,null,1,5,3,1,1,1,1,1,1,1,1,1,1,1,1,1,1,1,1,1,1,1,1,1]
["2020-05-30",null,null,1,5,3,1,1,1,1,1,1,1,1,1,1,1,1,1,1,1,1,1,1,1,1,1]
["2020-05-31",null,null,1,5,3,1,1,1,1,1,1,1,1,1,1,1,1,1,1,1,1,1,1,1,1,1]
["2020-06-01",null,null,1,5,3,1,1,1,1,1,1,1,1,1,1,1,1,1,1,1,1,1,1,1,1,1]
["2020-06-02",null,null,1,5,3,1,1,1,1,1,1,1,1,1,1,1,1,1,1,1,1,1,1,1,1,1]
["2020-06-03",null,null,1,5,3,1,1,1,1,1,1,1,1,1,1,1,1,1,1,1,1,1,1,1,1,1]
["2020-06-04",null,null,1,5,3,1,1,1,1,1,1,1,1,1,1,1,1,1,1,1,1,1,1,1,1,1]
["2020-06-05",null,null,1,5,3,1,1,1,1,1,1,1,1,1,1,1,1,1,1,1,1,1,1,1,1,1]
["2020-06-06",null,null,1,5,3,1,1,1,1,1,1,1,1,1,1,1,1,1,1,1,1,1,1,1,1,1]
["2020-06-07",null,null,1,5,3,1,1,1,1,1,1,1,1,1,1,1,1,1,1,1,1,1,1,1,1,1]
["2020-06-08",null,null,1,5,3,1,1,1,1,1,1,1,1,1,1,1,1,1,1,1,1,1,1,1,1,1]
["2020-06-09",null,null,1,5,3,1,1,1,1,1,1,1,1,1,1,1,1,1,1,1,1,1,1,1,1,1]
["2020-06-10",null,null,1,5,3,1,1,1,1,1,1,1,1,1,1,1,1,1,1,1,1,1,1,1,1,1]
["2020-06-11",null,null,1,5,3,1,1,1,1,1,1,1,1,1,1,1,1,1,1,1,1,1,1,1,1,1]
["2020-06-12",null,null,1,5,3,1,1,1,1,1,1,1,1,1,1,1,1,1,1,1,1,1,1,1,1,1]
["2020-06-13",null,null,1,5,3,1,1,1,1,1,1,1,1,1,1,1,1,1,1,1,1,1,1,1,1,1]
["2020-06-14",null,null,1,5,3,1,1,1,1,1,1,1,1,1,1,1,1,1,1,1,1,1,1,1,1,1]
["2020-06-15",null,null,1,5,3,1,1,1,1,1,1,1,1,1,1,1,1,1,1,1,1,1,1,1,1,1]
["2020-06-16",null,null,1,5,3,1,1,1,1,1,1,1,1,1,1,1,1,1,1,1,1,1,1,1,1,1]
["2020-06-17",null,null,1,5,3,1,1,1,1,1,1,1,1,1,1,1,1,1,1,1,1,1,1,1,1,1]
["2020-06-18",null,null,1,5,3,1,1,1,1,1,1,1,1,1,1,1,1,1,1,1,1,1,1,1,1,1]
["2020-06-19",null,null,1,5,3,1,1,1,1,1,1,1,1,1,1,1,1,1,1,1,1,1,1,1,1,1]
["2020-06-20",null,null,1,5,3,1,1,1,1,1,1,1,1,1,1,1,1,1,1,1,1,1,1,1,1,1]
["2020-06-21",null,null,1,5,3,1,1,1,1,1,1,1,1,1,1,1,1,1,1,1,1,1,1,1,1,1]
["2020-06-22",null,null,1,5,3,1,1,1,1,1,1,1,1,1,1,1,1,1,1,1,1,1,1,1,1,1]
["2020-06-23",null,null,1,5,3,1,1,1,1,1,1,1,1,1,1,1,1,1,1,1,1,1,1,1,1,1]
["2020-06-24",null,null,1,5,3,1,1,1,1,1,1,1,1,1,1,1,1,1,1,1,1,1,1,1,1,1]
["2020-06-25",null,null,1,5,3,1,1,1,1,1,1,1,1,1,1,1,1,1,1,1,1,1,1,1,1,1]
["2020-06-26",null,null,1,5,3,1,1,1,1,1,1,1,1,1,1,1,1,1,1,1,1,1,1,1,1,1]
["2020-06-27",null,null,1,5,3,1,1,1,1,1,1,1,1,1,1,1,1,1,1,1,1,1,1,1,1,1]
["2020-06-28",null,null,1,5,3,1,1,1,1,1,1,1,1,1,1,1,1,1,1,1,1,1,1,1,1,1]
["2020-06-29",null,null,1,5,3,1,1,1,1,1,1,1,1,1,1,1,1,1,1,1,1,1,1,1,1,1]
["2020-06-30",null,null,1,5,3,1,1,1,1,1,1,1,1,1,1,1,1,1,1,1,1,1,1,1,1,1]
["2020-07-01",null,null,1,5,3,1,1,1,1,1,1,1,1,1,1,1,1,1,1,1,1,1,1,1,1,1]
["2020-07-02",null,null,1,5,3,1,1,1,1,1,1,1,1,1,1,1,1,1,1,1,1,1,1,1,1,1]
["2020-07-03",null,null,1,5,3,1,1,1,1,1,1,1,1,1,1,1,1,1,1,1,1,1,1,1,1,1]
["2020-07-04",null,null,1,5,3,1,1,1,1,1,1,1,1,1,1,1,1,1,1,1,1,1,1,1,1,1]
["2020-07-05",null,null,1,5,3,1,1,1,1,1,1,1,1,1,1,1,1,1,1,1,1,1,1,1,1,1]
["2020-07-06",null,null,1,5,3,1,1,1,1,1,1,1,1,1,1,1,1,1,1,1,1,1,1,1,1,1]
["2020-07-07",null,null,1,5,3,1,1,1,1,1,1,1,1,1,1,1,1,1,1,1,1,1,1,1,1,1]
["2020-07-08",null,null,1,5,3,1,1,1,1,1,1,1,1,1,1,1,1,1,1,1,1,1,1,1,1,1]
[]
[null,null,null,null,{"$f":"MIN(A2:A56)","v":"2020-05-15"}]
[null,null,null,null,{"$f":"MAX(A2:A56)","v":"2020-07-08"}]

{"sheet":"Laho","index":1,"n_rows":87,"n_cols":27,"rows_kept":87,"cut":false,"hidden":false,"merged":[]}
["التاريخ","الاسم","رقم","tamn","moha","noon","saso","zin","ayad","ali","momo","salim","kamal","hoda","dodo","magd","bosy","zoao","sony","tosh","nofa","raoo","lolo","lmya","mmm","nnnn","Adel"]
["2020-05-15","اسر السيد",100,2,5,10,10,10,10,10,10,10,10,10,10,10,10,10,10,10,10,10,10,10,10,10,10]
["2020-05-16","مدحت صالح",200,2,6,10,10,10,10,10,10,10,10,10,10,10,10,10,10,10,10,10,10,10,10,10,10]
["2020-05-17",null,null,2,7,10,10,10,10,10,10,10,10,10,10,10,10,10,10,10,10,10,10,10,10,10,10]
["2020-05-18",null,null,2,8,10,10,10,10,10,10,10,10,10,10,10,10,10,10,10,10,10,10,10,10,10,10]
["2020-05-19",null,null,2,9,10,10,10,10,10,10,10,10,10,10,10,10,10,10,10,10,10,10,10,10,10,10]
["2020-05-20",null,null,2,10,10,10,10,10,10,10,10,10,10,10,10,10,10,10,10,10,10,10,10,10,10,10]
["2020-05-03",null,null,2,11,10,10,10,10,10,10,10,10,10,10,10,10,10,10,10,10,10,10,10,10,10,10]
["2020-05-22",null,null,2,12,10,10,10,10,10,10,10,10,10,10,10,10,10,10,10,10,10,10,10,10,10,10]
["2020-05-23",null,null,2,13,10,10,10,10,10,10,10,10,10,10,10,10,10,10,10,10,10,10,10,10,10,10]
["2020-05-24",null,null,2,14,10,10,10,10,10,10,10,10,10,10,10,10,10,10,10,10,10,10,10,10,10,10]
["2020-05-25",null,null,2,15,10,10,10,10,10,10,10,10,10,10,10,10,10,10,10,10,10,10,10,10,10,10]
["2020-05-26",null,null,2,16,10,10,10,10,10,10,10,10,10,10,10,10,10,10,10,10,10,10,10,10,10,10]
["2020-05-27",null,null,2,17,10,10,10,10,10,10,10,10,10,10,10,10,10,10,10,10,10,10,10,10,10,10]
["2020-05-28",null,null,2,18,10,10,10,10,10,10,10,10,10,10,10,10,10,10,10,10,10,10,10,10,10,10]
["2020-05-29",null,null,2,19,10,10,10,10,10,10,10,10,10,10,10,10,10,10,10,10,10,10,10,10,10,10]
["2020-05-30",null,null,2,20,10,10,10,10,10,10,10,10,10,10,10,10,10,10,10,10,10,10,10,10,10,10]
["2020-05-20",null,null,2,10,10,10,10,10,10,10,10,10,10,10,10,10,10,10,10,10,10,10,10,10,10,10]
["2020-06-01",null,null,2,10,10,10,10,10,10,10,10,10,10,10,10,10,10,10,10,10,10,10,10,10,10,10]
["2020-06-02",null,null,2,10,10,10,10,10,10,10,10,10,10,10,10,10,10,10,10,10,10,10,10,10,10,10]
["2020-06-03",null,null,2,10,10,10,10,10,10,10,10,10,10,10,10,10,10,10,10,10,10,10,10,10,10,10]
["2020-06-04",null,null,2,10,10,10,10,10,10,10,10,10,10,10,10,10,10,10,10,10,10,10,10,10,10,10]
["2020-06-05",null,null,2,10,10,10,10,10,10,10,10,10,10,10,10,10,10,10,10,10,10,10,10,10,10,10]
["2020-06-06",null,null,2,10,10,10,10,10,10,10,10,10,10,10,10,10,10,10,10,10,10,10,10,10,10,10]
["2020-05-18",null,null,2,10,10,10,10,10,10,10,10,10,10,10,10,10,10,10,10,10,10,10,10,10,10,10]
["2020-06-08",null,null,2,10,10,10,10,10,10,10,10,10,10,10,10,10,10,10,10,10,10,10,10,10,10,10]
["2020-06-09",null,null,2,10,10,10,10,10,10,10,10,10,10,10,10,10,10,10,10,10,10,10,10,10,10,10]
["2020-06-10",null,null,2,10,10,10,10,10,10,10,10,10,10,10,10,10,10,10,10,10,10,10,10,10,10,10]
["2020-06-11",null,null,2,10,10,10,10,10,10,10,10,10,10,10,10,10,10,10,10,10,10,10,10,10,10,10]
["2020-06-12",null,null,2,10,10,10,10,10,10,10,10,10,10,10,10,10,10,10,10,10,10,10,10,10,10,10]
["2020-06-13",null,null,2,10,10,10,10,10,10,10,10,10,10,10,10,10,10,10,10,10,10,10,10,10,10,10]
["2020-06-14",null,null,2,10,10,10,10,10,10,10,10,10,10,10,10,10,10,10,10,10,10,10,10,10,10,10]
["2020-06-15",null,null,2,10,10,10,10,10,10,10,10,10,10,10,10,10,10,10,10,10,10,10,10,10,10,10]
["2020-06-16",null,null,2,10,10,10,10,10,10,10,10,10,10,10,10,10,10,10,10,10,10,10,10,10,10,10]
["2020-06-17",null,null,2,10,10,10,10,10,10,10,10,10,10,10,10,10,10,10,10,10,10,10,10,10,10,10]
["2020-06-18",null,null,2,10,10,10,10,10,10,10,10,10,10,10,10,10,10,10,10,10,10,10,10,10,10,10]
["2020-06-19",null,null,2,10,10,10,10,10,10,10,10,10,10,10,10,10,10,10,10,10,10,10,10,10,10,10]
["2020-06-20",null,null,2,10,10,10,10,10,10,10,10,10,10,10,10,10,10,10,10,10,10,10,10,10,10,10]
["2020-06-21",null,null,2,10,10,10,10,10,10,10,10,10,10,10,10,10,10,10,10,10,10,10,10,10,10,10]
["2020-06-22",null,null,2,10,10,10,10,10,10,10,10,10,10,10,10,10,10,10,10,10,10,10,10,10,10,10]
["2020-06-23",null,null,2,10,10,10,10,10,10,10,10,10,10,10,10,10,10,10,10,10,10,10,10,10,10,10]
["2020-06-24",null,null,2,10,10,10,10,10,10,10,10,10,10,10,10,10,10,10,10,10,10,10,10,10,10,10]
["2020-06-25",null,null,2,10,10,10,10,10,10,10,10,10,10,10,10,10,10,10,10,10,10,10,10,10,10,10]
["2020-06-26",null,null,2,10,10,10,10,10,10,10,10,10,10,10,10,10,10,10,10,10,10,10,10,10,10,10]
["2020-06-27",null,null,2,10,10,10,10,10,10,10,10,10,10,10,10,10,10,10,10,10,10,10,10,10,10,10]
["2020-06-28",null,null,2,10,10,10,10,10,10,10,10,10,10,10,10,10,10,10,10,10,10,10,10,10,10,10]
["2020-06-29",null,null,2,10,10,10,10,10,10,10,10,10,10,10,10,10,10,10,10,10,10,10,10,10,10,10]
["2020-06-30",null,null,2,10,10,10,10,10,10,10,10,10,10,10,10,10,10,10,10,10,10,10,10,10,10,10]
["2020-07-01",null,null,2,10,10,10,10,10,10,10,10,10,10,10,10,10,10,10,10,10,10,10,10,10,10,10]
["2020-07-02",null,null,2,10,10,10,10,10,10,10,10,10,10,10,10,10,10,10,10,10,10,10,10,10,10,10]
["2020-07-03",null,null,2,10,10,10,10,10,10,10,10,10,10,10,10,10,10,10,10,10,10,10,10,10,10,10]
["2020-07-04",null,null,2,10,10,10,10,10,10,10,10,10,10,10,10,10,10,10,10,10,10,10,10,10,10,10]
["2020-07-05",null,null,2,10,10,10,10,10,10,10,10,10,10,10,10,10,10,10,10,10,10,10,10,10,10,10]
["2020-07-06",null,null,2,10,10,10,10,10,10,10,10,10,10,10,10,10,10,10,10,10,10,10,10,10,10,10]
["2020-07-07",null,null,2,10,10,10,10,10,10,10,10,10,10,10,10,10,10,10,10,10,10,10,10,10,10,10]
["2020-07-08",null,null,2,10,10,10,10,10,10,10,10,10,10,10,10,10,10,10,10,10,10,10,10,10,10,10]
["2020-07-09",null,null,null,null,null,null,null,null,null,null,10,10,10,10,10,10,10,10,10,10,10,10,10,10,10,10]
["2020-07-10",null,null,null,null,null,null,null,null,null,null,10,10,10,10,10,10,10,10,10,10,10,10,10,10,10,10]
["2020-07-11",null,null,null,null,null,null,null,null,null,null,10,10,10,10,10,10,10,10,10,10,10,10,10,10,10,10]
["2020-07-12",null,null,null,null,null,null,null,null,null,null,10,10,10,10,10,10,10,10,10,10,10,10,10,10,10,10]
["2020-07-13",null,null,null,null,null,null,null,null,null,null,10,10,10,10,10,10,10,10,10,10,10,10,10,10,10,10]
["2020-07-14",null,null,null,null,null,null,null,null,null,null,10,10,10,10,10,10,10,10,10,10,10,10,10,10,10,10]
["2020-07-15",null,null,null,null,null,null,null,null,null,null,10,10,10,10,10,10,10,10,10,10,10,10,10,10,10,10]
["2020-07-16",null,null,null,null,null,null,null,null,null,null,10,10,10,10,10,10,10,10,10,10,10,10,10,10,10,10]
["2020-07-17",null,null,null,null,null,null,null,null,null,null,10,10,10,10,10,10,10,10,10,10,10,10,10,10,10,10]
["2020-07-18",null,null,null,null,null,null,null,null,null,null,10,10,10,10,10,10,10,10,10,10,10,10,10,10,10,10]
["2020-07-19",null,null,null,null,null,null,null,null,null,null,10,10,10,10,10,10,10,10,10,10,10,10,10,10,10,10]
["2020-07-20",null,null,null,null,null,null,null,null,null,null,10,10,10,10,10,10,10,10,10,10,10,10,10,10,10,10]
["2020-07-21",null,null,null,null,null,null,null,null,null,null,10,10,10,10,10,10,10,10,10,10,10,10,10,10,10,10]
["2020-07-22",null,null,null,null,null,null,null,null,null,null,10,10,10,10,10,10,10,10,10,10,10,10,10,10,10,10]
["2020-07-23",null,null,null,null,null,null,null,null,null,null,10,10,10,10,10,10,10,10,10,10,10,10,10,10,10,10]
["2020-07-24",null,null,null,null,null,null,null,null,null,null,10,10,10,10,10,10,10,10,10,10,10,10,10,10,10,10]
["2020-07-25",null,null,null,null,null,null,null,null,null,null,10,10,10,10,10,10,10,10,10,10,10,10,10,10,10,10]
["2020-07-26",null,null,null,null,null,null,null,null,null,null,10,10,10,10,10,10,10,10,10,10,10,10,10,10,10,10]
["2020-07-27",null,null,null,null,null,null,null,null,null,null,10,10,10,10,10,10,10,10,10,10,10,10,10,10,10,10]
["2020-07-28"]
["2020-07-29"]
["2020-07-30"]
["2020-07-31"]
["2020-08-01"]
["2020-08-02"]
["2020-08-03"]
["2020-08-04"]
["2020-08-05"]
["2020-08-06"]
["2020-08-07"]
["2020-08-08"]

{"sheet":"Repport","index":2,"n_rows":34,"n_cols":9,"rows_kept":34,"cut":false,"hidden":false,"merged":[[25,4,25,5]]}
["أسماء الاعمدة في\n منه وله هي نفسها",null,"منه","له","التاريخ من","حتى تاريخ"]
[null,null,null,null,"2020-05-15","2020-05-25"]
["tamn",null,{"$f":"SUM((Minho!$A$2:$A$1000>=$E$2)*(Minho!$A$2:$A$1000<=$F$2)*(INDIRECT(\"Minho!\"&ADDRESS(2,(MATCH($A3,Minho!$A$1:$AA$1)),1)&\":\"&ADDRESS(1000,(MATCH($A3,Minho!$A$1:$AA$1)),1))))","v":10},{"$f":"SUM((Laho!$A$2:$A$1000>=$E$2)*(Laho!$A$2:$A$1000<=$F$2)*(INDIRECT(\"Laho!\"&ADDRESS(2,(MATCH($A3,Laho!$A$1:$AA$1,0)),1)&\":\"&ADDRESS(1000,(MATCH($A3,Laho!$A$1:$AA$1,0)),1))))","v":24},"هذه المعادلات تنفذ المطلوب لكل التواريخ"]
["moha",null,{"$f":"SUM((Minho!$A$2:$A$1000>=$E$2)*(Minho!$A$2:$A$1000<=$F$2)*(INDIRECT(\"Minho!\"&ADDRESS(2,(MATCH($A4,Minho!$A$1:$AA$1)),1)&\":\"&ADDRESS(1000,(MATCH($A4,Minho!$A$1:$AA$1)),1))))","v":10},{"$f":"SUM((Laho!$A$2:$A$1000>=$E$2)*(Laho!$A$2:$A$1000<=$F$2)*(INDIRECT(\"Laho!\"&ADDRESS(2,(MATCH($A4,Laho!$A$1:$AA$1,0)),1)&\":\"&ADDRESS(1000,(MATCH($A4,Laho!$A$1:$AA$1,0)),1))))","v":119},"اريد تنفيذ ما تقوم به المعادلات بناء على التاريخ "]
["noon",null,{"$f":"SUM((Minho!$A$2:$A$1000>=$E$2)*(Minho!$A$2:$A$1000<=$F$2)*(INDIRECT(\"Minho!\"&ADDRESS(2,(MATCH($A5,Minho!$A$1:$AA$1)),1)&\":\"&ADDRESS(1000,(MATCH($A5,Minho!$A$1:$AA$1)),1))))","v":10},{"$f":"SUM((Laho!$A$2:$A$1000>=$E$2)*(Laho!$A$2:$A$1000<=$F$2)*(INDIRECT(\"Laho!\"&ADDRESS(2,(MATCH($A5,Laho!$A$1:$AA$1,0)),1)&\":\"&ADDRESS(1000,(MATCH($A5,Laho!$A$1:$AA$1,0)),1))))","v":120},"بنفس هذا الشكل للتقرير "]
["saso",null,{"$f":"SUM((Minho!$A$2:$A$1000>=$E$2)*(Minho!$A$2:$A$1000<=$F$2)*(INDIRECT(\"Minho!\"&ADDRESS(2,(MATCH($A6,Minho!$A$1:$AA$1)),1)&\":\"&ADDRESS(1000,(MATCH($A6,Minho!$A$1:$AA$1)),1))))","v":10},{"$f":"SUM((Laho!$A$2:$A$1000>=$E$2)*(Laho!$A$2:$A$1000<=$F$2)*(INDIRECT(\"Laho!\"&ADDRESS(2,(MATCH($A6,Laho!$A$1:$AA$1,0)),1)&\":\"&ADDRESS(1000,(MATCH($A6,Laho!$A$1:$AA$1,0)),1))))","v":120},"أسماء الاعمدة ثابتة "]
["zin",null,{"$f":"SUM((Minho!$A$2:$A$1000>=$E$2)*(Minho!$A$2:$A$1000<=$F$2)*(INDIRECT(\"Minho!\"&ADDRESS(2,(MATCH($A7,Minho!$A$1:$AA$1)),1)&\":\"&ADDRESS(1000,(MATCH($A7,Minho!$A$1:$AA$1)),1))))","v":10},{"$f":"SUM((Laho!$A$2:$A$1000>=$E$2)*(Laho!$A$2:$A$1000<=$F$2)*(INDIRECT(\"Laho!\"&ADDRESS(2,(MATCH($A7,Laho!$A$1:$AA$1,0)),1)&\":\"&ADDRESS(1000,(MATCH($A7,Laho!$A$1:$AA$1,0)),1))))","v":120}]
["ayad",null,{"$f":"SUM((Minho!$A$2:$A$1000>=$E$2)*(Minho!$A$2:$A$1000<=$F$2)*(INDIRECT(\"Minho!\"&ADDRESS(2,(MATCH($A8,Minho!$A$1:$AA$1,0)),1)&\":\"&ADDRESS(1000,(MATCH($A8,Minho!$A$1:$AA$1,0)),1))))","v":10},{"$f":"SUM((Laho!$A$2:$A$1000>=$E$2)*(Laho!$A$2:$A$1000<=$F$2)*(INDIRECT(\"Laho!\"&ADDRESS(2,(MATCH($A8,Laho!$A$1:$AA$1,0)),1)&\":\"&ADDRESS(1000,(MATCH($A8,Laho!$A$1:$AA$1,0)),1))))","v":120}]
["ali",null,{"$f":"SUM((Minho!$A$2:$A$1000>=$E$2)*(Minho!$A$2:$A$1000<=$F$2)*(INDIRECT(\"Minho!\"&ADDRESS(2,(MATCH($A9,Minho!$A$1:$AA$1,0)),1)&\":\"&ADDRESS(1000,(MATCH($A9,Minho!$A$1:$AA$1,0)),1))))","v":10},{"$f":"SUM((Laho!$A$2:$A$1000>=$E$2)*(Laho!$A$2:$A$1000<=$F$2)*(INDIRECT(\"Laho!\"&ADDRESS(2,(MATCH($A9,Laho!$A$1:$AA$1,0)),1)&\":\"&ADDRESS(1000,(MATCH($A9,Laho!$A$1:$AA$1,0)),1))))","v":120}]
["momo",null,{"$f":"SUM((Minho!$A$2:$A$1000>=$E$2)*(Minho!$A$2:$A$1000<=$F$2)*(INDIRECT(\"Minho!\"&ADDRESS(2,(MATCH($A10,Minho!$A$1:$AA$1,0)),1)&\":\"&ADDRESS(1000,(MATCH($A10,Minho!$A$1:$AA$1,0)),1))))","v":10},{"$f":"SUM((Laho!$A$2:$A$1000>=$E$2)*(Laho!$A$2:$A$1000<=$F$2)*(INDIRECT(\"Laho!\"&ADDRESS(2,(MATCH($A10,Laho!$A$1:$AA$1,0)),1)&\":\"&ADDRESS(1000,(MATCH($A10,Laho!$A$1:$AA$1,0)),1))))","v":120}]
["tamn",null,{"$f":"SUM((Minho!$A$2:$A$1000>=$E$2)*(Minho!$A$2:$A$1000<=$F$2)*(INDIRECT(\"Minho!\"&ADDRESS(2,(MATCH($A11,Minho!$A$1:$AA$1,0)),1)&\":\"&ADDRESS(1000,(MATCH($A11,Minho!$A$1:$AA$1,0)),1))))","v":24},{"$f":"SUM((Laho!$A$2:$A$1000>=$E$2)*(Laho!$A$2:$A$1000<=$F$2)*(INDIRECT(\"Laho!\"&ADDRESS(2,(MATCH($A11,Laho!$A$1:$AA$1,0)),1)&\":\"&ADDRESS(1000,(MATCH($A11,Laho!$A$1:$AA$1,0)),1))))","v":24}]
["moha",null,{"$f":"SUM((Minho!$A$2:$A$1000>=$E$2)*(Minho!$A$2:$A$1000<=$F$2)*(INDIRECT(\"Minho!\"&ADDRESS(2,(MATCH($A12,Minho!$A$1:$AA$1,0)),1)&\":\"&ADDRESS(1000,(MATCH($A12,Minho!$A$1:$AA$1,0)),1))))","v":50},{"$f":"SUM((Laho!$A$2:$A$1000>=$E$2)*(Laho!$A$2:$A$1000<=$F$2)*(INDIRECT(\"Laho!\"&ADDRESS(2,(MATCH($A12,Laho!$A$1:$AA$1,0)),1)&\":\"&ADDRESS(1000,(MATCH($A12,Laho!$A$1:$AA$1,0)),1))))","v":119}]
["noon",null,{"$f":"SUM((Minho!$A$2:$A$1000>=$E$2)*(Minho!$A$2:$A$1000<=$F$2)*(INDIRECT(\"Minho!\"&ADDRESS(2,(MATCH($A13,Minho!$A$1:$AA$1,0)),1)&\":\"&ADDRESS(1000,(MATCH($A13,Minho!$A$1:$AA$1,0)),1))))","v":30},{"$f":"SUM((Laho!$A$2:$A$1000>=$E$2)*(Laho!$A$2:$A$1000<=$F$2)*(INDIRECT(\"Laho!\"&ADDRESS(2,(MATCH($A13,Laho!$A$1:$AA$1,0)),1)&\":\"&ADDRESS(1000,(MATCH($A13,Laho!$A$1:$AA$1,0)),1))))","v":120}]
["saso",null,{"$f":"SUM((Minho!$A$2:$A$1000>=$E$2)*(Minho!$A$2:$A$1000<=$F$2)*(INDIRECT(\"Minho!\"&ADDRESS(2,(MATCH($A14,Minho!$A$1:$AA$1,0)),1)&\":\"&ADDRESS(1000,(MATCH($A14,Minho!$A$1:$AA$1,0)),1))))","v":10},{"$f":"SUM((Laho!$A$2:$A$1000>=$E$2)*(Laho!$A$2:$A$1000<=$F$2)*(INDIRECT(\"Laho!\"&ADDRESS(2,(MATCH($A14,Laho!$A$1:$AA$1,0)),1)&\":\"&ADDRESS(1000,(MATCH($A14,Laho!$A$1:$AA$1,0)),1))))","v":120}]
["zin",null,{"$f":"SUM((Minho!$A$2:$A$1000>=$E$2)*(Minho!$A$2:$A$1000<=$F$2)*(INDIRECT(\"Minho!\"&ADDRESS(2,(MATCH($A15,Minho!$A$1:$AA$1,0)),1)&\":\"&ADDRESS(1000,(MATCH($A15,Minho!$A$1:$AA$1,0)),1))))","v":10},{"$f":"SUM((Laho!$A$2:$A$1000>=$E$2)*(Laho!$A$2:$A$1000<=$F$2)*(INDIRECT(\"Laho!\"&ADDRESS(2,(MATCH($A15,Laho!$A$1:$AA$1,0)),1)&\":\"&ADDRESS(1000,(MATCH($A15,Laho!$A$1:$AA$1,0)),1))))","v":120}]
["ayad",null,{"$f":"SUM((Minho!$A$2:$A$1000>=$E$2)*(Minho!$A$2:$A$1000<=$F$2)*(INDIRECT(\"Minho!\"&ADDRESS(2,(MATCH($A16,Minho!$A$1:$AA$1,0)),1)&\":\"&ADDRESS(1000,(MATCH($A16,Minho!$A$1:$AA$1,0)),1))))","v":10},{"$f":"SUM((Laho!$A$2:$A$1000>=$E$2)*(Laho!$A$2:$A$1000<=$F$2)*(INDIRECT(\"Laho!\"&ADDRESS(2,(MATCH($A16,Laho!$A$1:$AA$1,0)),1)&\":\"&ADDRESS(1000,(MATCH($A16,Laho!$A$1:$AA$1,0)),1))))","v":120}]
["ali",null,{"$f":"SUM((Minho!$A$2:$A$1000>=$E$2)*(Minho!$A$2:$A$1000<=$F$2)*(INDIRECT(\"Minho!\"&ADDRESS(2,(MATCH($A17,Minho!$A$1:$AA$1,0)),1)&\":\"&ADDRESS(1000,(MATCH($A17,Minho!$A$1:$AA$1,0)),1))))","v":10},{"$f":"SUM((Laho!$A$2:$A$1000>=$E$2)*(Laho!$A$2:$A$1000<=$F$2)*(INDIRECT(\"Laho!\"&ADDRESS(2,(MATCH($A17,Laho!$A$1:$AA$1,0)),1)&\":\"&ADDRESS(1000,(MATCH($A17,Laho!$A$1:$AA$1,0)),1))))","v":120}]
["momo",null,{"$f":"SUM((Minho!$A$2:$A$1000>=$E$2)*(Minho!$A$2:$A$1000<=$F$2)*(INDIRECT(\"Minho!\"&ADDRESS(2,(MATCH($A18,Minho!$A$1:$AA$1,0)),1)&\":\"&ADDRESS(1000,(MATCH($A18,Minho!$A$1:$AA$1,0)),1))))","v":10},{"$f":"SUM((Laho!$A$2:$A$1000>=$E$2)*(Laho!$A$2:$A$1000<=$F$2)*(INDIRECT(\"Laho!\"&ADDRESS(2,(MATCH($A18,Laho!$A$1:$AA$1,0)),1)&\":\"&ADDRESS(1000,(MATCH($A18,Laho!$A$1:$AA$1,0)),1))))","v":120}]
["salim",null,{"$f":"SUM((Minho!$A$2:$A$1000>=$E$2)*(Minho!$A$2:$A$1000<=$F$2)*(INDIRECT(\"Minho!\"&ADDRESS(2,(MATCH($A19,Minho!$A$1:$AA$1,0)),1)&\":\"&ADDRESS(1000,(MATCH($A19,Minho!$A$1:$AA$1,0)),1))))","v":10},{"$f":"SUM((Laho!$A$2:$A$1000>=$E$2)*(Laho!$A$2:$A$1000<=$F$2)*(INDIRECT(\"Laho!\"&ADDRESS(2,(MATCH($A19,Laho!$A$1:$AA$1,0)),1)&\":\"&ADDRESS(1000,(MATCH($A19,Laho!$A$1:$AA$1,0)),1))))","v":120}]
["kamal",null,{"$f":"SUM((Minho!$A$2:$A$1000>=$E$2)*(Minho!$A$2:$A$1000<=$F$2)*(INDIRECT(\"Minho!\"&ADDRESS(2,(MATCH($A20,Minho!$A$1:$AA$1,0)),1)&\":\"&ADDRESS(1000,(MATCH($A20,Minho!$A$1:$AA$1,0)),1))))","v":10},{"$f":"SUM((Laho!$A$2:$A$1000>=$E$2)*(Laho!$A$2:$A$1000<=$F$2)*(INDIRECT(\"Laho!\"&ADDRESS(2,(MATCH($A20,Laho!$A$1:$AA$1,0)),1)&\":\"&ADDRESS(1000,(MATCH($A20,Laho!$A$1:$AA$1,0)),1))))","v":120}]
["hoda",null,{"$f":"SUM((Minho!$A$2:$A$1000>=$E$2)*(Minho!$A$2:$A$1000<=$F$2)*(INDIRECT(\"Minho!\"&ADDRESS(2,(MATCH($A21,Minho!$A$1:$AA$1,0)),1)&\":\"&ADDRESS(1000,(MATCH($A21,Minho!$A$1:$AA$1,0)),1))))","v":10},{"$f":"SUM((Laho!$A$2:$A$1000>=$E$2)*(Laho!$A$2:$A$1000<=$F$2)*(INDIRECT(\"Laho!\"&ADDRESS(2,(MATCH($A21,Laho!$A$1:$AA$1,0)),1)&\":\"&ADDRESS(1000,(MATCH($A21,Laho!$A$1:$AA$1,0)),1))))","v":120}]
["dodo",null,{"$f":"SUM((Minho!$A$2:$A$1000>=$E$2)*(Minho!$A$2:$A$1000<=$F$2)*(INDIRECT(\"Minho!\"&ADDRESS(2,(MATCH($A22,Minho!$A$1:$AA$1,0)),1)&\":\"&ADDRESS(1000,(MATCH($A22,Minho!$A$1:$AA$1,0)),1))))","v":10},{"$f":"SUM((Laho!$A$2:$A$1000>=$E$2)*(Laho!$A$2:$A$1000<=$F$2)*(INDIRECT(\"Laho!\"&ADDRESS(2,(MATCH($A22,Laho!$A$1:$AA$1,0)),1)&\":\"&ADDRESS(1000,(MATCH($A22,Laho!$A$1:$AA$1,0)),1))))","v":120}]
["magd",null,{"$f":"SUM((Minho!$A$2:$A$1000>=$E$2)*(Minho!$A$2:$A$1000<=$F$2)*(INDIRECT(\"Minho!\"&ADDRESS(2,(MATCH($A23,Minho!$A$1:$AA$1,0)),1)&\":\"&ADDRESS(1000,(MATCH($A23,Minho!$A$1:$AA$1,0)),1))))","v":10},{"$f":"SUM((Laho!$A$2:$A$1000>=$E$2)*(Laho!$A$2:$A$1000<=$F$2)*(INDIRECT(\"Laho!\"&ADDRESS(2,(MATCH($A23,Laho!$A$1:$AA$1,0)),1)&\":\"&ADDRESS(1000,(MATCH($A23,Laho!$A$1:$AA$1,0)),1))))","v":120}]
["bosy",null,{"$f":"SUM((Minho!$A$2:$A$1000>=$E$2)*(Minho!$A$2:$A$1000<=$F$2)*(INDIRECT(\"Minho!\"&ADDRESS(2,(MATCH($A24,Minho!$A$1:$AA$1,0)),1)&\":\"&ADDRESS(1000,(MATCH($A24,Minho!$A$1:$AA$1,0)),1))))","v":10},{"$f":"SUM((Laho!$A$2:$A$1000>=$E$2)*(Laho!$A$2:$A$1000<=$F$2)*(INDIRECT(\"Laho!\"&ADDRESS(2,(MATCH($A24,Laho!$A$1:$AA$1,0)),1)&\":\"&ADDRESS(1000,(MATCH($A24,Laho!$A$1:$AA$1,0)),1))))","v":120}]
["zoao",null,{"$f":"SUM((Minho!$A$2:$A$1000>=$E$2)*(Minho!$A$2:$A$1000<=$F$2)*(INDIRECT(\"Minho!\"&ADDRESS(2,(MATCH($A25,Minho!$A$1:$AA$1,0)),1)&\":\"&ADDRESS(1000,(MATCH($A25,Minho!$A$1:$AA$1,0)),1))))","v":10},{"$f":"SUM((Laho!$A$2:$A$1000>=$E$2)*(Laho!$A$2:$A$1000<=$F$2)*(INDIRECT(\"Laho!\"&ADDRESS(2,(MATCH($A25,Laho!$A$1:$AA$1,0)),1)&\":\"&ADDRESS(1000,(MATCH($A25,Laho!$A$1:$AA$1,0)),1))))","v":120}]
["sony",null,{"$f":"SUM(C3:C25)","v":304},{"$f":"SUM(D3:D25)","v":2566},null,null,null,null,0]
["tosh"]
["nofa"]
["raoo"]
["lolo"]
["lmya"]
["mmm"]
["nnnn"]
["Adel"]