{"text_format":"1","workbook":"xlsx","n_sheets":9,"sheets":["A","B","C","D","E","F","G","H","قائمة"],"not_rendered":{"charts":0,"images":0,"macros":1,"external_links":0,"defined_names":14,"comments":1,"pivot_tables":0},"unopened":[],"bounds":{"document_bytes":16777216,"sheet_cells":100000,"rows_first":2000,"rows_last":500,"rows_between":2000,"halvings":0,"cell_chars":16384,"cell_head_chars":4096},"cells_cut":0,"cells_raw":0,"read":"whole","date_system":"1900"}

{"sheet":"A","index":0,"n_rows":37,"n_cols":28,"rows_kept":37,"cut":false,"hidden":false,"merged":[[1,2,1,6],[16,2,16,3],[4,3,4,4],[4,5,4,6],[16,7,16,9],[4,1,4,2],[20,1,20,20],[17,1,17,20],[18,1,18,20],[19,1,19,20],[36,18,36,21],[36,7,36,10],[36,1,36,6]]}
[null,null,null,null,null,null,null,null,null,null,null,null,null,null,null,null,null,null,null,null,null,null,null,null,null,null," "," "]
[null,null," ",null,null,null,null,null,null,null,null,null,null,null,null,{"$f":"IF(VLOOKUP(D5,قائمة!A2:D47,4,0)=0,\" \",(VLOOKUP(D5,قائمة!A2:D47,4,0)))","v":" "}]
[]
[]
[null,null,null,2,null,"   الرقم : "]
[]
[]
[null,null,null,null,{"$f":"IFERROR(VLOOKUP($B8,#REF!,4,0),\"\")","v":""}]
[]
[null," "]
[]
[]
[]
[]
[]
[]
[null,null," ",null," ","  "," "," "]
[null," "]
[null," "]
[null," "]
[null," "]
[null,null,null,null,null,null,null,null,null,null,null,null,null,null,null,null," "]
[]
[]
[]
[]
[]
[]
[]
[]
[]
[]
[]
[]
[]
[]
[null,{"$f":"IF(VLOOKUP(D5,قائمة!A2:E47,5,0)=0,\" \",(VLOOKUP(D5,قائمة!A2:E47,5,0)))","v":" "},null,null,null,null,null," ",null,null,null,null,null,null,null,null,null,null," "]

{"sheet":"B","index":1,"n_rows":35,"n_cols":27,"rows_kept":35,"cut":false,"hidden":false,"merged":[[34,16,34,20],[1,2,1,6],[34,1,34,5],[34,6,34,9],[4,3,4,4],[4,5,4,6],[16,2,17,6]]}
[null,null,null,null,null,null,null,null,null,null,null,null,null,null,null,null,null,null,null,null,null,null,null,null,null,null," "]
[null,null," ",null,null,null,null,null,null,null,null,null,null,null,null,null," ",null,null,null,{"$f":"IF(VLOOKUP(D5,قائمة!A2:C47,3,0)=0,\" \",(VLOOKUP(D5,قائمة!A2:C47,3,0)))","v":" "}]
[]
[]
[null,null,null,2,null,"    الرقم  :"]
[11]
[]
[null,null,null,null,{"$f":"IFERROR(VLOOKUP($B8,#REF!,4,0),\"\")","v":""}]
[]
[null," "]
[]
[]
[]
[null,null,null,null," "]
[]
[]
[null,null," "]
[]
[]
[]
[]
[]
[]
[]
[]
[]
[]
[]
[]
[]
[]
[]
[]
[]
[null,{"$f":"IF(VLOOKUP(D5,قائمة!A2:E47,5,0)=0,\" \",(VLOOKUP(D5,قائمة!A2:E47,5,0)))","v":" "},null,null,null,null," ",null,null,null,null,null,null,null,null,null," "]

{"sheet":"C","index":2,"n_rows":7,"n_cols":27,"rows_kept":7,"cut":false,"hidden":false,"merged":[[7,6,7,13],[32,4,32,6],[27,4,27,6],[10,6,11,13],[12,14,13,16],[18,14,19,16],[20,14,21,16],[7,1,7,5],[10,14,11,16],[7,14,7,16],[10,1,11,5],[8,1,9,5],[16,14,17,16],[8,14,9,16],[8,6,9,13],[2,17,2,19],[3,17,3,18],[4,10,4,16],[2,11,2,16],[4,17,4,20],[42,17,42,18],[22,6,23,13],[12,1,13,5],[16,1,17,5],[22,14,23,16],[16,6,17,13],[18,6,19,13],[20,6,21,13],[28,4,28,6],[22,1,23,5],[14,14,15,16],[12,6,13,13],[14,6,15,13],[14,1,15,5],[20,1,21,5],[18,1,19,5],[5,1,5,2],[6,1,6,2],[3,5,3,6],[5,3,5,4],[6,6,6,13],[3,3,3,4],[4,3,4,4],[2,1,2,4],[2,5,2,6],[3,1,3,2],[4,1,4,2],[4,5,4,6],[34,1,36,3],[30,4,30,14],[30,2,30,3],[25,4,25,14],[25,2,25,3],[31,4,31,14],[32,10,32,14],[26,4,26,14],[27,10,27,14],[34,7,36,8],[34,12,36,14],[34,4,36,6],[34,9,34,11],[36,9,36,11]]}
[null,null,null,null,null,null,null,null,null,null,null,null,null,null,null,null,null,null,null,null,null,null,null,null,null,null,false]
[]
[]
[]
[null,null,null,10,null,"      الرقم :",null,null,null,null,null,null,null,null,null,null,null," "]
[]
[null," "]

{"sheet":"D","index":3,"n_rows":5,"n_cols":27,"rows_kept":5,"cut":false,"hidden":false,"merged":[[8,8,9,17],[12,8,13,17],[14,8,15,17],[18,8,19,17],[20,8,21,17],[17,8,17,17],[24,1,25,5],[24,6,25,7],[16,1,17,5],[16,6,17,7],[16,18,17,20],[24,8,25,20],[22,8,23,17],[18,6,19,7],[18,18,19,20],[20,1,21,5],[20,6,21,7],[20,18,21,20],[18,1,19,5],[10,18,11,20],[22,1,23,5],[22,6,23,7],[22,18,23,20],[12,1,13,5],[12,6,13,7],[12,18,13,20],[14,1,15,5],[14,6,15,7],[14,18,15,20],[16,8,16,17],[2,2,2,4],[2,5,2,6],[3,5,3,6],[3,3,3,4],[2,20,2,21],[3,20,3,21],[2,11,2,19],[3,17,3,18],[30,19,30,20],[4,5,4,6],[4,3,4,4],[4,20,4,21],[4,11,4,19],[7,1,7,5],[7,6,7,7],[7,8,7,17],[7,18,7,20],[6,4,6,18],[8,1,9,5],[8,6,9,7],[8,18,9,20],[10,1,11,5],[10,6,11,7],[10,8,11,17]]}
[null,null,null,null,null,null,null,null,null,null,null,null,null,null,null,null,null,null,null,null,null,null,null,null,null,null,false]
[]
[]
[]
[null,null,null,2,null,"     الرقم :",null,null,null,null,null," ",null,null,null,null,null,null,null,null," "]

{"sheet":"E","index":4,"n_rows":5,"n_cols":27,"rows_kept":5,"cut":false,"hidden":false,"merged":[[7,6,7,7],[42,17,42,19],[2,11,2,16],[10,17,10,19],[11,17,11,19],[22,17,22,19],[18,8,18,10],[4,5,4,6],[3,5,3,6],[4,17,4,19],[6,4,6,17],[7,17,7,19],[7,1,7,5],[4,3,4,4],[3,14,3,15],[8,1,9,5],[11,8,11,16],[11,6,11,7],[22,1,22,5],[8,6,8,7],[9,6,9,7],[8,17,8,19],[9,17,9,19],[8,8,8,16],[9,8,9,16],[2,17,2,19],[24,1,24,5],[22,6,22,7],[24,6,24,7],[22,8,22,16],[19,14,19,16],[20,14,20,16],[21,11,21,16],[20,8,20,10],[19,8,19,10],[3,17,3,18],[4,10,4,16],[7,8,7,16],[2,2,2,4],[2,5,2,6],[3,3,3,4],[16,11,16,13],[17,11,17,13],[23,17,23,19],[16,14,16,16],[16,8,16,10],[10,1,10,5],[11,1,11,5],[10,6,10,7],[29,6,29,7],[17,14,17,16],[18,11,18,13],[19,11,19,13],[20,11,20,13],[25,8,25,16],[26,8,26,16],[28,8,28,16],[28,6,28,7],[10,8,10,16],[14,8,14,10],[15,8,15,10],[13,14,13,16],[14,14,14,16],[15,14,15,16],[13,11,13,13],[14,11,14,13],[15,11,15,13],[29,8,29,16],[24,17,24,19],[31,4,31,17],[25,17,25,19],[26,17,26,19],[12,17,21,19],[23,8,23,16],[24,8,24,16],[12,1,21,5],[12,6,21,7],[12,8,12,10],[12,11,12,13],[12,14,12,16],[21,8,21,10],[23,6,23,7],[23,1,23,5],[13,8,13,10],[18,14,18,16],[17,8,17,10],[25,1,25,5],[26,1,26,5],[28,1,28,5],[29,1,29,5],[25,6,25,7],[26,6,26,7],[39,1,40,5],[39,6,39,7],[35,1,38,5],[40,6,40,7],[40,8,40,16],[34,6,34,7],[38,8,38,16],[37,6,38,7],[39,8,39,16],[33,1,34,5],[33,6,33,7],[36,8,36,16],[35,6,36,7],[27,1,27,5],[27,6,27,7],[27,8,27,16],[27,17,27,19],[43,17,43,19],[31,1,31,3],[32,1,32,5],[32,6,32,7],[45,16,45,18],[28,17,28,19],[29,17,29,19],[31,18,31,19],[32,8,32,16],[32,17,32,19],[33,8,33,16],[34,8,34,16],[35,8,35,16],[37,8,37,16],[33,17,33,19],[40,17,40,19],[39,17,39,19],[37,17,38,19],[34,17,34,19],[35,17,36,19]]}
[null,null,null,null,null,null,null,null,null,null,null,null,null,null,null,null,null,null,null,null,null,null,null,null,null,null,false]
[]
[]
[]
[null,null,null,4,null,"     الرقم :",null,null,null,null," ",null,null,null,null,null,null," "]

{"sheet":"F","index":5,"n_rows":41,"n_cols":27,"rows_kept":41,"cut":false,"hidden":false,"merged":[[2,20,2,22],[2,2,2,4],[2,5,2,6],[3,3,3,4],[4,3,4,4],[3,5,3,6],[4,5,4,6],[3,20,3,21],[4,12,4,19],[3,16,3,18],[4,20,4,22],[2,11,2,19],[21,19,24,21],[29,1,29,5],[25,6,28,7],[19,6,20,7],[19,1,20,5],[19,8,20,18],[21,8,21,18],[22,8,22,18],[23,8,23,18],[7,4,7,19],[8,8,8,18],[9,6,10,7],[9,8,9,18],[11,6,12,7],[11,8,11,18],[12,8,12,18],[11,19,12,21],[8,19,8,21],[11,1,14,5],[13,6,14,7],[8,1,8,5],[8,6,8,7],[9,19,10,21],[9,1,10,5],[13,8,13,18],[31,1,32,5],[31,6,32,7],[31,8,32,9],[31,12,32,18],[31,11,32,11],[30,1,30,5],[15,19,18,21],[15,8,15,18],[16,8,16,18],[17,8,17,18],[18,8,18,18],[30,6,30,7],[19,19,20,21],[30,8,30,18],[29,19,29,21],[25,1,28,5],[15,1,18,5],[15,6,18,7],[21,1,24,5],[21,6,24,7],[29,6,29,7],[35,1,36,5],[35,6,36,7],[35,8,36,18],[33,1,34,5],[33,6,34,7],[33,8,34,18],[10,11,10,18],[10,8,10,10],[39,20,39,21],[24,8,24,18],[35,19,36,21],[33,19,34,21],[31,19,32,21],[30,19,30,21],[29,8,29,18],[13,19,14,21],[14,8,14,18],[25,19,28,21],[27,8,27,18],[28,8,28,18],[25,8,25,18],[26,8,26,18]]}
[null,null,null,null,null,null,null,null,null,null,null,null,null,null,null,null,null,null,null,null,null,null,null,null,null,null,false]
[]
[null,null," ",null,null," ",null,null,null,null,null," ",null,null,null,null,null,null,null,null," "]
[null,null,null,{"$f":"IF(VLOOKUP(D5,قائمة!A2:D47,4,0)=0,\" \",(VLOOKUP(D5,قائمة!A2:D47,4,0)))","v":" "},null," ",null,null,null,null,null,null,null,null,null,null,null,null,null,{"$f":"IF(VLOOKUP(D5,قائمة!A2:C47,3,0)=0,\" \",(VLOOKUP(D5,قائمة!A2:C47,3,0)))","v":" "}," "]
[null,null,null,4,null,"     الرقم :",null,null,null,null,null,null,{"$f":"IF(VLOOKUP(D5,قائمة!A2:E47,5,0)=0,\" \",(VLOOKUP(D5,قائمة!A2:E47,5,0)))","v":" "},null,null,null,null,null,null,null," "]
[]
[]
[]
[]
[]
[]
[]
[]
[]
[]
[]
[]
[]
[]
[]
[]
[]
[]
[]
[]
[]
[]
[]
[]
[]
[]
[]
[]
[]
[]
[]
[]
[]
[]
[]
[null,null,null,null,null,null,null,null,null,null,null,null,null,null,null,null,null,null,null,null," "]

{"sheet":"G","index":6,"n_rows":5,"n_cols":27,"rows_kept":5,"cut":false,"hidden":false,"merged":[[2,19,2,21],[12,8,12,12],[13,8,13,12],[14,8,14,12],[12,13,12,17],[13,13,13,17],[4,19,4,21],[3,19,3,20],[4,12,4,18],[3,16,3,17],[8,8,8,17],[9,12,9,18],[9,8,9,11],[2,11,2,18],[8,2,8,7],[7,4,7,18],[14,18,14,20],[14,13,14,17],[12,18,12,20],[13,18,13,20],[9,2,9,7],[10,4,10,18],[12,1,12,7],[2,2,2,4],[2,5,2,6],[3,3,3,4],[3,5,3,6],[4,3,4,4],[4,5,4,6],[31,3,31,7],[15,18,16,20],[19,2,19,5],[21,4,26,19],[31,16,32,19],[15,8,15,17],[16,8,16,17],[17,1,17,7],[15,1,16,7],[17,8,17,12],[17,18,17,20],[17,13,17,17],[11,25,11,27],[11,1,11,7],[11,18,11,20],[13,1,13,7],[14,1,14,7]]}
[null,null,null,null,null,null,null,null,null,null,null,null,null,null,null,null,null,null,null,null,null,null,null,null,null,null,false]
[]
[null,null," ",null,null," ",null,null,null,null,null," ",null,null,null,null,null,null,null," "]
[null,null,null,{"$f":"IF(VLOOKUP(D5,قائمة!A2:D47,4,0)=0,\" \",(VLOOKUP(D5,قائمة!A2:D47,4,0)))","v":" "},null," ",null,null,null,null,null,null,null,null,null,null," ",null," "," "]
[null,null,null,10,null,"      الرقم :",null,null,null,null,null,null,{"$f":"IF(VLOOKUP(D5,قائمة!A2:E47,5,0)=0,\" \",(VLOOKUP(D5,قائمة!A2:E47,5,0)))","v":" "},null,null,null,null,null,null," ",null,"اسم المريض:"]

{"sheet":"H","index":7,"n_rows":5,"n_cols":27,"rows_kept":5,"cut":false,"hidden":false,"merged":[[39,1,40,5],[39,6,39,7],[39,8,39,16],[33,17,33,20],[30,4,30,18],[31,1,31,5],[31,6,31,7],[31,17,31,20],[31,8,31,16],[32,8,32,16],[33,8,33,16],[34,1,35,5],[34,6,34,7],[35,6,35,7],[34,17,34,20],[35,17,35,20],[34,8,34,16],[35,8,35,16],[32,1,33,5],[32,6,32,7],[33,6,33,7],[32,17,32,20],[44,17,44,20],[38,1,38,5],[38,6,38,7],[36,1,36,5],[36,6,36,7],[37,1,37,5],[37,6,37,7],[36,17,36,20],[37,17,37,20],[40,8,40,16],[41,8,41,16],[42,8,42,16],[36,8,36,16],[37,8,37,16],[38,8,38,16],[38,17,38,20],[42,1,42,5],[42,6,42,7],[40,6,40,7],[41,1,41,5],[41,17,41,20],[41,6,41,7],[39,17,40,20],[42,17,42,20],[2,18,2,21],[4,18,4,21],[3,18,3,19],[4,11,4,17],[2,11,2,17],[10,8,10,16],[11,8,11,16],[7,8,7,16],[16,14,16,16],[6,1,6,21],[7,17,7,20],[8,17,8,20],[9,17,9,20],[12,11,12,13],[8,1,9,5],[8,6,8,7],[9,6,9,7],[10,6,10,7],[7,6,7,7],[10,17,10,20],[11,17,11,20],[12,17,21,20],[21,8,21,10],[21,11,21,16],[1,3,1,4],[2,2,2,4],[2,5,2,6],[11,6,11,7],[14,8,14,10],[12,8,12,10],[7,1,7,5],[4,3,4,4],[4,5,4,6],[8,8,8,16],[9,8,9,16],[14,14,14,16],[12,14,12,16],[13,14,13,16],[3,3,3,4],[10,1,10,5],[13,8,13,10],[13,11,13,13],[3,5,3,6],[11,1,11,5],[12,1,21,5],[12,6,21,7],[14,11,14,13],[19,11,19,13],[22,6,22,7],[28,8,28,16],[26,8,26,16],[29,1,29,5],[26,1,26,5],[19,14,19,16],[15,14,15,16],[16,8,16,10],[16,11,16,13],[18,11,18,13],[20,8,20,10],[20,11,20,13],[20,14,20,16],[19,8,19,10],[15,8,15,10],[15,11,15,13],[18,14,18,16],[17,8,17,10],[17,11,17,13],[17,14,17,16],[18,8,18,10],[27,1,27,5],[29,6,29,7],[29,8,29,16],[29,17,29,20],[24,6,24,7],[24,17,24,20],[22,17,22,20],[27,17,27,20],[27,8,27,16],[27,6,27,7],[25,17,25,20],[28,1,28,5],[22,8,22,16],[23,17,23,20],[26,17,26,20],[28,17,28,20],[22,1,22,5],[23,1,23,5],[24,1,24,5],[23,6,23,7],[23,8,23,16],[24,8,24,16],[25,8,25,16],[25,1,25,5],[28,6,28,7],[26,6,26,7],[25,6,25,7]]}
[null,null,null,null,null,null,null,null,null,null,null,null,null,null,null,null,null,null,null,null,null,null,null,null,null,null,false]
[]
[]
[]
[null,null,null,4,null,"   الرقم  :",null,null,null,null,null," ",null,null,null,null,null,null," "]

{"sheet":"قائمة","index":8,"n_rows":51,"n_cols":27,"rows_kept":51,"cut":false,"hidden":false,"merged":[[0,6,0,7],[1,7,2,7],[1,6,2,6],[4,6,5,6],[4,7,5,7],[6,6,7,6],[6,7,7,7],[10,3,15,7]]}
[" "," "," "," "," ",3,"الارتباطات التشعبية  للصفحات ادناه تكون في خلايا هذه الاعمده فقط",null,null,null,null,null,null,null,null,null,null,null,null,null,null,null,null,null,null,null,false]
[2," "," "," "," ",null,"A","E"]
[3,null," "," "," "]
[4,null," "," "," "," ","B","F"]
[6,null," "," "," ",null,"C","G"]
[7,null," "," "," "," "]
[8,null," "," "," "," ","D","H"]
[9,null," "," "," "," "]
[10,null," "," "," "," "]
[]
[null,null,null,"مشكلة عدم ظهور الرقم الموجود في الخلية F1 عند الدخول الى الصفحات  C و G  من الارتباط التشعبي مع العلم ظهور الرقم في باقي الصفحات عند الدخول اليها من الارتباط التشعبي\nواذا يوجد طريقة أخرى لجعل الرقم يظهر في  الخلية D5 في جميع الصفحات عند الدخول اليها من خلال الارتباط التشعبي الخاص بها علما ان لدي ما يقارب 20 صفحة اخرى والارتباطات التشعبية للصفحات تكون في خلايا العمود GوH فقط كما هو عليه الان \n وشكرا لجهودكم "]
[]
[]
[]
[]
[]
[]
[]
[]
[]
[]
[]
[]
[]
[]
[]
[]
[]
[]
[]
[]
[]
[]
[]
[]
[]
[]
[]
[]
[]
[]
[]
[]
[]
[]
[]
[]
[]
[]
[]
[" "]