{"text_format":"1","workbook":"xlsx","n_sheets":2,"sheets":["days","enter"],"not_rendered":{"charts":0,"images":1,"macros":1,"external_links":0,"defined_names":2,"comments":0,"pivot_tables":0},"unopened":[],"bounds":{"document_bytes":16777216,"sheet_cells":100000,"rows_first":2000,"rows_last":500,"rows_between":2000,"halvings":0,"cell_chars":16384,"cell_head_chars":4096},"cells_cut":0,"cells_raw":0,"read":"whole","date_system":"1900"}

{"sheet":"days","index":0,"n_rows":338,"n_cols":20,"rows_kept":338,"cut":false,"hidden":false,"merged":[]}
[]
[]
[null,null,1,2,3,4,5,6,7,8,9,10,11,12,13]
[null,null,"الكود","الاسم","الورشة","البريمة","بونس","انتقالات","بدل طعام","توفير كارتة","بدل سهر","ثابت","أخرى","أخرى2","ملاحظات على الراتب"]
[null,null,null,null,null,null,null,null,null,null,null,null,null,null,null,null,"الرمز",null,"الكود","الاسم"]
[null,null,null,null,null,null,null,null,null,null,null,null,null,null,null,null,{"$f":"IF(R6>0,\"موجود\",\"\")","v":""},{"$f":"IFERROR(VLOOKUP(S6,$C$5:$O$213,1,0),0)","v":0},1001,{"$f":"#REF!","v":{"$error":"#REF!"}}]
[null,null,null,null,null,null,null,null,null,null,null,null,null,null,null,null,{"$f":"IF(R7>0,\"موجود\",\"\")","v":""},0,1002,{"$f":"#REF!","v":{"$error":"#REF!"}}]
[null,null,null,null,null,null,null,null,null,null,null,null,null,null,null,null,"",0,1003,{"$f":"#REF!","v":{"$error":"#REF!"}}]
[null,null,null,null,null,null,null,null,null,null,null,null,null,null,null,null,"",0,1004,{"$f":"#REF!","v":{"$error":"#REF!"}}]
[null,null,null,null,null,null,null,null,null,null,null,null,null,null,null,null,"",0,1005,{"$f":"#REF!","v":{"$error":"#REF!"}}]
[null,null,null,null,null,null,null,null,null,null,null,null,null,null,null,null,"",0,1006,{"$f":"#REF!","v":{"$error":"#REF!"}}]
[null,null,null,null,null,null,null,null,null,null,null,null,null,null,null,null,"",0,1007,{"$f":"#REF!","v":{"$error":"#REF!"}}]
[null,null,null,null,null,null,null,null,null,null,null,null,null,null,null,null,"",0,1008,{"$f":"#REF!","v":{"$error":"#REF!"}}]
[null,null,null,null,null,null,null,null,null,null,null,null,null,null,null,null,"",0,1009,{"$f":"#REF!","v":{"$error":"#REF!"}}]
[null,null,null,null,null,null,null,null,null,null,null,null,null,null,null,null,"",0,1010,{"$f":"#REF!","v":{"$error":"#REF!"}}]
[null,null,null,{"$f":"IFERROR(VLOOKUP(C16,#REF!,2,0),\"\")","v":""},null,null,null,null,null,null,null,null,null,null,null,null,"",0,1011,{"$f":"#REF!","v":{"$error":"#REF!"}}]
[null,null,null,{"$f":"IFERROR(VLOOKUP(C17,#REF!,2,0),\"\")","v":""},null,null,null,null,null,null,null,null,null,null,null,null,"",0,1012,{"$f":"#REF!","v":{"$error":"#REF!"}}]
[null,null,null,{"$f":"IFERROR(VLOOKUP(C18,#REF!,2,0),\"\")","v":""},null,null,null,null,null,null,null,null,null,null,null,null,"",0,1013,{"$f":"#REF!","v":{"$error":"#REF!"}}]
[null,null,null,{"$f":"IFERROR(VLOOKUP(C19,#REF!,2,0),\"\")","v":""},null,null,null,null,null,null,null,null,null,null,null,null,"",0,1014,{"$f":"#REF!","v":{"$error":"#REF!"}}]
[null,null,null,{"$f":"IFERROR(VLOOKUP(C20,#REF!,2,0),\"\")","v":""},null,null,null,null,null,null,null,null,null,null,null,null,"",0,1015,{"$f":"#REF!","v":{"$error":"#REF!"}}]
[null,null,null,{"$f":"IFERROR(VLOOKUP(C21,#REF!,2,0),\"\")","v":""},null,null,null,null,null,null,null,null,null,null,null,null,"",0,1016,{"$f":"#REF!","v":{"$error":"#REF!"}}]
[null,null,null,{"$f":"IFERROR(VLOOKUP(C22,#REF!,2,0),\"\")","v":""},null,null,null,null,null,null,null,null,null,null,null,null,"",0,1017,{"$f":"#REF!","v":{"$error":"#REF!"}}]
[null,null,null,{"$f":"IFERROR(VLOOKUP(C23,#REF!,2,0),\"\")","v":""},null,null,null,null,null,null,null,null,null,null,null,null,"",0,{"$f":"#REF!","v":{"$error":"#REF!"}},{"$f":"#REF!","v":{"$error":"#REF!"}}]
[null,null,null,{"$f":"IFERROR(VLOOKUP(C24,#REF!,2,0),\"\")","v":""},null,null,null,null,null,null,null,null,null,null,null,null,"",0,{"$f":"#REF!","v":{"$error":"#REF!"}},{"$f":"#REF!","v":{"$error":"#REF!"}}]
[null,null,null,{"$f":"IFERROR(VLOOKUP(C25,#REF!,2,0),\"\")","v":""},null,null,null,null,null,null,null,null,null,null,null,null,"",0,{"$f":"#REF!","v":{"$error":"#REF!"}},{"$f":"#REF!","v":{"$error":"#REF!"}}]
[null,null,null,{"$f":"IFERROR(VLOOKUP(C26,#REF!,2,0),\"\")","v":""},null,null,null,null,null,null,null,null,null,null,null,null,"",0,{"$f":"#REF!","v":{"$error":"#REF!"}},{"$f":"#REF!","v":{"$error":"#REF!"}}]
[null,null,null,{"$f":"IFERROR(VLOOKUP(C27,#REF!,2,0),\"\")","v":""},null,null,null,null,null,null,null,null,null,null,null,null,"",0,{"$f":"#REF!","v":{"$error":"#REF!"}},{"$f":"#REF!","v":{"$error":"#REF!"}}]
[null,null,null,{"$f":"IFERROR(VLOOKUP(C28,#REF!,2,0),\"\")","v":""},null,null,null,null,null,null,null,null,null,null,null,null,"",0,{"$f":"#REF!","v":{"$error":"#REF!"}},{"$f":"#REF!","v":{"$error":"#REF!"}}]
[null,null,null,{"$f":"IFERROR(VLOOKUP(C29,#REF!,2,0),\"\")","v":""},null,null,null,null,null,null,null,null,null,null,null,null,"",0,{"$f":"#REF!","v":{"$error":"#REF!"}},{"$f":"#REF!","v":{"$error":"#REF!"}}]
[null,null,null,{"$f":"IFERROR(VLOOKUP(C30,#REF!,2,0),\"\")","v":""},null,null,null,null,null,null,null,null,null,null,null,null,"",0,{"$f":"#REF!","v":{"$error":"#REF!"}},{"$f":"#REF!","v":{"$error":"#REF!"}}]
[null,null,null,{"$f":"IFERROR(VLOOKUP(C31,#REF!,2,0),\"\")","v":""},null,null,null,null,null,null,null,null,null,null,null,null,"",0,{"$f":"#REF!","v":{"$error":"#REF!"}},{"$f":"#REF!","v":{"$error":"#REF!"}}]
[null,null,null,{"$f":"IFERROR(VLOOKUP(C32,#REF!,2,0),\"\")","v":""},null,null,null,null,null,null,null,null,null,null,null,null,"",0,{"$f":"#REF!","v":{"$error":"#REF!"}},{"$f":"#REF!","v":{"$error":"#REF!"}}]
[null,null,null,{"$f":"IFERROR(VLOOKUP(C33,#REF!,2,0),\"\")","v":""},null,null,null,null,null,null,null,null,null,null,null,null,"",0,{"$f":"#REF!","v":{"$error":"#REF!"}},{"$f":"#REF!","v":{"$error":"#REF!"}}]
[null,null,null,{"$f":"IFERROR(VLOOKUP(C34,#REF!,2,0),\"\")","v":""},null,null,null,null,null,null,null,null,null,null,null,null,"",0,{"$f":"#REF!","v":{"$error":"#REF!"}},{"$f":"#REF!","v":{"$error":"#REF!"}}]
[null,null,null,{"$f":"IFERROR(VLOOKUP(C35,#REF!,2,0),\"\")","v":""},null,null,null,null,null,null,null,null,null,null,null,null,"",0,{"$f":"#REF!","v":{"$error":"#REF!"}},{"$f":"#REF!","v":{"$error":"#REF!"}}]
[null,null,null,{"$f":"IFERROR(VLOOKUP(C36,#REF!,2,0),\"\")","v":""},null,null,null,null,null,null,null,null,null,null,null,null,"",0,{"$f":"#REF!","v":{"$error":"#REF!"}},{"$f":"#REF!","v":{"$error":"#REF!"}}]
[null,null,null,{"$f":"IFERROR(VLOOKUP(C37,#REF!,2,0),\"\")","v":""},null,null,null,null,null,null,null,null,null,null,null,null,"",0,{"$f":"#REF!","v":{"$error":"#REF!"}},{"$f":"#REF!","v":{"$error":"#REF!"}}]
[null,null,null,{"$f":"IFERROR(VLOOKUP(C38,#REF!,2,0),\"\")","v":""},null,null,null,null,null,null,null,null,null,null,null,null,"",{"$f":"IFERROR(VLOOKUP(S38,$C$5:$O$213,1,0),0)","v":0},{"$f":"#REF!","v":{"$error":"#REF!"}},{"$f":"#REF!","v":{"$error":"#REF!"}}]
[null,null,null,{"$f":"IFERROR(VLOOKUP(C39,#REF!,2,0),\"\")","v":""},null,null,null,null,null,null,null,null,null,null,null,null,"",0,{"$f":"#REF!","v":{"$error":"#REF!"}},{"$f":"#REF!","v":{"$error":"#REF!"}}]
[null,null,null,{"$f":"IFERROR(VLOOKUP(C40,#REF!,2,0),\"\")","v":""},null,null,null,null,null,null,null,null,null,null,null,null,"",0,{"$f":"#REF!","v":{"$error":"#REF!"}},{"$f":"#REF!","v":{"$error":"#REF!"}}]
[null,null,null,{"$f":"IFERROR(VLOOKUP(C41,#REF!,2,0),\"\")","v":""},null,null,null,null,null,null,null,null,null,null,null,null,"",0,{"$f":"#REF!","v":{"$error":"#REF!"}},{"$f":"#REF!","v":{"$error":"#REF!"}}]
[null,null,null,{"$f":"IFERROR(VLOOKUP(C42,#REF!,2,0),\"\")","v":""},null,null,null,null,null,null,null,null,null,null,null,null,"",0,{"$f":"#REF!","v":{"$error":"#REF!"}},{"$f":"#REF!","v":{"$error":"#REF!"}}]
[null,null,null,{"$f":"IFERROR(VLOOKUP(C43,#REF!,2,0),\"\")","v":""},null,null,null,null,null,null,null,null,null,null,null,null,"",0,{"$f":"#REF!","v":{"$error":"#REF!"}},{"$f":"#REF!","v":{"$error":"#REF!"}}]
[null,null,null,{"$f":"IFERROR(VLOOKUP(C44,#REF!,2,0),\"\")","v":""},null,null,null,null,null,null,null,null,null,null,null,null,"",0,{"$f":"#REF!","v":{"$error":"#REF!"}},{"$f":"#REF!","v":{"$error":"#REF!"}}]
[null,null,null,{"$f":"IFERROR(VLOOKUP(C45,#REF!,2,0),\"\")","v":""},null,null,null,null,null,null,null,null,null,null,null,null,"",0,{"$f":"#REF!","v":{"$error":"#REF!"}},{"$f":"#REF!","v":{"$error":"#REF!"}}]
[null,null,null,{"$f":"IFERROR(VLOOKUP(C46,#REF!,2,0),\"\")","v":""},null,null,null,null,null,null,null,null,null,null,null,null,"",0,{"$f":"#REF!","v":{"$error":"#REF!"}},{"$f":"#REF!","v":{"$error":"#REF!"}}]
[null,null,null,{"$f":"IFERROR(VLOOKUP(C47,#REF!,2,0),\"\")","v":""},null,null,null,null,null,null,null,null,null,null,null,null,"",0,{"$f":"#REF!","v":{"$error":"#REF!"}},{"$f":"#REF!","v":{"$error":"#REF!"}}]
[null,null,null,{"$f":"IFERROR(VLOOKUP(C48,#REF!,2,0),\"\")","v":""},null,null,null,null,null,null,null,null,null,null,null,null,"",0,{"$f":"#REF!","v":{"$error":"#REF!"}},{"$f":"#REF!","v":{"$error":"#REF!"}}]
[null,null,null,{"$f":"IFERROR(VLOOKUP(C49,#REF!,2,0),\"\")","v":""},null,null,null,null,null,null,null,null,null,null,null,null,"",0,{"$f":"#REF!","v":{"$error":"#REF!"}},{"$f":"#REF!","v":{"$error":"#REF!"}}]
[null,null,null,{"$f":"IFERROR(VLOOKUP(C50,#REF!,2,0),\"\")","v":""},null,null,null,null,null,null,null,null,null,null,null,null,"",0,{"$f":"#REF!","v":{"$error":"#REF!"}},{"$f":"#REF!","v":{"$error":"#REF!"}}]
[null,null,null,{"$f":"IFERROR(VLOOKUP(C51,#REF!,2,0),\"\")","v":""},null,null,null,null,null,null,null,null,null,null,null,null,"",0,{"$f":"#REF!","v":{"$error":"#REF!"}},{"$f":"#REF!","v":{"$error":"#REF!"}}]
[null,null,null,{"$f":"IFERROR(VLOOKUP(C52,#REF!,2,0),\"\")","v":""},null,null,null,null,null,null,null,null,null,null,null,null,"",0,{"$f":"#REF!","v":{"$error":"#REF!"}},{"$f":"#REF!","v":{"$error":"#REF!"}}]
[null,null,null,{"$f":"IFERROR(VLOOKUP(C53,#REF!,2,0),\"\")","v":""},null,null,null,null,null,null,null,null,null,null,null,null,"",0,{"$f":"#REF!","v":{"$error":"#REF!"}},{"$f":"#REF!","v":{"$error":"#REF!"}}]
[null,null,null,{"$f":"IFERROR(VLOOKUP(C54,#REF!,2,0),\"\")","v":""},null,null,null,null,null,null,null,null,null,null,null,null,"",0,{"$f":"#REF!","v":{"$error":"#REF!"}},{"$f":"#REF!","v":{"$error":"#REF!"}}]
[null,null,null,{"$f":"IFERROR(VLOOKUP(C55,#REF!,2,0),\"\")","v":""},null,null,null,null,null,null,null,null,null,null,null,null,"",0,{"$f":"#REF!","v":{"$error":"#REF!"}},{"$f":"#REF!","v":{"$error":"#REF!"}}]
[null,null,null,{"$f":"IFERROR(VLOOKUP(C56,#REF!,2,0),\"\")","v":""},null,null,null,null,null,null,null,null,null,null,null,null,"",0,{"$f":"#REF!","v":{"$error":"#REF!"}},{"$f":"#REF!","v":{"$error":"#REF!"}}]
[null,null,null,{"$f":"IFERROR(VLOOKUP(C57,#REF!,2,0),\"\")","v":""},null,null,null,null,null,null,null,null,null,null,null,null,"",0,{"$f":"#REF!","v":{"$error":"#REF!"}},{"$f":"#REF!","v":{"$error":"#REF!"}}]
[null,null,null,{"$f":"IFERROR(VLOOKUP(C58,#REF!,2,0),\"\")","v":""},null,null,null,null,null,null,null,null,null,null,null,null,"",0,{"$f":"#REF!","v":{"$error":"#REF!"}},{"$f":"#REF!","v":{"$error":"#REF!"}}]
[null,null,null,{"$f":"IFERROR(VLOOKUP(C59,#REF!,2,0),\"\")","v":""},null,null,null,null,null,null,null,null,null,null,null,null,"",0,{"$f":"#REF!","v":{"$error":"#REF!"}},{"$f":"#REF!","v":{"$error":"#REF!"}}]
[null,null,null,{"$f":"IFERROR(VLOOKUP(C60,#REF!,2,0),\"\")","v":""},null,null,null,null,null,null,null,null,null,null,null,null,"",0,{"$f":"#REF!","v":{"$error":"#REF!"}},{"$f":"#REF!","v":{"$error":"#REF!"}}]
[null,null,null,{"$f":"IFERROR(VLOOKUP(C61,#REF!,2,0),\"\")","v":""},null,null,null,null,null,null,null,null,null,null,null,null,"",0,{"$f":"#REF!","v":{"$error":"#REF!"}},{"$f":"#REF!","v":{"$error":"#REF!"}}]
[null,null,null,{"$f":"IFERROR(VLOOKUP(C62,#REF!,2,0),\"\")","v":""},null,null,null,null,null,null,null,null,null,null,null,null,"",0,{"$f":"#REF!","v":{"$error":"#REF!"}},{"$f":"#REF!","v":{"$error":"#REF!"}}]
[null,null,null,{"$f":"IFERROR(VLOOKUP(C63,#REF!,2,0),\"\")","v":""},null,null,null,null,null,null,null,null,null,null,null,null,"",0,{"$f":"#REF!","v":{"$error":"#REF!"}},{"$f":"#REF!","v":{"$error":"#REF!"}}]
[null,null,null,{"$f":"IFERROR(VLOOKUP(C64,#REF!,2,0),\"\")","v":""},null,null,null,null,null,null,null,null,null,null,null,null,"",0,{"$f":"#REF!","v":{"$error":"#REF!"}},{"$f":"#REF!","v":{"$error":"#REF!"}}]
[null,null,null,{"$f":"IFERROR(VLOOKUP(C65,#REF!,2,0),\"\")","v":""},null,null,null,null,null,null,null,null,null,null,null,null,"",0,{"$f":"#REF!","v":{"$error":"#REF!"}},{"$f":"#REF!","v":{"$error":"#REF!"}}]
[null,null,null,{"$f":"IFERROR(VLOOKUP(C66,#REF!,2,0),\"\")","v":""},null,null,null,null,null,null,null,null,null,null,null,null,"",0,{"$f":"#REF!","v":{"$error":"#REF!"}},{"$f":"#REF!","v":{"$error":"#REF!"}}]
[null,null,null,{"$f":"IFERROR(VLOOKUP(C67,#REF!,2,0),\"\")","v":""},null,null,null,null,null,null,null,null,null,null,null,null,"",0,{"$f":"#REF!","v":{"$error":"#REF!"}},{"$f":"#REF!","v":{"$error":"#REF!"}}]
[null,null,null,{"$f":"IFERROR(VLOOKUP(C68,#REF!,2,0),\"\")","v":""},null,null,null,null,null,null,null,null,null,null,null,null,"",0,{"$f":"#REF!","v":{"$error":"#REF!"}},{"$f":"#REF!","v":{"$error":"#REF!"}}]
[null,null,null,{"$f":"IFERROR(VLOOKUP(C69,#REF!,2,0),\"\")","v":""},null,null,null,null,null,null,null,null,null,null,null,null,"",0,{"$f":"#REF!","v":{"$error":"#REF!"}},{"$f":"#REF!","v":{"$error":"#REF!"}}]
[null,null,null,{"$f":"IFERROR(VLOOKUP(C70,#REF!,2,0),\"\")","v":""},null,null,null,null,null,null,null,null,null,null,null,null,"",{"$f":"IFERROR(VLOOKUP(S70,$C$5:$O$213,1,0),0)","v":0},{"$f":"#REF!","v":{"$error":"#REF!"}},{"$f":"#REF!","v":{"$error":"#REF!"}}]
[null,null,null,{"$f":"IFERROR(VLOOKUP(C71,#REF!,2,0),\"\")","v":""},null,null,null,null,null,null,null,null,null,null,null,null,{"$f":"IF(R71>0,\"موجود\",\"\")","v":""},0,{"$f":"#REF!","v":{"$error":"#REF!"}},{"$f":"#REF!","v":{"$error":"#REF!"}}]
[null,null,null,{"$f":"IFERROR(VLOOKUP(C72,#REF!,2,0),\"\")","v":""},null,null,null,null,null,null,null,null,null,null,null,null,"",0,{"$f":"#REF!","v":{"$error":"#REF!"}},{"$f":"#REF!","v":{"$error":"#REF!"}}]
[null,null,null,{"$f":"IFERROR(VLOOKUP(C73,#REF!,2,0),\"\")","v":""},null,null,null,null,null,null,null,null,null,null,null,null,"",0,{"$f":"#REF!","v":{"$error":"#REF!"}},{"$f":"#REF!","v":{"$error":"#REF!"}}]
[null,null,null,{"$f":"IFERROR(VLOOKUP(C74,#REF!,2,0),\"\")","v":""},null,null,null,null,null,null,null,null,null,null,null,null,"",0,{"$f":"#REF!","v":{"$error":"#REF!"}},{"$f":"#REF!","v":{"$error":"#REF!"}}]
[null,null,null,{"$f":"IFERROR(VLOOKUP(C75,#REF!,2,0),\"\")","v":""},null,null,null,null,null,null,null,null,null,null,null,null,"",0,{"$f":"#REF!","v":{"$error":"#REF!"}},{"$f":"#REF!","v":{"$error":"#REF!"}}]
[null,null,null,{"$f":"IFERROR(VLOOKUP(C76,#REF!,2,0),\"\")","v":""},null,null,null,null,null,null,null,null,null,null,null,null,"",0,{"$f":"#REF!","v":{"$error":"#REF!"}},{"$f":"#REF!","v":{"$error":"#REF!"}}]
[null,null,null,{"$f":"IFERROR(VLOOKUP(C77,#REF!,2,0),\"\")","v":""},null,null,null,null,null,null,null,null,null,null,null,null,"",0,{"$f":"#REF!","v":{"$error":"#REF!"}},{"$f":"#REF!","v":{"$error":"#REF!"}}]
[null,null,null,{"$f":"IFERROR(VLOOKUP(C78,#REF!,2,0),\"\")","v":""},null,null,null,null,null,null,null,null,null,null,null,null,"",0,{"$f":"#REF!","v":{"$error":"#REF!"}},{"$f":"#REF!","v":{"$error":"#REF!"}}]
[null,null,null,{"$f":"IFERROR(VLOOKUP(C79,#REF!,2,0),\"\")","v":""},null,null,null,null,null,null,null,null,null,null,null,null,"",0,{"$f":"#REF!","v":{"$error":"#REF!"}},{"$f":"#REF!","v":{"$error":"#REF!"}}]
[null,null,null,{"$f":"IFERROR(VLOOKUP(C80,#REF!,2,0),\"\")","v":""},null,null,null,null,null,null,null,null,null,null,null,null,"",0,{"$f":"#REF!","v":{"$error":"#REF!"}},{"$f":"#REF!","v":{"$error":"#REF!"}}]
{"$rows_left_out":259}
{"sheet":"enter","index":1,"n_rows":16,"n_cols":15,"rows_kept":16,"cut":false,"hidden":false,"merged":[[7,5,7,6],[1,14,1,17],[15,10,15,12],[3,8,3,12],[5,14,5,15],[6,14,6,15],[7,14,7,15],[13,14,13,15],[8,14,8,15],[9,14,9,15],[10,14,10,15],[11,14,11,15],[12,14,12,15],[8,3,10,6],[13,4,13,5],[3,2,4,6]]}
[]
[{"$f":"#REF!","v":{"$error":"#REF!"}},null,null,null,null,null,null,null,null,null,null,null,null,null,"ادخل رجل الموظف"]
[]
[null,null,{"$f":"IFERROR(VLOOKUP(L2,#REF!,17,0),\"\")","v":""},null,null,null,null,null,null,null,null,null,null,null,"الاسم"]
[null,null,null,null,null,null,null,null,null,null,null,{"$f":"IFERROR(VLOOKUP(L2,#REF!,8,0),0)","v":0},null,null,"الاساسى"]
["بريمة",null,null,null,null,null,null,null,{"$f":"L6*J6","v":0},{"$f":"IFERROR(VLOOKUP($L$2,#REF!,10,0),0)","v":0},"×",null,null,null,"يوميات الورشة"]
["بونس",null,null,null,null,null,null,null,{"$f":"L7*J7","v":0},{"$f":"IFERROR(VLOOKUP($L$2,#REF!,11,0),0)","v":0},"×",null,null,null,"يوميات البريمة"]
[null,null,null,null,null,"ملاحظات على الراتب",null,null,0,100,"×",null,null,null,"بونس"]
[null,null,null,null,null,null,null,null,null,null,null,null,null,null,"انتقالات"]
[null,null,null,null,null,null,null,null,null,null,null,null,null,null,"بدل طعام"]
[null,null,null,null,null,null,null,null,null,null,null,null,null,null,"توفير كارتة"]
[null,null,null,null,null,null,null,null,0,{"$f":"J6/8","v":0},"×",null,null,null,"بدل سهر"]
[null,null,null,null,null,null,null,null,null,null,null,null,null,null,"ثابت"]
[null,null,null,null,{"$f":"L5+I6+I7+I8+L9+L10+I12+L12+L13+L14","v":0},null,null,null,null,null,null,null,null,null,"أخرى"]
[]
[null,null,null,null,null,null,null,null,null,null,{"$f":"L5+I6+I7+L9+L10+L11+I12+L13+L14","v":0}]