{"text_format":"1","workbook":"xlsx","n_sheets":17,"sheets":["الرئيسية","قائمة الموظفين","Input","الشيت ","Data","يناير","فبراير","مارس","ابريل","مايو","يونيو","يوليو","اغسطس","سبتمبر","اكتوبر","نوفمبر","ديسمبر"],"not_rendered":{"charts":0,"images":3,"macros":1,"external_links":0,"defined_names":0,"comments":0,"pivot_tables":0},"unopened":[],"bounds":{"document_bytes":16777216,"sheet_cells":100000,"rows_first":2000,"rows_last":500,"rows_between":2000,"halvings":0,"cell_chars":16384,"cell_head_chars":4096},"cells_cut":0,"cells_raw":0,"read":"whole","date_system":"1900"}

{"sheet":"الرئيسية","index":0,"n_rows":15,"n_cols":27,"rows_kept":15,"cut":false,"hidden":false,"merged":[[0,0,37,13]]}
[]
[]
[]
[null,null,null,null,null,null,null,null,null,null,null,null,null,null,null,null,null,null,null,null,null,null,null,null,null,"يناير",1]
[null,null,null,null,null,null,null,null,null,null,null,null,null,null,null,null,null,null,null,null,null,null,null,null,null,"فبراير",2]
[null,null,null,null,null,null,null,null,null,null,null,null,null,null,null,null,null,null,null,null,null,null,null,null,null,"مارس",3]
[null,null,null,null,null,null,null,null,null,null,null,null,null,null,null,null,null,null,null,null,null,null,null,null,null,"ابريل",4]
[null,null,null,null,null,null,null,null,null,null,null,null,null,null,null,null,null,null,null,null,null,null,null,null,null,"مايو",5]
[null,null,null,null,null,null,null,null,null,null,null,null,null,null,null,null,null,null,null,null,null,null,null,null,null,"يونيو",6]
[null,null,null,null,null,null,null,null,null,null,null,null,null,null,null,null,null,null,null,null,null,null,null,null,null,"يوليو",7]
{"$rows_left_out":6}
{"sheet":"قائمة الموظفين","index":1,"n_rows":22,"n_cols":24,"rows_kept":22,"cut":false,"hidden":false,"merged":[[0,20,0,21],[0,0,1,0],[0,4,0,5],[0,1,1,1],[0,2,1,2],[0,3,1,3]]}
["الكود","الاسم","الوظيفه","الاساسى","التامين",null,null,null,null,null,null,null,null,null,null,null,null,null,null,null,"رصيد الاجازات"]
[null,null,null,null,"الثابت","المتغير","اجر اليوم","اجر الساعه","اضافى 1","اضافى2","عطلات","الحافز","بدل اغتراب ","بدل مواصلات","بدل وجبه","بدل غلاء معيشه","بدل موبايل","بدل ملبس","بدل طبيعة عمل","قرض","اعتيادى 21","عارضه 6","ت اجتماعى","ت طبى خاص"]
[100001,"احمد امام","مدير ادارى",3000,750,750,{"$f":"SUM(D3+F3+E3)/30","v":150},{"$f":"G3/8","v":18.75},{"$f":"H3*1.5","v":28.125},{"$f":"H3*2","v":37.5},{"$f":"H3*2","v":37.5},1000,100,600,250,150,100,50,50,{"$f":"-12000-Input!AC37","v":-12500},{"$f":"21-IF(A3=Input!$A$6,Input!P37,0)","v":21},6,{"$f":"-140","v":-140},{"$f":"-100","v":-100}]
[100002,"احمد السيد","امين مخزن ",2000,500,500,{"$f":"SUM(D4+F4+E4)/30","v":100},{"$f":"G4/8","v":12.5},{"$f":"H4*1.5","v":18.75},{"$f":"H4*2","v":25},{"$f":"H4*2","v":25},800,100,600,300,150,null,null,50,-10000,{"$f":"21-IF(A4=Input!$A$6,Input!P37,0)","v":21},6,{"$f":"-140","v":-140},{"$f":"-100","v":-100}]
[100003,"يسرى موافى","فنى ",1500,500,500,83.333333333333329,10.416666666666666,15.625,20.833333333333332,20.833333333333332,750,null,650,350,null,50,null,100,-9000,{"$f":"21-IF(A5=Input!$A$6,Input!P37,0)","v":21},6,-140,-100]
[100004,"صالح محمد ","عامل ",1800,null,null,60,7.5,11.25,15,15,1000,null,500,300,200,null,null,500,-8000,{"$f":"21-IF(A6=Input!$A$6,Input!P37,0)","v":21},6,-140,-100]
[100005,"مراد الشافعى ","عامل ",1750,250,250,75,9.375,14.0625,18.75,18.75,500,100,200,100,null,50,null,100,-7000,null,6,-140,-100]
[100006,"محمد على ","مدير ادارى",1500,150,150,60,7.5,11.25,15,15,800,null,750,null,200,null,100,null,-500,null,6,-140,-100]
[100007,"عبد الواحد السيد ","عامل ",4000,500,500,166.66666666666666,20.833333333333332,31.25,41.666666666666664,41.666666666666664,null,100,500,null,150,null,null,100,-1000,null,6,-140,-100]
[100008,"احمد فتحى ","مساعد فنى ",3000,400,400,126.66666666666667,15.833333333333334,23.75,31.666666666666668,31.666666666666668,500,200,100,100,100,50,50,50,-1500,null,6,-140,-100]
{"$rows_left_out":13}
{"sheet":"Input","index":2,"n_rows":37,"n_cols":31,"rows_kept":37,"cut":false,"hidden":false,"merged":[[0,2,1,8],[0,9,1,15],[0,0,1,1],[5,0,35,0],[36,0,36,1]]}
[2020,null,"مدخلات شهر",null,null,null,null,null,null,"يناير"]
[]
["الاسم",{"$f":"IFERROR(VLOOKUP(A6,'قائمة الموظفين'!A:C,2,0),\"\")","v":"احمد امام"},"اجمالى  المستحق",null,{"$f":"H4+M4+N4+O4+P4+Q4+X4+T4+U4+V4+W4+X4+Y4+Z4+AA4","v":10503.333333333332},"الصافى ",{"$f":"E3+E4","v":10740.833333333332},null,null,null,null,{"$f":"IF(K37=0,0,IF(K37=1,0.25,IF(K37=2,0.75,IF(K37=3,1.75,K37-2+0.75))))","v":0}]
["الوظيفه",{"$f":"IFERROR(VLOOKUP(A6,'قائمة الموظفين'!A1:C1048575,3,0),\"\")","v":"مدير ادارى"},"اجمالى الاستقطاعات",null,{"$f":"K4+L4+R4+S4+AB4+AC6+AD37+AE37","v":237.5},null,null,{"$f":"IFERROR($H37*VLOOKUP($A6,'قائمة الموظفين'!$A$3:$V$500,8,0),\"\")","v":8981.25},null,{"$f":"J37","v":0},{"$f":"IFERROR(IF(K37>2,-(K37-2)*VLOOKUP($A6,'قائمة الموظفين'!$A$3:$X$500,7,0),0),\"\")","v":0},{"$f":"IFERROR($L37*VLOOKUP($A6,'قائمة الموظفين'!$A$3:$X$500,8,0),\"\")","v":-262.5},{"$f":"IFERROR($M37*VLOOKUP($A6,'قائمة الموظفين'!$A$3:$X$500,9,0),\"\")","v":168.75},{"$f":"IFERROR($N37*VLOOKUP($A6,'قائمة الموظفين'!$A$3:$X$500,10,0),\"\")","v":0},{"$f":"IFERROR($O37*VLOOKUP($A6,'قائمة الموظفين'!$A$3:$X$500,11,0),\"\")","v":0},{"$f":"IFERROR($P37*VLOOKUP($A6,'قائمة الموظفين'!$A$3:$X$500,7,0),\"\")","v":0},{"$f":"IFERROR($Q37*VLOOKUP($A6,'قائمة الموظفين'!$A$3:$X$500,7,0),\"\")","v":0},{"$f":"IFERROR(-$R37*VLOOKUP($A6,'قائمة الموظفين'!$A$3:$X$500,7,0),\"\")","v":0},{"$f":"IFERROR(-$S37*2*VLOOKUP($A6,'قائمة الموظفين'!$A$3:$X$500,7,0),\"\")","v":0},{"$f":"T37","v":96.666666666666643},580,241.66666666666677,145,96.666666666666643,48.333333333333321,{"$f":"Z37","v":48.333333333333321},{"$f":"IFERROR(AA37*VLOOKUP($A6,'قائمة الموظفين'!$A$3:$X$500,7,0),\"\")","v":0},{"$f":"IFERROR(-AB37*VLOOKUP($A6,'قائمة الموظفين'!$A$3:$X$500,7,0),\"\")","v":0},{"$f":"IFERROR(VLOOKUP($A6,'قائمة الموظفين'!$A$3:$X$500,20,0),\"\")","v":-12500},{"$f":"IFERROR(VLOOKUP($A6,'قائمة الموظفين'!$A$3:$X$500,23,0),\"\")","v":-140},{"$f":"IFERROR(VLOOKUP($A6,'قائمة الموظفين'!$A$3:$X$500,24,0),\"\")","v":-100}]
["الكود","اليوم","التــــــــــــاريخ","اذن تأخير ","الحضور","الانصراف","عدد الساعات ","الفعلى","عدد الاضافى","التأخير\nساعات","عدد\nالتأخيرات","الفاقد","اضافى 1","اضافى2","عطلات","اعتيادى 21","عارضه 6","غياب باذن","غياب بدون اذن","بدل اغتراب ","بدل مواصلات","بدل وجبه","بدل غلاء معيشه","بدل موبايل","بدل ملبس","بدل طبيعة عمل","مكافات","جزاء","قرض","ت اجتماعى","ت طبى خاص"]
[100001,{"$f":"C6","v":"2020-01-01"},{"$f":"IF(MONTH(DATE($A$1,VLOOKUP($J$1,الرئيسية!$Z$4:$AA$15,2,0),ROWS($A$1:A1)))>VLOOKUP($J$1,الرئيسية!$Z$4:$AA$15,2,0),\"\",DATE($A$1,VLOOKUP($J$1,الرئيسية!$Z$4:$AA$15,2,0),ROWS($A$1:A1)))","v":"2020-01-01"},null,null,null,{"$f":"$F6-E6","v":0},{"$f":"IF($E6=9.25,G6+0.25,F6-E6)","v":0},{"$f":"IF($F6>17,$F6-17,0)","v":0},{"$f":"IF($E6>9.25,E6-9,0)","v":0},{"$f":"IF(D6=\"اذن تاخير\",0,IF($J6>0,1,0))","v":0},{"$f":"IF(F6>=17,0,IF(F6=0,0,F6-17))","v":0},{"$f":"IF($I6>3,3,I6)","v":0},null,null,null,null,null,null,{"$f":"IF($G6>=1,VLOOKUP($A$6,'قائمة الموظفين'!$A$3:$V$500,13,0)/30,0)","v":0},{"$f":"IF($G6>=1,VLOOKUP($A$6,'قائمة الموظفين'!$A$3:$V$500,14,0)/30,0)","v":0},{"$f":"IF($G6>=1,VLOOKUP($A$6,'قائمة الموظفين'!$A$3:$V$500,15,0)/30,0)","v":0},{"$f":"IF($G6>=1,VLOOKUP($A$6,'قائمة الموظفين'!$A$3:$V$500,16,0)/30,0)","v":0},{"$f":"IF($G6>=1,VLOOKUP($A$6,'قائمة الموظفين'!$A$3:$V$500,17,0)/30,0)","v":0},{"$f":"IF($G6>=1,VLOOKUP($A$6,'قائمة الموظفين'!$A$3:$V$500,18,0)/30,0)","v":0},{"$f":"IF($G6>=1,VLOOKUP($A$6,'قائمة الموظفين'!$A$3:$V$500,19,0)/30,0)","v":0},null,null,500,"لا يخصم","لا يخصم"]
[null,{"$f":"C7","v":"2020-01-02"},{"$f":"IF(MONTH(DATE($A$1,VLOOKUP($J$1,الرئيسية!$Z$4:$AA$15,2,0),ROWS($A$1:A2)))>VLOOKUP($J$1,الرئيسية!$Z$4:$AA$15,2,0),\"\",DATE($A$1,VLOOKUP($J$1,الرئيسية!$Z$4:$AA$15,2,0),ROWS($A$1:A2)))","v":"2020-01-02"},null,null,null,{"$f":"$F7-E7","v":0},{"$f":"IF($E7=9.25,G7+0.25,F7-E7)","v":0},{"$f":"IF($F7>17,$F7-17,0)","v":0},{"$f":"IF($E7>9.25,E7-9,0)","v":0},{"$f":"IF(D7=\"اذن تاخير\",0,IF($J7>0,1,0))","v":0},{"$f":"IF(F7>=17,0,IF(F7=0,0,F7-17))","v":0},{"$f":"IF($I7>3,3,I7)","v":0},null,null,null,null,null,null,{"$f":"IF($G7>=1,VLOOKUP($A$6,'قائمة الموظفين'!$A$3:$V$500,13,0)/30,0)","v":0},{"$f":"IF($G7>=1,VLOOKUP($A$6,'قائمة الموظفين'!$A$3:$V$500,14,0)/30,0)","v":0},{"$f":"IF($G7>=1,VLOOKUP($A$6,'قائمة الموظفين'!$A$3:$V$500,15,0)/30,0)","v":0},{"$f":"IF($G7>=1,VLOOKUP($A$6,'قائمة الموظفين'!$A$3:$V$500,16,0)/30,0)","v":0},{"$f":"IF($G7>=1,VLOOKUP($A$6,'قائمة الموظفين'!$A$3:$V$500,17,0)/30,0)","v":0},{"$f":"IF($G7>=1,VLOOKUP($A$6,'قائمة الموظفين'!$A$3:$V$500,18,0)/30,0)","v":0},{"$f":"IF($G7>=1,VLOOKUP($A$6,'قائمة الموظفين'!$A$3:$V$500,19,0)/30,0)","v":0}]
[null,"2020-01-03",{"$f":"IF(MONTH(DATE($A$1,VLOOKUP($J$1,الرئيسية!$Z$4:$AA$15,2,0),ROWS($A$1:A3)))>VLOOKUP($J$1,الرئيسية!$Z$4:$AA$15,2,0),\"\",DATE($A$1,VLOOKUP($J$1,الرئيسية!$Z$4:$AA$15,2,0),ROWS($A$1:A3)))","v":"2020-01-03"},null,null,16,16,16,0,0,0,-1,0,null,null,null,null,null,null,{"$f":"IF($G8>=1,VLOOKUP($A$6,'قائمة الموظفين'!$A$3:$V$500,13,0)/30,0)","v":3.3333333333333335},{"$f":"IF($G8>=1,VLOOKUP($A$6,'قائمة الموظفين'!$A$3:$V$500,14,0)/30,0)","v":20},{"$f":"IF($G8>=1,VLOOKUP($A$6,'قائمة الموظفين'!$A$3:$V$500,15,0)/30,0)","v":8.3333333333333339},{"$f":"IF($G8>=1,VLOOKUP($A$6,'قائمة الموظفين'!$A$3:$V$500,16,0)/30,0)","v":5},{"$f":"IF($G8>=1,VLOOKUP($A$6,'قائمة الموظفين'!$A$3:$V$500,17,0)/30,0)","v":3.3333333333333335},{"$f":"IF($G8>=1,VLOOKUP($A$6,'قائمة الموظفين'!$A$3:$V$500,18,0)/30,0)","v":1.6666666666666667},{"$f":"IF($G8>=1,VLOOKUP($A$6,'قائمة الموظفين'!$A$3:$V$500,19,0)/30,0)","v":1.6666666666666667}]
[null,"2020-01-04",{"$f":"IF(MONTH(DATE($A$1,VLOOKUP($J$1,الرئيسية!$Z$4:$AA$15,2,0),ROWS($A$1:A4)))>VLOOKUP($J$1,الرئيسية!$Z$4:$AA$15,2,0),\"\",DATE($A$1,VLOOKUP($J$1,الرئيسية!$Z$4:$AA$15,2,0),ROWS($A$1:A4)))","v":"2020-01-04"},null,null,16,16,16,0,0,0,-1,0,null,null,null,null,null,null,{"$f":"IF($G9>=1,VLOOKUP($A$6,'قائمة الموظفين'!$A$3:$V$500,13,0)/30,0)","v":3.3333333333333335},{"$f":"IF($G9>=1,VLOOKUP($A$6,'قائمة الموظفين'!$A$3:$V$500,14,0)/30,0)","v":20},{"$f":"IF($G9>=1,VLOOKUP($A$6,'قائمة الموظفين'!$A$3:$V$500,15,0)/30,0)","v":8.3333333333333339},{"$f":"IF($G9>=1,VLOOKUP($A$6,'قائمة الموظفين'!$A$3:$V$500,16,0)/30,0)","v":5},{"$f":"IF($G9>=1,VLOOKUP($A$6,'قائمة الموظفين'!$A$3:$V$500,17,0)/30,0)","v":3.3333333333333335},{"$f":"IF($G9>=1,VLOOKUP($A$6,'قائمة الموظفين'!$A$3:$V$500,18,0)/30,0)","v":1.6666666666666667},{"$f":"IF($G9>=1,VLOOKUP($A$6,'قائمة الموظفين'!$A$3:$V$500,19,0)/30,0)","v":1.6666666666666667}]
[null,"2020-01-05",{"$f":"IF(MONTH(DATE($A$1,VLOOKUP($J$1,الرئيسية!$Z$4:$AA$15,2,0),ROWS($A$1:A5)))>VLOOKUP($J$1,الرئيسية!$Z$4:$AA$15,2,0),\"\",DATE($A$1,VLOOKUP($J$1,الرئيسية!$Z$4:$AA$15,2,0),ROWS($A$1:A5)))","v":"2020-01-05"},null,null,17,17,17,0,0,0,0,0,null,null,null,null,null,null,{"$f":"IF($G10>=1,VLOOKUP($A$6,'قائمة الموظفين'!$A$3:$V$500,13,0)/30,0)","v":3.3333333333333335},{"$f":"IF($G10>=1,VLOOKUP($A$6,'قائمة الموظفين'!$A$3:$V$500,14,0)/30,0)","v":20},{"$f":"IF($G10>=1,VLOOKUP($A$6,'قائمة الموظفين'!$A$3:$V$500,15,0)/30,0)","v":8.3333333333333339},{"$f":"IF($G10>=1,VLOOKUP($A$6,'قائمة الموظفين'!$A$3:$V$500,16,0)/30,0)","v":5},{"$f":"IF($G10>=1,VLOOKUP($A$6,'قائمة الموظفين'!$A$3:$V$500,17,0)/30,0)","v":3.3333333333333335},{"$f":"IF($G10>=1,VLOOKUP($A$6,'قائمة الموظفين'!$A$3:$V$500,18,0)/30,0)","v":1.6666666666666667},{"$f":"IF($G10>=1,VLOOKUP($A$6,'قائمة الموظفين'!$A$3:$V$500,19,0)/30,0)","v":1.6666666666666667}]
{"$rows_left_out":28}
{"sheet":"الشيت ","index":3,"n_rows":18,"n_cols":4,"rows_kept":18,"cut":false,"hidden":false,"merged":[]}
["الكود ","الاسم ","الوظيفه","الشهر"]
[100002,{"$f":"VLOOKUP(A2,'قائمة الموظفين'!$A$3:$C$1048575,2,0)","v":"احمد السيد"},{"$f":"VLOOKUP(A2,'قائمة الموظفين'!$A$3:$C$1048575,3,0)","v":"امين مخزن "}]
[]
["عدد ايام العمل "]
["ساعات الاضافى 1"]
["ساعات الاضافى 2 "]
["اجازه اعتيادى "]
["اجازه عارضه "]
["غياب باذن "]
["غياب بدون اذن "]
{"$rows_left_out":9}
{"sheet":"Data","index":4,"n_rows":22,"n_cols":8,"rows_kept":22,"cut":false,"hidden":false,"merged":[]}
["م","الحافز","الوظيفه","الراتب الاساسى","التامينات","الكود","الاسم","الوظيفه"]
[1,3000,"مدير ادارى",5000,"يخصم"]
[2,2000,"رئيس قسم ",4000,"لا يخصم",100001,"احمد امام","رئيس قسم "]
[3,1500,"فنى ",3500,null,100002,"احمد السيد","امين مخزن "]
[4,1200,"مساعد فنى ",3000,null,100003,"يسرى موافى","فنى "]
[5,1000,"عامل ",2800,null,100004,"صالح محمد ","عامل "]
[6,1500,"امين مخزن ",3400,null,100005,"مراد الشافعى ","عامل "]
[7,1100,"مساعد امين مخزن ",3000,null,100006,"محمد على ","مدير ادارى"]
[8,4000,"مدير حسابات",6000,null,100007,"عبد الواحد السيد ","عامل "]
[9,2800,"محاسب",3800,null,100008,"احمد فتحى ","مساعد فنى "]
{"$rows_left_out":13}
{"sheet":"يناير","index":5,"n_rows":36,"n_cols":31,"rows_kept":36,"cut":false,"hidden":false,"merged":[]}
["الكود","اليوم","التــــــــــــاريخ",null,"الحضور","الانصراف","عدد الساعات ","الفعلى","عدد الاضافى","التأخير\nساعات","عدد\nالتأخيرات","الفاقد","اضافى 1","اضافى2","عطلات","اعتيادى 21","عارضه 6","غياب باذن","غياب بدون اذن","بدل اغتراب ","بدل مواصلات","بدل وجبه","بدل غلاء معيشه","بدل موبايل","بدل ملبس","بدل طبيعة عمل","مكافات","جزاء","قرض","ت اجتماعى","ت طبى خاص"]
["الاسم","","اجمالى  المستحق",null,{"$error":"#VALUE!"},"الصافى ",{"$error":"#VALUE!"},null,null,null,null,0]
["الوظيفه","","اجمالى الاستقطاعات",null,{"$error":"#VALUE!"},null,null,"",null,0,0,"","","","","","","","",{"$error":"#N/A"},{"$error":"#N/A"},{"$error":"#N/A"},{"$error":"#N/A"},{"$error":"#N/A"},{"$error":"#N/A"},{"$error":"#N/A"},"","","","",""]
["الكود","اليوم","التــــــــــــاريخ","اذن تأخير ","الحضور","الانصراف","عدد الساعات ","الفعلى","عدد الاضافى","التأخير\nساعات","عدد\nالتأخيرات","الفاقد","اضافى 1","اضافى2","عطلات","اعتيادى 21","عارضه 6","غياب باذن","غياب بدون اذن","بدل اغتراب ","بدل مواصلات","بدل وجبه","بدل غلاء معيشه","بدل موبايل","بدل ملبس","بدل طبيعة عمل","مكافات","جزاء","قرض","ت اجتماعى","ت طبى خاص"]
[null,"2020-01-01","2020-01-01",null,null,null,0,0,0,0,0,0,0,0,null,1,null,null,null,0,0,0,0,0,0,0,null,null,500,"لا يخصم","لا يخصم"]
[null,"2020-01-02","2020-01-02",null,null,null,0,0,0,0,0,0,0,0,null,null,1,null,null,0,0,0,0,0,0,0]
[null,"2020-01-03","2020-01-03",null,null,16,16,16,0,0,0,-1,0,0,null,null,null,null,null,{"$error":"#N/A"},{"$error":"#N/A"},{"$error":"#N/A"},{"$error":"#N/A"},{"$error":"#N/A"},{"$error":"#N/A"},{"$error":"#N/A"}]
[null,"2020-01-04","2020-01-04",null,null,16,16,16,0,0,0,-1,0,0,null,null,null,null,null,{"$error":"#N/A"},{"$error":"#N/A"},{"$error":"#N/A"},{"$error":"#N/A"},{"$error":"#N/A"},{"$error":"#N/A"},{"$error":"#N/A"}]
[null,"2020-01-05","2020-01-05",null,null,17,17,17,0,0,0,0,0,0,null,null,null,null,null,{"$error":"#N/A"},{"$error":"#N/A"},{"$error":"#N/A"},{"$error":"#N/A"},{"$error":"#N/A"},{"$error":"#N/A"},{"$error":"#N/A"}]
[null,"2020-01-06","2020-01-06",null,null,16,16,16,0,0,0,-1,0,0,null,null,null,null,null,{"$error":"#N/A"},{"$error":"#N/A"},{"$error":"#N/A"},{"$error":"#N/A"},{"$error":"#N/A"},{"$error":"#N/A"},{"$error":"#N/A"}]
{"$rows_left_out":27}
{"sheet":"فبراير","index":6,"n_rows":36,"n_cols":31,"rows_kept":36,"cut":false,"hidden":false,"merged":[]}
["الكود","اليوم","التــــــــــــاريخ","الحضور","الانصراف","عدد الساعات ","الفعلى","عدد الاضافى","التأخير\nساعات","عدد\nالتأخيرات","الفاقد","اضافى 1","اضافى2","عطلات","اعتيادى 21","عارضه 6","غياب باذن","غياب بدون اذن","بدل اغتراب ","بدل مواصلات","بدل وجبه","بدل غلاء معيشه","بدل موبايل","بدل ملبس","بدل طبيعة عمل","مكافات","جزاء","قرض","ت اجتماعى","ت طبى خاص"]
["الاسم","احمد امام","اجمالى  المستحق",null,5679.8958333333339,"الصافى ",5317.3958333333339,null,null,null,null,4.75]
["الوظيفه","مدير ادارى","اجمالى الاستقطاعات",null,-362.5,null,null,3857.8125,null,12.25,-600,-262.5,168.75,0,0,150,150,0,0,96.666666666666643,580,241.66666666666677,145,96.666666666666643,48.333333333333321,48.333333333333321,0,0,-12500,-140,-100]
["الكود","اليوم","التــــــــــــاريخ","اذن تأخير ","الحضور","الانصراف","عدد الساعات ","الفعلى","عدد الاضافى","التأخير\nساعات","عدد\nالتأخيرات","الفاقد","اضافى 1","اضافى2","عطلات","اعتيادى 21","عارضه 6","غياب باذن","غياب بدون اذن","بدل اغتراب ","بدل مواصلات","بدل وجبه","بدل غلاء معيشه","بدل موبايل","بدل ملبس","بدل طبيعة عمل","مكافات","جزاء","قرض","ت اجتماعى","ت طبى خاص"]
[100001,"2020-02-01","2020-02-01",null,null,null,0,0,0,0,0,0,0,0,null,1,null,null,null,0,0,0,0,0,0,0,null,null,500,"لا يخصم","لا يخصم"]
[null,"2020-02-02","2020-02-02",null,null,null,0,0,0,0,0,0,0,0,null,null,1,null,null,0,0,0,0,0,0,0]
[null,"2020-02-03","2020-02-03",null,9,16,7,7,0,0,0,-1,0,0,null,null,null,null,null,3.3333333333333335,20,8.3333333333333339,5,3.3333333333333335,1.6666666666666667,1.6666666666666667]
[null,"2020-02-04","2020-02-04",null,10,16,6,6,0,1,1,-1,0,0,null,null,null,null,null,3.3333333333333335,20,8.3333333333333339,5,3.3333333333333335,1.6666666666666667,1.6666666666666667]
[null,"2020-02-05","2020-02-05",null,11,17,6,6,0,2,1,0,0,0,null,null,null,null,null,3.3333333333333335,20,8.3333333333333339,5,3.3333333333333335,1.6666666666666667,1.6666666666666667]
[null,"2020-02-06","2020-02-06",null,11,16,5,5,0,2,1,-1,0,0,null,null,null,null,null,3.3333333333333335,20,8.3333333333333339,5,3.3333333333333335,1.6666666666666667,1.6666666666666667]
{"$rows_left_out":27}
{"sheet":"مارس","index":7,"n_rows":1,"n_cols":30,"rows_kept":1,"cut":false,"hidden":false,"merged":[]}
["الكود","اليوم","التــــــــــــاريخ","الحضور","الانصراف","عدد الساعات ","الفعلى","عدد الاضافى","التأخير\nساعات","عدد\nالتأخيرات","الفاقد","اضافى 1","اضافى2","عطلات","اعتيادى 21","عارضه 6","غياب باذن","غياب بدون اذن","بدل اغتراب ","بدل مواصلات","بدل وجبه","بدل غلاء معيشه","بدل موبايل","بدل ملبس","بدل طبيعة عمل","مكافات","جزاء","قرض","ت اجتماعى","ت طبى خاص"]

{"sheet":"ابريل","index":8,"n_rows":1,"n_cols":30,"rows_kept":1,"cut":false,"hidden":false,"merged":[]}
["الكود","اليوم","التــــــــــــاريخ","الحضور","الانصراف","عدد الساعات ","الفعلى","عدد الاضافى","التأخير\nساعات","عدد\nالتأخيرات","الفاقد","اضافى 1","اضافى2","عطلات","اعتيادى 21","عارضه 6","غياب باذن","غياب بدون اذن","بدل اغتراب ","بدل مواصلات","بدل وجبه","بدل غلاء معيشه","بدل موبايل","بدل ملبس","بدل طبيعة عمل","مكافات","جزاء","قرض","ت اجتماعى","ت طبى خاص"]

{"sheet":"مايو","index":9,"n_rows":1,"n_cols":30,"rows_kept":1,"cut":false,"hidden":false,"merged":[]}
["الكود","اليوم","التــــــــــــاريخ","الحضور","الانصراف","عدد الساعات ","الفعلى","عدد الاضافى","التأخير\nساعات","عدد\nالتأخيرات","الفاقد","اضافى 1","اضافى2","عطلات","اعتيادى 21","عارضه 6","غياب باذن","غياب بدون اذن","بدل اغتراب ","بدل مواصلات","بدل وجبه","بدل غلاء معيشه","بدل موبايل","بدل ملبس","بدل طبيعة عمل","مكافات","جزاء","قرض","ت اجتماعى","ت طبى خاص"]

{"sheet":"يونيو","index":10,"n_rows":1,"n_cols":30,"rows_kept":1,"cut":false,"hidden":false,"merged":[]}
["الكود","اليوم","التــــــــــــاريخ","الحضور","الانصراف","عدد الساعات ","الفعلى","عدد الاضافى","التأخير\nساعات","عدد\nالتأخيرات","الفاقد","اضافى 1","اضافى2","عطلات","اعتيادى 21","عارضه 6","غياب باذن","غياب بدون اذن","بدل اغتراب ","بدل مواصلات","بدل وجبه","بدل غلاء معيشه","بدل موبايل","بدل ملبس","بدل طبيعة عمل","مكافات","جزاء","قرض","ت اجتماعى","ت طبى خاص"]

{"sheet":"يوليو","index":11,"n_rows":33,"n_cols":30,"rows_kept":33,"cut":false,"hidden":false,"merged":[]}
["الكود","اليوم","التــــــــــــاريخ","الحضور","الانصراف","عدد الساعات ","الفعلى","عدد الاضافى","التأخير\nساعات","عدد\nالتأخيرات","الفاقد","اضافى 1","اضافى2","عطلات","اعتيادى 21","عارضه 6","غياب باذن","غياب بدون اذن","بدل اغتراب ","بدل مواصلات","بدل وجبه","بدل غلاء معيشه","بدل موبايل","بدل ملبس","بدل طبيعة عمل","مكافات","جزاء","قرض","ت اجتماعى","ت طبى خاص"]
[]
[]
[]
[]
[]
[]
[]
[]
[]
{"$rows_left_out":24}
{"sheet":"اغسطس","index":12,"n_rows":1,"n_cols":30,"rows_kept":1,"cut":false,"hidden":false,"merged":[]}
["الكود","اليوم","التــــــــــــاريخ","الحضور","الانصراف","عدد الساعات ","الفعلى","عدد الاضافى","التأخير\nساعات","عدد\nالتأخيرات","الفاقد","اضافى 1","اضافى2","عطلات","اعتيادى 21","عارضه 6","غياب باذن","غياب بدون اذن","بدل اغتراب ","بدل مواصلات","بدل وجبه","بدل غلاء معيشه","بدل موبايل","بدل ملبس","بدل طبيعة عمل","مكافات","جزاء","قرض","ت اجتماعى","ت طبى خاص"]

{"sheet":"سبتمبر","index":13,"n_rows":1,"n_cols":30,"rows_kept":1,"cut":false,"hidden":false,"merged":[]}
["الكود","اليوم","التــــــــــــاريخ","الحضور","الانصراف","عدد الساعات ","الفعلى","عدد الاضافى","التأخير\nساعات","عدد\nالتأخيرات","الفاقد","اضافى 1","اضافى2","عطلات","اعتيادى 21","عارضه 6","غياب باذن","غياب بدون اذن","بدل اغتراب ","بدل مواصلات","بدل وجبه","بدل غلاء معيشه","بدل موبايل","بدل ملبس","بدل طبيعة عمل","مكافات","جزاء","قرض","ت اجتماعى","ت طبى خاص"]

{"sheet":"اكتوبر","index":14,"n_rows":1,"n_cols":30,"rows_kept":1,"cut":false,"hidden":false,"merged":[]}
["الكود","اليوم","التــــــــــــاريخ","الحضور","الانصراف","عدد الساعات ","الفعلى","عدد الاضافى","التأخير\nساعات","عدد\nالتأخيرات","الفاقد","اضافى 1","اضافى2","عطلات","اعتيادى 21","عارضه 6","غياب باذن","غياب بدون اذن","بدل اغتراب ","بدل مواصلات","بدل وجبه","بدل غلاء معيشه","بدل موبايل","بدل ملبس","بدل طبيعة عمل","مكافات","جزاء","قرض","ت اجتماعى","ت طبى خاص"]

{"sheet":"نوفمبر","index":15,"n_rows":1,"n_cols":30,"rows_kept":1,"cut":false,"hidden":false,"merged":[]}
["الكود","اليوم","التــــــــــــاريخ","الحضور","الانصراف","عدد الساعات ","الفعلى","عدد الاضافى","التأخير\nساعات","عدد\nالتأخيرات","الفاقد","اضافى 1","اضافى2","عطلات","اعتيادى 21","عارضه 6","غياب باذن","غياب بدون اذن","بدل اغتراب ","بدل مواصلات","بدل وجبه","بدل غلاء معيشه","بدل موبايل","بدل ملبس","بدل طبيعة عمل","مكافات","جزاء","قرض","ت اجتماعى","ت طبى خاص"]

{"sheet":"ديسمبر","index":16,"n_rows":1,"n_cols":30,"rows_kept":1,"cut":false,"hidden":false,"merged":[]}
["الكود","اليوم","التــــــــــــاريخ","الحضور","الانصراف","عدد الساعات ","الفعلى","عدد الاضافى","التأخير\nساعات","عدد\nالتأخيرات","الفاقد","اضافى 1","اضافى2","عطلات","اعتيادى 21","عارضه 6","غياب باذن","غياب بدون اذن","بدل اغتراب ","بدل مواصلات","بدل وجبه","بدل غلاء معيشه","بدل موبايل","بدل ملبس","بدل طبيعة عمل","مكافات","جزاء","قرض","ت اجتماعى","ت طبى خاص"]