{"text_format":"1","workbook":"xlsx","n_sheets":2,"sheets":["الدرجات","الشهادات"],"not_rendered":{"charts":0,"images":1,"macros":1,"external_links":0,"defined_names":3,"comments":0,"pivot_tables":0},"unopened":[],"bounds":{"document_bytes":16777216,"sheet_cells":100000,"rows_first":2000,"rows_last":500,"rows_between":2000,"halvings":0,"cell_chars":16384,"cell_head_chars":4096},"cells_cut":0,"cells_raw":0,"read":"whole","date_system":"1900"}

{"sheet":"الدرجات","index":0,"n_rows":507,"n_cols":182,"rows_kept":507,"cut":false,"hidden":false,"merged":[[4,18,5,18],[4,19,6,19],[4,13,5,13],[4,14,5,14],[4,15,5,15],[4,16,5,16],[4,17,5,17],[4,1,6,1],[4,0,6,0],[4,12,5,12],[4,7,5,7],[4,8,5,8],[4,9,5,9],[4,10,5,10],[4,11,5,11],[4,2,6,2],[4,4,4,6],[4,3,6,3]]}
[]
[]
[null,null,null,null,null,null,null,null,null,null,null,null,null,null,null,null,null,null,null,null,null,null,null,null,null,null,null,null,null,null,null,null,"مستجدة"]
[]
["مسلسل","اسم الطالب","رقم الجلوس","تاريخ الميلاد","السن في",null,null,"لغة عربية","رياضيات","دراسات","لغة إنجليزية","علوم","مجموع","اختيارى 1","اختيارى 2","رياضى","فنى","حاسب آلى","تربية دينية","المجموع بالحروف"]
[null,null,null,null,1,10,2021,null,null,null,null,null,null,null,null,null,null,null,null,null,null,null,null,null,null,null,null,null,null,null,null,null,null,null,null,null,null,null,null,null,null,null,null,null,"مسلم"]
[null,null,null,null,"يوم","شهر","سنة",100,80,40,40,40,300,20,20,40,20,20,40,null,null,null,null,null,null,null,null,null,null,null,null,null,null,null,null,null,null,null,null,null,null,null,null,null,"مسلمة",null,null,null,null,null,null,null,null,null,null,null,null,null,null,null,null,null,null,null,null,null,null,null,null,null,null,null,null,null,null,null,null,null,null,null,null,null,null,null,null,null,null,null,null,null,null,null,null,null,null,null,null,null,null,null,null,null,null,null,null,null,null,null,null,null,null,null,null,null,null,null,null,null,null,null,null,null,null,null,null,null,null,null,null,null,null,null,null,null,null,null,null,null,null,null,null,null,null,null,null,null,null,null,null,null,null,null,null,null,null,null,null,null,null,null,null,null,null,null,null,null,null,null,null,null,null,null,null,null,null,null,null,null,null,"يوم","شهر","سنة"]
[{"$f":"IF(B8=\"\",\"\",ROW()-7)","v":1},"الأمير طلعت تركى نورالدين",296,"2007-02-22",{"$f":"IF(FX8<1,\" \",$E$6+IF($E$6>=FX8,0,30)-FX8)","v":9},{"$f":"IF(FX8<1,\" \",IF((IF($E$6>=FX8,0,-1)+$F$6)>=FY8,(IF($E$6>=FX8,0,-1)+$F$6)-FY8,(IF($FY$8>=FX8,0,-1)+$F$6)+12-FY8))","v":7},{"$f":"IF(FZ8<1,\" \",$G$6+IF($II$8+IF($E$6>=FX8,0,-1)>=FY8,0,-1)-FZ8)","v":13},80.5,73.2,35.6,31.6,35.4,{"$f":"IF(AND(H8=\"\",I8=\"\",J8=\"\",K8=\"\",L8=\"\"),\"\",SUM(H8,I8,J8,K8,L8))","v":256.29999999999995},12,13,26,13.5,14,29,{"$f":"ArbNum2Text(M8,1,1,\"درجـة\",\"درجـات\",1,\"جزء\",\"أجزاء\",1)","v":"مائتان وست وخمسونَ و 0.3 درجـة فقطُ لا غيرَ"},null,null,null,null,null,null,null,null,null,null,null,null,null,null,null,null,null,null,null,null,null,null,null,null,"مسيحي",null,null,null,null,null,null,null,null,null,null,null,null,null,null,null,null,null,null,null,null,null,null,null,null,null,null,null,null,null,null,null,null,null,null,null,null,null,null,null,null,null,null,null,null,null,null,null,null,null,null,null,null,null,null,null,null,null,null,null,null,null,null,null,null,null,null,null,null,null,null,null,null,null,null,null,null,null,null,null,null,null,null,null,null,null,null,null,null,null,null,null,null,null,null,null,null,null,null,null,null,null,null,null,null,null,null,null,null,null,null,null,null,null,null,null,null,null,null,null,null,null,null,null,null,null,null,null,null,null,null,null,null,null,null,{"$f":"IF(D8=\"\",\"\",DAY(D8))","v":22},{"$f":"IF(D8=\"\",\"\",MONTH(D8))","v":2},{"$f":"IF(D8=\"\",\"\",YEAR(D8))","v":2007}]
[{"$f":"IF(B9=\"\",\"\",ROW()-7)","v":2},"أحمد راشد عبدالرحيم عطاالله",297,"2008-02-01",0,8,12,84.5,72.400000000000006,35.799999999999997,30.6,34.799999999999997,{"$f":"IF(AND(H9=\"\",I9=\"\",J9=\"\",K9=\"\",L9=\"\"),\"\",SUM(H9,I9,J9,K9,L9))","v":258.09999999999997},13,13,26,14,14.5,31.6,{"$f":"ArbNum2Text(M9,1,1,\"درجـة\",\"درجـات\",1,\"جزء\",\"أجزاء\",1)","v":"مائتان وثمان وخمسونَ و 0.1 درجـة فقطُ لا غيرَ"},null,null,null,null,null,null,null,null,null,null,null,null,null,null,null,null,null,null,null,null,null,null,null,null,"مسيحية",null,null,null,null,null,null,null,null,null,null,null,null,null,null,null,null,null,null,null,null,null,null,null,null,null,null,null,null,null,null,null,null,null,null,null,null,null,null,null,null,null,null,null,null,null,null,null,null,null,null,null,null,null,null,null,null,null,null,null,null,null,null,null,null,null,null,null,null,null,null,null,null,null,null,null,null,null,null,null,null,null,null,null,null,null,null,null,null,null,null,null,null,null,null,null,null,null,null,null,null,null,null,null,null,null,null,null,null,null,null,null,null,null,null,null,null,null,null,null,null,null,null,null,null,null,null,null,null,null,null,null,null,null,null,1,2,2008]
[3,"أحمد محمد أبوزيد خليفه",299,"2007-12-10",21,9,13,85,74.400000000000006,36.799999999999997,36.799999999999997,36,269,13,14,27,14,14,35.4,"مائتان وتسع وستونَ درجـة فقطُ لا غيرَ",null,null,null,null,null,null,null,null,null,null,null,null,null,null,null,null,null,null,null,null,null,null,null,null,null,null,null,null,null,null,null,null,null,null,null,null,null,null,null,null,null,null,null,null,null,null,null,null,null,null,null,null,null,null,null,null,null,null,null,null,null,null,null,null,null,null,null,null,null,null,null,null,null,null,null,null,null,null,null,null,null,null,null,null,null,null,null,null,null,null,null,null,null,null,null,null,null,null,null,null,null,null,null,null,null,null,null,null,null,null,null,null,null,null,null,null,null,null,null,null,null,null,null,null,null,null,null,null,null,null,null,null,null,null,null,null,null,null,null,null,null,null,null,null,null,null,null,null,null,null,null,null,null,null,null,null,null,null,null,10,12,2007]
[4,"حسام حسن على مهران",301,"2008-01-10",21,8,12,98.5,76.8,36.799999999999997,32,39,283.10000000000002,14,14,27,14.9,15,33.4,"مائتان وثلاث وثمانونَ و 0.1 درجـة فقطُ لا غيرَ",null,null,null,null,null,null,null,null,null,null,null,null,null,null,null,null,null,null,null,null,null,null,null,null,null,null,null,null,null,null,null,null,null,null,null,null,null,null,null,null,null,null,null,null,null,null,null,null,null,null,null,null,null,null,null,null,null,null,null,null,null,null,null,null,null,null,null,null,null,null,null,null,null,null,null,null,null,null,null,null,null,null,null,null,null,null,null,null,null,null,null,null,null,null,null,null,null,null,null,null,null,null,null,null,null,null,null,null,null,null,null,null,null,null,null,null,null,null,null,null,null,null,null,null,null,null,null,null,null,null,null,null,null,null,null,null,null,null,null,null,null,null,null,null,null,null,null,null,null,null,null,null,null,null,null,null,null,null,null,10,1,2008]
[5,"خالد حمدان البدرى كامل",303,"2008-08-16",15,1,12,88,74,36.6,31.6,32,262.2,13,13,27,13.5,14,35,"مائتان واثنتانِ وستونَ و 0.2 درجـة فقطُ لا غيرَ",null,null,null,null,null,null,null,null,null,null,null,null,null,null,null,null,null,null,null,null,null,null,null,null,null,null,null,null,null,null,null,null,null,null,null,null,null,null,null,null,null,null,null,null,null,null,null,null,null,null,null,null,null,null,null,null,null,null,null,null,null,null,null,null,null,null,null,null,null,null,null,null,null,null,null,null,null,null,null,null,null,null,null,null,null,null,null,null,null,null,null,null,null,null,null,null,null,null,null,null,null,null,null,null,null,null,null,null,null,null,null,null,null,null,null,null,null,null,null,null,null,null,null,null,null,null,null,null,null,null,null,null,null,null,null,null,null,null,null,null,null,null,null,null,null,null,null,null,null,null,null,null,null,null,null,null,null,null,null,16,8,2008]
[6,"زياد سعد كامل السمان",304,"2008-04-17",14,5,12,86.5,71.2,34.4,30.6,35.799999999999997,258.5,13,13,27,14,14,32.799999999999997,"مائتان وثمان وخمسونَ و 0.5 درجـة فقطُ لا غيرَ",null,null,null,null,null,null,null,null,null,null,null,null,null,null,null,null,null,null,null,null,null,null,null,null,null,null,null,null,null,null,null,null,null,null,null,null,null,null,null,null,null,null,null,null,null,null,null,null,null,null,null,null,null,null,null,null,null,null,null,null,null,null,null,null,null,null,null,null,null,null,null,null,null,null,null,null,null,null,null,null,null,null,null,null,null,null,null,null,null,null,null,null,null,null,null,null,null,null,null,null,null,null,null,null,null,null,null,null,null,null,null,null,null,null,null,null,null,null,null,null,null,null,null,null,null,null,null,null,null,null,null,null,null,null,null,null,null,null,null,null,null,null,null,null,null,null,null,null,null,null,null,null,null,null,null,null,null,null,null,17,4,2008]
[7,"زياد عاصم هاشم السيد",305,"2008-06-02",29,3,12,86,75.2,34,31.6,36.799999999999997,263.59999999999997,13,13,27,14,14.5,33.799999999999997,"مائتان وثلاث وستونَ و 0.6 درجـة فقطُ لا غيرَ",null,null,null,null,null,null,null,null,null,null,null,null,null,null,null,null,null,null,null,null,null,null,null,null,null,null,null,null,null,null,null,null,null,null,null,null,null,null,null,null,null,null,null,null,null,null,null,null,null,null,null,null,null,null,null,null,null,null,null,null,null,null,null,null,null,null,null,null,null,null,null,null,null,null,null,null,null,null,null,null,null,null,null,null,null,null,null,null,null,null,null,null,null,null,null,null,null,null,null,null,null,null,null,null,null,null,null,null,null,null,null,null,null,null,null,null,null,null,null,null,null,null,null,null,null,null,null,null,null,null,null,null,null,null,null,null,null,null,null,null,null,null,null,null,null,null,null,null,null,null,null,null,null,null,null,null,null,null,null,2,6,2008]
[8,"شريف حسن عاطف حسن",307,"2008-02-04",27,7,12,100,79.2,40,40,40,299.2,14,14,27,14.9,15,39.4,"مائتان وتسع وتسعونَ و 0.2 درجـة فقطُ لا غيرَ",null,null,null,null,null,null,null,null,null,null,null,null,null,null,null,null,null,null,null,null,null,null,null,null,null,null,null,null,null,null,null,null,null,null,null,null,null,null,null,null,null,null,null,null,null,null,null,null,null,null,null,null,null,null,null,null,null,null,null,null,null,null,null,null,null,null,null,null,null,null,null,null,null,null,null,null,null,null,null,null,null,null,null,null,null,null,null,null,null,null,null,null,null,null,null,null,null,null,null,null,null,null,null,null,null,null,null,null,null,null,null,null,null,null,null,null,null,null,null,null,null,null,null,null,null,null,null,null,null,null,null,null,null,null,null,null,null,null,null,null,null,null,null,null,null,null,null,null,null,null,null,null,null,null,null,null,null,null,null,4,2,2008]
[9,"شريف وليد عثمان على",308,"2008-02-18",13,7,12,85,76.8,34.4,32.200000000000003,35,263.40000000000003,13,14,27,12.5,13.5,35.4,"مائتان وثلاث وستونَ و 0.4 درجـة فقطُ لا غيرَ",null,null,null,null,null,null,null,null,null,null,null,null,null,null,null,null,null,null,null,null,null,null,null,null,null,null,null,null,null,null,null,null,null,null,null,null,null,null,null,null,null,null,null,null,null,null,null,null,null,null,null,null,null,null,null,null,null,null,null,null,null,null,null,null,null,null,null,null,null,null,null,null,null,null,null,null,null,null,null,null,null,null,null,null,null,null,null,null,null,null,null,null,null,null,null,null,null,null,null,null,null,null,null,null,null,null,null,null,null,null,null,null,null,null,null,null,null,null,null,null,null,null,null,null,null,null,null,null,null,null,null,null,null,null,null,null,null,null,null,null,null,null,null,null,null,null,null,null,null,null,null,null,null,null,null,null,null,null,null,18,2,2008]
[10,"شعراوى حسين أحمد حسن",309,"2008-09-25",6,0,12,76.5,69.2,32.4,30.6,32.200000000000003,240.89999999999998,13,13,27,14,14.5,30.2,"مائتان وأربعونَ و 0.9 درجـة فقطُ لا غيرَ",null,null,null,null,null,null,null,null,null,null,null,null,null,null,null,null,null,null,null,null,null,null,null,null,null,null,null,null,null,null,null,null,null,null,null,null,null,null,null,null,null,null,null,null,null,null,null,null,null,null,null,null,null,null,null,null,null,null,null,null,null,null,null,null,null,null,null,null,null,null,null,null,null,null,null,null,null,null,null,null,null,null,null,null,null,null,null,null,null,null,null,null,null,null,null,null,null,null,null,null,null,null,null,null,null,null,null,null,null,null,null,null,null,null,null,null,null,null,null,null,null,null,null,null,null,null,null,null,null,null,null,null,null,null,null,null,null,null,null,null,null,null,null,null,null,null,null,null,null,null,null,null,null,null,null,null,null,null,null,25,9,2008]
[11,"عبدالرحمن حماده أحمد محمد",310,"2007-12-08",23,9,13,89.5,79.599999999999994,40,35.4,39.799999999999997,284.3,13,14,26,14,14,36.200000000000003,"مائتان وأربع وثمانونَ و 0.3 درجـة فقطُ لا غيرَ",null,null,null,null,null,null,null,null,null,null,null,null,null,null,null,null,null,null,null,null,null,null,null,null,null,null,null,null,null,null,null,null,null,null,null,null,null,null,null,null,null,null,null,null,null,null,null,null,null,null,null,null,null,null,null,null,null,null,null,null,null,null,null,null,null,null,null,null,null,null,null,null,null,null,null,null,null,null,null,null,null,null,null,null,null,null,null,null,null,null,null,null,null,null,null,null,null,null,null,null,null,null,null,null,null,null,null,null,null,null,null,null,null,null,null,null,null,null,null,null,null,null,null,null,null,null,null,null,null,null,null,null,null,null,null,null,null,null,null,null,null,null,null,null,null,null,null,null,null,null,null,null,null,null,null,null,null,null,null,8,12,2007]
[12,"عبدالرحمن خالد بدرى حمدان",311,"2007-11-17",14,10,13,98.5,79.2,38,33.4,39.799999999999997,288.89999999999998,14,14,27,14.9,14.9,37.799999999999997,"مائتان وثمان وثمانونَ و 0.9 درجـة فقطُ لا غيرَ",null,null,null,null,null,null,null,null,null,null,null,null,null,null,null,null,null,null,null,null,null,null,null,null,null,null,null,null,null,null,null,null,null,null,null,null,null,null,null,null,null,null,null,null,null,null,null,null,null,null,null,null,null,null,null,null,null,null,null,null,null,null,null,null,null,null,null,null,null,null,null,null,null,null,null,null,null,null,null,null,null,null,null,null,null,null,null,null,null,null,null,null,null,null,null,null,null,null,null,null,null,null,null,null,null,null,null,null,null,null,null,null,null,null,null,null,null,null,null,null,null,null,null,null,null,null,null,null,null,null,null,null,null,null,null,null,null,null,null,null,null,null,null,null,null,null,null,null,null,null,null,null,null,null,null,null,null,null,null,17,11,2007]
[13,"عبدالرحمن رمضان على سليم",312,"2008-06-15",16,3,12,75.5,68.8,32.799999999999997,29.4,33.200000000000003,239.70000000000005,10,13,26,12,13.6,31.6,"مائتان وتسع وثلاثونَ و 0.7 درجـة فقطُ لا غيرَ",null,null,null,null,null,null,null,null,null,null,null,null,null,null,null,null,null,null,null,null,null,null,null,null,null,null,null,null,null,null,null,null,null,null,null,null,null,null,null,null,null,null,null,null,null,null,null,null,null,null,null,null,null,null,null,null,null,null,null,null,null,null,null,null,null,null,null,null,null,null,null,null,null,null,null,null,null,null,null,null,null,null,null,null,null,null,null,null,null,null,null,null,null,null,null,null,null,null,null,null,null,null,null,null,null,null,null,null,null,null,null,null,null,null,null,null,null,null,null,null,null,null,null,null,null,null,null,null,null,null,null,null,null,null,null,null,null,null,null,null,null,null,null,null,null,null,null,null,null,null,null,null,null,null,null,null,null,null,null,15,6,2008]
{"$rows_left_out":488}
{"sheet":"الشهادات","index":1,"n_rows":23,"n_cols":25,"rows_kept":23,"cut":false,"hidden":false,"merged":[[22,17,22,22],[22,6,22,16],[26,0,26,2],[22,0,22,5],[21,6,21,16],[21,0,21,5],[10,0,10,22],[21,19,21,22],[13,7,13,9],[13,10,13,12],[12,10,12,12],[14,13,14,15],[13,13,13,15],[13,1,13,3],[13,4,13,6],[15,1,15,3],[15,4,15,6],[15,7,15,9],[15,10,15,12],[15,13,15,15],[0,0,0,8],[1,0,1,8],[2,0,2,8],[3,0,3,8],[6,0,6,1],[5,0,5,19],[4,0,4,22],[12,13,12,15],[12,1,12,3],[12,4,12,6],[12,7,12,9],[14,1,14,3],[14,4,14,6],[14,7,14,9],[14,10,14,12],[19,0,19,26],[7,21,7,22],[17,0,17,6],[17,7,17,22],[7,18,7,20],[9,0,9,1],[9,2,9,7],[9,13,9,17],[16,1,16,3],[16,4,16,6],[16,7,16,9],[16,10,16,12],[16,13,16,15],[7,0,7,1]]}
["محافظة سوهاج",null,null,null,null,null,null,null,null,null,null,null,null,null,null,null,null,null,null,null,null,null,null,"عدد التلاميذ",{"$f":"MAX(الدرجات!$A$8:$A$150)","v":72}]
["إدارة أخميم التعليمية",null,null,null,null,null,null,null,null,null,null,null,null,null,null,null,null,null,null,null,null,null,null,"رقم التلميذ",72]
["مدرسة أحمد عرابى الابتدائية"]
["العام الدراسى  2020/2019"]
["بيان نجاح طالب / درجات"]
["بالكشف فى سجلات قيد امتحان الصف السادس الابتدائى آخر العام وجد أن :- "]
["التلميـــــــــــذ:-",null,{"$f":"IFERROR(VLOOKUP($Y$2,الدرجات!$A$8:$T$150,2,0),\"\")","v":"هاجر أحمد ناصر كامل"},null,null,null,null,null,null,null,null,null,null,null,null,null,null,null,"العام الدراسى  2020/2019"]
["مقيد بمدرسة :-",null," أحمد عرابى الابتدائية",null,null,null,null,null,null,null,null,null,null,null,null,null,null,null,"رقم الجلوس :- ",null,null,{"$f":"IFERROR(VLOOKUP($Y$2,الدرجات!$A$8:$T$150,3,0),\"\")","v":383}]
[null,null,null,null,null,null,null,null,null,null,null,null,null,null,null,null,null,null,"يوم","شهر","سنة"]
["المولود بتاريخ :-",null,{"$f":"IFERROR(VLOOKUP($Y$2,الدرجات!$A$8:$T$150,4,0),\"\")","v":"2008-09-13"},null,null,null,null,null,null,null,null,null,null,"و السن فى أول أكتوبر:-",null,null,null,null,{"$f":"IFERROR(VLOOKUP($Y$2,الدرجات!$A$8:$T$150,5,0),\"\")","v":18},{"$f":"IFERROR(VLOOKUP($Y$2,الدرجات!$A$8:$T$150,6,0),\"\")","v":0},{"$f":"IFERROR(VLOOKUP($Y$2,الدرجات!$A$8:$T$150,7,0),\"\")","v":12}]
["وبيان درجاته / تقديراته كالآتى:-"]
[]
["المادة","اللغة العربية",null,null,"الرياضيات",null,null,"الدراسات",null,null,"اللغة الإنجليزية",null,null,"علوم",null,null,"المجموع الكلى","اختيارى (1)","اختيارى (2)","نشاط رياضى","نشاط فنى","نشاط كمبيوتر","التربية الدينية"]
["النهاية العظمى",100,null,null,80,null,null,40,null,null,40,null,null,40,null,null,300,20,20,20,20,20,40]
["النهاية الصغرى",50,null,null,40,null,null,20,null,null,20,null,null,20,null,null,150,10,10,10,10,10,20]
["درجة التلميذ",{"$f":"IFERROR(VLOOKUP($Y$2,الدرجات!$A$8:$T$150,8,0),\"\")","v":100},{"$f":"IFERROR(VLOOKUP($Y$2,الدرجات!$A$8:$T$150,7,0),\"\")","v":12},{"$f":"IFERROR(VLOOKUP($Y$2,الدرجات!$A$8:$T$150,7,0),\"\")","v":12},{"$f":"IFERROR(VLOOKUP($Y$2,الدرجات!$A$8:$T$150,9,0),\"\")","v":80},{"$f":"IFERROR(VLOOKUP($Y$2,الدرجات!$A$8:$T$150,7,0),\"\")","v":12},{"$f":"IFERROR(VLOOKUP($Y$2,الدرجات!$A$8:$T$150,7,0),\"\")","v":12},{"$f":"IFERROR(VLOOKUP($Y$2,الدرجات!$A$8:$T$150,10,0),\"\")","v":40},{"$f":"IFERROR(VLOOKUP($Y$2,الدرجات!$A$8:$T$150,7,0),\"\")","v":12},{"$f":"IFERROR(VLOOKUP($Y$2,الدرجات!$A$8:$T$150,7,0),\"\")","v":12},{"$f":"IFERROR(VLOOKUP($Y$2,الدرجات!$A$8:$T$150,11,0),\"\")","v":40},{"$f":"IFERROR(VLOOKUP($Y$2,الدرجات!$A$8:$T$150,7,0),\"\")","v":12},{"$f":"IFERROR(VLOOKUP($Y$2,الدرجات!$A$8:$T$150,7,0),\"\")","v":12},{"$f":"IFERROR(VLOOKUP($Y$2,الدرجات!$A$8:$T$150,12,0),\"\")","v":39.6},{"$f":"IFERROR(VLOOKUP($Y$2,الدرجات!$A$8:$T$150,7,0),\"\")","v":12},{"$f":"IFERROR(VLOOKUP($Y$2,الدرجات!$A$8:$T$150,7,0),\"\")","v":12},{"$f":"IFERROR(VLOOKUP($Y$2,الدرجات!$A$8:$T$150,13,0),\"\")","v":299.60000000000002},{"$f":"IFERROR(VLOOKUP($Y$2,الدرجات!$A$8:$T$150,14,0),\"\")","v":14},{"$f":"IFERROR(VLOOKUP($Y$2,الدرجات!$A$8:$T$150,15,0),\"\")","v":14},{"$f":"IFERROR(VLOOKUP($Y$2,الدرجات!$A$8:$T$150,16,0),\"\")","v":28},{"$f":"IFERROR(VLOOKUP($Y$2,الدرجات!$A$8:$T$150,17,0),\"\")","v":14.9},{"$f":"IFERROR(VLOOKUP($Y$2,الدرجات!$A$8:$T$150,18,0),\"\")","v":14.9},{"$f":"IFERROR(VLOOKUP($Y$2,الدرجات!$A$8:$T$150,19,0),\"\")","v":39.4}]
["التقدير",{"$f":"IF(B16=\"غ\",\"غ\",IF(B16=0,\"\",IF(B16=\"صفر\",\"دون المستوى\",IF(B16<50,\"دون المستوى\",IF(B16<=100*64.9%,\"مقبول\",IF(B16<=100*74.9%,\"جيد\",IF(B16<=100*84.9%,\"جيد جدا\",IF(B16<=100,\"ممتاز\",\"\"))))))))","v":"ممتاز"},{"$f":"IF(B17=\"غ\",\"غ\",IF(B17=0,\"\",IF(B17=\"صفر\",\"دون المستوى\",IF(B17<50,\"دون المستوى\",IF(B17<=100*64.9%,\"مقبول\",IF(B17<=100*74.9%,\"جيد\",IF(B17<=100*84.9%,\"جيد جدا\",IF(B17<=100,\"ممتاز\",\"\"))))))))","v":""},{"$f":"IF(C17=\"غ\",\"غ\",IF(C17=0,\"\",IF(C17=\"صفر\",\"دون المستوى\",IF(C17<50,\"دون المستوى\",IF(C17<=100*64.9%,\"مقبول\",IF(C17<=100*74.9%,\"جيد\",IF(C17<=100*84.9%,\"جيد جدا\",IF(C17<=100,\"ممتاز\",\"\"))))))))","v":""},{"$f":"IF(E16=\"غ\",\"غ\",IF(E16=\"صفر\",\"دون المستوى\",IF(E16=0,\"\",IF(E16<40,\"دون المستوى\",IF(E16<=80*64.9%,\"مقبول\",IF(E16<=80*74.9%,\"جيد\",IF(E16<=80*84.9%,\"جيد جدا\",IF(E16<=80,\"ممتاز\",\"\"))))))))","v":"ممتاز"},{"$f":"IF(E17=\"غ\",\"غ\",IF(E17=\"صفر\",\"دون المستوى\",IF(E17=0,\"\",IF(E17<40,\"دون المستوى\",IF(E17<=80*64.9%,\"مقبول\",IF(E17<=80*74.9%,\"جيد\",IF(E17<=80*84.9%,\"جيد جدا\",IF(E17<=80,\"ممتاز\",\"\"))))))))","v":""},{"$f":"IF(F17=\"غ\",\"غ\",IF(F17=\"صفر\",\"دون المستوى\",IF(F17=0,\"\",IF(F17<40,\"دون المستوى\",IF(F17<=80*64.9%,\"مقبول\",IF(F17<=80*74.9%,\"جيد\",IF(F17<=80*84.9%,\"جيد جدا\",IF(F17<=80,\"ممتاز\",\"\"))))))))","v":""},{"$f":"IF(H16=\"غ\",\"غ\",IF(H16=\"صفر\",\"دون المستوى\",IF(H16=0,\"\",IF(H16<20,\"دون المستوى\",IF(H16<=40*64.9%,\"مقبول\",IF(H16<=40*74.9%,\"جيد\",IF(H16<=40*84.9%,\"جيد جدا\",IF(H16<=40,\"ممتاز\",\"\"))))))))","v":"ممتاز"},{"$f":"IF(H17=\"غ\",\"غ\",IF(H17=\"صفر\",\"دون المستوى\",IF(H17=0,\"\",IF(H17<20,\"دون المستوى\",IF(H17<=40*64.9%,\"مقبول\",IF(H17<=40*74.9%,\"جيد\",IF(H17<=40*84.9%,\"جيد جدا\",IF(H17<=40,\"ممتاز\",\"\"))))))))","v":""},{"$f":"IF(I17=\"غ\",\"غ\",IF(I17=\"صفر\",\"دون المستوى\",IF(I17=0,\"\",IF(I17<20,\"دون المستوى\",IF(I17<=40*64.9%,\"مقبول\",IF(I17<=40*74.9%,\"جيد\",IF(I17<=40*84.9%,\"جيد جدا\",IF(I17<=40,\"ممتاز\",\"\"))))))))","v":""},{"$f":"IF(K16=\"غ\",\"غ\",IF(K16=\"صفر\",\"دون المستوى\",IF(K16=0,\"\",IF(K16<20,\"دون المستوى\",IF(K16<=40*64.9%,\"مقبول\",IF(K16<=40*74.9%,\"جيد\",IF(K16<=40*84.9%,\"جيد جدا\",IF(K16<=40,\"ممتاز\",\"\"))))))))","v":"ممتاز"},{"$f":"IF(K17=\"غ\",\"غ\",IF(K17=\"صفر\",\"دون المستوى\",IF(K17=0,\"\",IF(K17<20,\"دون المستوى\",IF(K17<=40*64.9%,\"مقبول\",IF(K17<=40*74.9%,\"جيد\",IF(K17<=40*84.9%,\"جيد جدا\",IF(K17<=40,\"ممتاز\",\"\"))))))))","v":""},{"$f":"IF(L17=\"غ\",\"غ\",IF(L17=\"صفر\",\"دون المستوى\",IF(L17=0,\"\",IF(L17<20,\"دون المستوى\",IF(L17<=40*64.9%,\"مقبول\",IF(L17<=40*74.9%,\"جيد\",IF(L17<=40*84.9%,\"جيد جدا\",IF(L17<=40,\"ممتاز\",\"\"))))))))","v":""},{"$f":"IF(N16=\"غ\",\"غ\",IF(N16=\"صفر\",\"دون المستوى\",IF(N16=0,\"\",IF(N16<20,\"دون المستوى\",IF(N16<=40*64.9%,\"مقبول\",IF(N16<=40*74.9%,\"جيد\",IF(N16<=40*84.9%,\"جيد جدا\",IF(N16<=40,\"ممتاز\",\"\"))))))))","v":"ممتاز"},{"$f":"IF(N17=\"غ\",\"غ\",IF(N17=\"صفر\",\"دون المستوى\",IF(N17=0,\"\",IF(N17<20,\"دون المستوى\",IF(N17<=40*64.9%,\"مقبول\",IF(N17<=40*74.9%,\"جيد\",IF(N17<=40*84.9%,\"جيد جدا\",IF(N17<=40,\"ممتاز\",\"\"))))))))","v":""},{"$f":"IF(O17=\"غ\",\"غ\",IF(O17=\"صفر\",\"دون المستوى\",IF(O17=0,\"\",IF(O17<20,\"دون المستوى\",IF(O17<=40*64.9%,\"مقبول\",IF(O17<=40*74.9%,\"جيد\",IF(O17<=40*84.9%,\"جيد جدا\",IF(O17<=40,\"ممتاز\",\"\"))))))))","v":""},{"$f":"IF(Q16=\"غ\",\"غ\",IF(Q16=0,\"\",IF(Q16<150,\"دون المستوى\",IF(Q16<=300*64.9%,\"مقبول\",IF(Q16<=300*74.9%,\"جيد\",IF(Q16<=300*84.9%,\"جيد جدا\",IF(Q16<=300,\"ممتاز\",\"\")))))))","v":"ممتاز"},{"$f":"IF(R16=\"غ\",\"غ\",IF(R16=0,\"\",IF(R16=\"صفر\",\"دون المستوى\",IF(R16<10,\"دون المستوى\",IF(R16<=20*64.9%,\"مقبول\",IF(R16<=20*74.9%,\"جيد\",IF(R16<=20*84.9%,\"جيد جدا\",IF(R16<=20,\"ممتاز\",\"\"))))))))","v":"جيد"},{"$f":"IF(S16=\"غ\",\"غ\",IF(S16=0,\"\",IF(S16=\"صفر\",\"دون المستوى\",IF(S16<10,\"دون المستوى\",IF(S16<=20*64.9%,\"مقبول\",IF(S16<=20*74.9%,\"جيد\",IF(S16<=20*84.9%,\"جيد جدا\",IF(S16<=20,\"ممتاز\",\"\"))))))))","v":"جيد"},{"$f":"IF(T16=\"غ\",\"غ\",IF(T16=0,\"\",IF(T16=\"صفر\",\"دون المستوى\",IF(T16<20,\"دون المستوى\",IF(T16<=40*64.9%,\"مقبول\",IF(T16<=40*74.9%,\"جيد\",IF(T16<=40*84.9%,\"جيد جدا\",IF(T16<=40,\"ممتاز\",\"\"))))))))","v":"جيد"},{"$f":"IF(U16=\"غ\",\"غ\",IF(U16=0,\"\",IF(U16=\"صفر\",\"دون المستوى\",IF(U16<10,\"دون المستوى\",IF(U16<=20*64.9%,\"مقبول\",IF(U16<=20*74.9%,\"جيد\",IF(U16<=20*84.9%,\"جيد جدا\",IF(U16<=20,\"ممتاز\",\"\"))))))))","v":"جيد"},{"$f":"IF(V16=\"غ\",\"غ\",IF(V16=0,\"\",IF(V16=\"صفر\",\"دون المستوى\",IF(V16<10,\"دون المستوى\",IF(V16<=20*64.9%,\"مقبول\",IF(V16<=20*74.9%,\"جيد\",IF(V16<=20*84.9%,\"جيد جدا\",IF(V16<=20,\"ممتاز\",\"\"))))))))","v":"جيد"},{"$f":"IF(W16=\"غ\",\"غ\",IF(W16=\"صفر\",\"دون المستوى\",IF(W16=0,\"\",IF(W16<20,\"دون المستوى\",IF(W16<=40*64.9%,\"مقبول\",IF(W16<=40*74.9%,\"جيد\",IF(W16<=40*84.9%,\"جيد جدا\",IF(W16<=40,\"ممتاز\",\"\"))))))))","v":"ممتاز"},{"$f":"IF(W17=\"غ\",\"غ\",IF(W17=\"صفر\",\"دون المستوى\",IF(W17=0,\"\",IF(W17<20,\"دون المستوى\",IF(W17<=40*64.9%,\"مقبول\",IF(W17<=40*74.9%,\"جيد\",IF(W17<=40*84.9%,\"جيد جدا\",IF(W17<=40,\"ممتاز\",\"\"))))))))","v":""},{"$f":"IF(X17=\"غ\",\"غ\",IF(X17=\"صفر\",\"دون المستوى\",IF(X17=0,\"\",IF(X17<20,\"دون المستوى\",IF(X17<=40*64.9%,\"مقبول\",IF(X17<=40*74.9%,\"جيد\",IF(X17<=40*84.9%,\"جيد جدا\",IF(X17<=40,\"ممتاز\",\"\"))))))))","v":""}]
["مجموع درجات التلاميذ بالحروف :-",null,null,null,null,null,null,{"$f":"IFERROR(VLOOKUP($Y$2,الدرجات!$A$8:$T$150,20,0),\"\")","v":"مائتان وتسع وتسعونَ و 0.6 درجـة فقطُ لا غيرَ"}]
[]
["منقول إلى الصف :- الأول الإعدادى"]
{"$rows_left_out":3}