{"text_format":"1","workbook":"xlsx","n_sheets":7,"sheets":["Code","Add","Low","Main Store","Sub Store","Report","Intro"],"not_rendered":{"charts":0,"images":1,"macros":1,"external_links":0,"defined_names":6,"comments":0,"pivot_tables":0},"unopened":[],"bounds":{"document_bytes":16777216,"sheet_cells":100000,"rows_first":2000,"rows_last":500,"rows_between":2000,"halvings":0,"cell_chars":16384,"cell_head_chars":4096},"cells_cut":0,"cells_raw":0,"read":"whole","date_system":"1900"}

{"sheet":"Code","index":0,"n_rows":158,"n_cols":10,"rows_kept":158,"cut":false,"hidden":false,"merged":[[1,1,1,6]]}
[]
[]
[]
[null,null,null,null,null,null,null,null,null,"المخزن"]
[null,"كود الصنف","اسم الصنف","طبيعة الصنف","رصيد أول","المخزن المخصص","ملاحظات",null,null,"رئيسي"]
[null,{"$f":"IF(C6<>\"\",1,\"\")","v":1},"ترابة",null,17,"رئيسي",null,null,null,"فرعي"]
[null,{"$f":"IF(C7<>\"\",B6+1,\"\")","v":2},"مخلوط",null,12,"رئيسي"]
[null,{"$f":"IF(C8<>\"\",B7+1,\"\")","v":3},"سرك",null,10,"رئيسي"]
[null,4,"بودرة",null,17,"رئيسي"]
[null,5,"باطون أبيض",null,22,"رئيسي"]
[null,6,"ديفنول",null,10,"رئيسي"]
[null,7,"دعائم",null,15,"رئيسي"]
[null,""]
[null,""]
[null,""]
[null,""]
[null,""]
[null,""]
[null,""]
[null,""]
{"$rows_left_out":139}
{"sheet":"Add","index":1,"n_rows":20,"n_cols":13,"rows_kept":20,"cut":false,"hidden":false,"merged":[[2,1,2,6]]}
[]
[]
[]
[]
[]
[null,"تاريخ الإذن","رقم الإذن","كود الصنف","اسم الصنف","الوحدة","الكمية المطلوبة","الكمية المصرح بها","الكمية المضافة","حالة الصنف","سعر الوحدة\n\"القيمة\"","وارد من","مخزن الإضافة"]
[null,"2016-01-01",null,1,{"$f":"IFERROR(IF(D7=\"\",\"\",VLOOKUP(D7,code[],2,0)),\"مراجعة تكويد الأصناف\")","v":"ترابة"},null,100,90,99,null,null,null,"رئيسي"]
[null,"2016-01-07",null,2,{"$f":"IFERROR(IF(D8=\"\",\"\",VLOOKUP(D8,code[],2,0)),\"مراجعة تكويد الأصناف\")","v":"مخلوط"},null,null,null,4,null,null,null,"رئيسي"]
[null,"2016-01-09",null,3,{"$f":"IFERROR(IF(D9=\"\",\"\",VLOOKUP(D9,code[],2,0)),\"مراجعة تكويد الأصناف\")","v":"سرك"},null,null,null,5,null,null,null,"رئيسي"]
[null,"2016-01-11",null,2,{"$f":"IFERROR(IF(D10=\"\",\"\",VLOOKUP(D10,code[],2,0)),\"مراجعة تكويد الأصناف\")","v":"مخلوط"},null,null,null,3,null,null,null,"رئيسي"]
[null,"2016-01-13",null,3,{"$f":"IFERROR(IF(D11=\"\",\"\",VLOOKUP(D11,code[],2,0)),\"مراجعة تكويد الأصناف\")","v":"سرك"},null,null,null,6,null,null,null,"رئيسي"]
[null,"2016-01-15",null,4,{"$f":"IFERROR(IF(D12=\"\",\"\",VLOOKUP(D12,code[],2,0)),\"مراجعة تكويد الأصناف\")","v":"بودرة"},null,null,null,11,null,null,null,"رئيسي"]
[null,"2016-01-15",null,1,{"$f":"IFERROR(IF(D13=\"\",\"\",VLOOKUP(D13,code[],2,0)),\"مراجعة تكويد الأصناف\")","v":"ترابة"},null,null,null,2,null,null,null,"رئيسي"]
[null,"2016-01-19",null,1,{"$f":"IFERROR(IF(D14=\"\",\"\",VLOOKUP(D14,code[],2,0)),\"مراجعة تكويد الأصناف\")","v":"ترابة"},null,null,null,3,null,null,null,"رئيسي"]
[null,"2016-01-21",null,5,{"$f":"IFERROR(IF(D15=\"\",\"\",VLOOKUP(D15,code[],2,0)),\"مراجعة تكويد الأصناف\")","v":"باطون أبيض"},null,null,null,17,null,null,null,"رئيسي"]
[null,"2016-01-23",null,5,{"$f":"IFERROR(IF(D16=\"\",\"\",VLOOKUP(D16,code[],2,0)),\"مراجعة تكويد الأصناف\")","v":"باطون أبيض"},null,null,null,6,null,null,null,"فرعي"]
[null,"2016-01-25",null,6,{"$f":"IFERROR(IF(D17=\"\",\"\",VLOOKUP(D17,code[],2,0)),\"مراجعة تكويد الأصناف\")","v":"ديفنول"},null,null,null,12,null,null,null,"رئيسي"]
[null,"2016-01-27",null,7,{"$f":"IFERROR(IF(D18=\"\",\"\",VLOOKUP(D18,code[],2,0)),\"مراجعة تكويد الأصناف\")","v":"دعائم"},null,null,null,10,null,null,null,"رئيسي"]
[null,null,null,null,{"$f":"IFERROR(IF(D19=\"\",\"\",VLOOKUP(D19,code[],2,0)),\"مراجعة تكويد الأصناف\")","v":""},null,null,null,null,null,null,null,"رئيسي"]
[null,null,null,null,{"$f":"IFERROR(IF(D20=\"\",\"\",VLOOKUP(D20,code[],2,0)),\"مراجعة تكويد الأصناف\")","v":""}]
{"$rows_left_out":1}
{"sheet":"Low","index":2,"n_rows":20,"n_cols":21,"rows_kept":20,"cut":false,"hidden":false,"merged":[[2,1,2,6]]}
[]
[]
[]
[]
[]
[null,"اسم الجهه","تاريخ الطلب","اسم الطالب","رقم اذن الصرف","سند الصرف","مخزن الصرف","مستديم","مستهلك","رقم الاذن","تاريخ الإذن","رقم الصنف","اسم الصنف","الوحده","الكميه المصرح بها","الكميه المطلوبه","الكميه المنصرفه","حاله الصنف","سعر الوحده","القيمه","ملاحظات"]
[null,null,null,null,null,null,"رئيسي",null,null,null,"2016-01-01",1,{"$f":"IFERROR(IF(L7=\"\",\"\",VLOOKUP(L7,code[],2,0)),\"مراجعة تكويد الأصناف\")","v":"ترابة"},null,18,null,15]
[null,null,null,null,null,null,"رئيسي",null,null,null,"2016-01-11",3,{"$f":"IFERROR(IF(L8=\"\",\"\",VLOOKUP(L8,code[],2,0)),\"مراجعة تكويد الأصناف\")","v":"سرك"},null,20,null,8]
[null,null,null,null,null,null,"رئيسي",null,null,null,"2016-01-13",4,{"$f":"IFERROR(IF(L9=\"\",\"\",VLOOKUP(L9,code[],2,0)),\"مراجعة تكويد الأصناف\")","v":"بودرة"},null,18,null,9]
[null,null,null,null,null,null,"رئيسي",null,null,null,"2016-01-15",2,{"$f":"IFERROR(IF(L10=\"\",\"\",VLOOKUP(L10,code[],2,0)),\"مراجعة تكويد الأصناف\")","v":"مخلوط"},null,null,null,7]
[null,null,null,null,null,null,"رئيسي",null,null,null,"2016-01-17",5,{"$f":"IFERROR(IF(L11=\"\",\"\",VLOOKUP(L11,code[],2,0)),\"مراجعة تكويد الأصناف\")","v":"باطون أبيض"},null,null,null,16]
[null,null,null,null,null,null,"رئيسي",null,null,null,"2016-01-14",1,{"$f":"IFERROR(IF(L12=\"\",\"\",VLOOKUP(L12,code[],2,0)),\"مراجعة تكويد الأصناف\")","v":"ترابة"},null,null,null,25]
[null,null,null,null,null,null,"رئيسي",null,null,null,"2016-01-18",5,{"$f":"IFERROR(IF(L13=\"\",\"\",VLOOKUP(L13,code[],2,0)),\"مراجعة تكويد الأصناف\")","v":"باطون أبيض"},null,null,null,18]
[null,null,null,null,null,null,"رئيسي",null,null,null,"2016-01-30",6,{"$f":"IFERROR(IF(L14=\"\",\"\",VLOOKUP(L14,code[],2,0)),\"مراجعة تكويد الأصناف\")","v":"ديفنول"},null,null,null,14]
[null,null,null,null,null,null,"رئيسي",null,null,null,"2016-03-17",7,{"$f":"IFERROR(IF(L15=\"\",\"\",VLOOKUP(L15,code[],2,0)),\"مراجعة تكويد الأصناف\")","v":"دعائم"},null,null,null,7]
[null,null,null,null,null,null,"رئيسي",null,null,null,"2016-02-03",7,{"$f":"IFERROR(IF(L16=\"\",\"\",VLOOKUP(L16,code[],2,0)),\"مراجعة تكويد الأصناف\")","v":"دعائم"},null,null,null,4]
[null,null,null,null,null,null,"رئيسي",null,null,null,null,null,{"$f":"IFERROR(IF(L17=\"\",\"\",VLOOKUP(L17,code[],2,0)),\"مراجعة تكويد الأصناف\")","v":""}]
[null,null,null,null,null,null,"رئيسي",null,null,null,null,null,{"$f":"IFERROR(IF(L18=\"\",\"\",VLOOKUP(L18,code[],2,0)),\"مراجعة تكويد الأصناف\")","v":""}]
[null,null,null,null,null,null,null,null,null,null,null,null,{"$f":"IFERROR(IF(L19=\"\",\"\",VLOOKUP(L19,code[],2,0)),\"مراجعة تكويد الأصناف\")","v":""}]
[null,null,null,null,null,null,null,null,null,null,null,null,{"$f":"IFERROR(IF(L20=\"\",\"\",VLOOKUP(L20,code[],2,0)),\"مراجعة تكويد الأصناف\")","v":""}]
{"$rows_left_out":1}
{"sheet":"Main Store","index":3,"n_rows":18,"n_cols":11,"rows_kept":18,"cut":false,"hidden":false,"merged":[[2,1,2,7]]}
[]
[null,null,null,null,null,null,null,null,null,null,"رئيسي"]
[]
[]
[]
[null,"الرقم المتسلسل","كود الصنف","اسم الصنف","رصيد أول","وارد","صادر","رصيد آخر"]
[null,{"$f":"IF(C6<>\"\",ROW()-6,\"\")","v":1},{"$f":"IF(main[[#This Row],[الرقم المتسلسل]]<>\"\",'Code'!B6,\"\")","v":1},{"$f":"IF(main[[#This Row],[كود الصنف]]<>\"\",'Code'!C6,\"\")","v":"ترابة"},{"$f":"IF(main[[#This Row],[كود الصنف]]<>\"\",'Code'!E6,\"\")","v":17},{"$f":"SUMIFS(add[[#This Row],[الكمية المضافة]],add[[#This Row],[كود الصنف]],C7,add[[#This Row],[مخزن الإضافة]],$K$2)","v":99},{"$f":"SUMIFS(low[[#This Row],[الكميه المنصرفه]],low[[#This Row],[رقم الصنف]],C7,low[[#This Row],[مخزن الصرف]],$K$2)","v":15},{"$f":"SUM(E7:F7)-G7","v":101}]
[null,{"$f":"IF(C7<>\"\",ROW()-6,\"\")","v":2},{"$f":"IF(main[[#This Row],[الرقم المتسلسل]]<>\"\",'Code'!B7,\"\")","v":2},{"$f":"IF(main[[#This Row],[كود الصنف]]<>\"\",'Code'!C7,\"\")","v":"مخلوط"},{"$f":"IF(main[[#This Row],[كود الصنف]]<>\"\",'Code'!E7,\"\")","v":12},{"$f":"SUMIFS(add[[#This Row],[الكمية المضافة]],add[[#This Row],[كود الصنف]],C8,add[[#This Row],[مخزن الإضافة]],$K$2)","v":4},{"$f":"SUMIFS(low[[#This Row],[الكميه المنصرفه]],low[[#This Row],[رقم الصنف]],C8,low[[#This Row],[مخزن الصرف]],$K$2)","v":0},{"$f":"SUM(E8:F8)-G8","v":16}]
[null,3,{"$f":"IF(main[[#This Row],[الرقم المتسلسل]]<>\"\",'Code'!B8,\"\")","v":3},{"$f":"IF(main[[#This Row],[كود الصنف]]<>\"\",'Code'!C8,\"\")","v":"سرك"},{"$f":"IF(main[[#This Row],[كود الصنف]]<>\"\",'Code'!E8,\"\")","v":10},{"$f":"SUMIFS(add[[#This Row],[الكمية المضافة]],add[[#This Row],[كود الصنف]],C9,add[[#This Row],[مخزن الإضافة]],$K$2)","v":5},{"$f":"SUMIFS(low[[#This Row],[الكميه المنصرفه]],low[[#This Row],[رقم الصنف]],C9,low[[#This Row],[مخزن الصرف]],$K$2)","v":0},15]
[null,4,{"$f":"IF(main[[#This Row],[الرقم المتسلسل]]<>\"\",'Code'!B9,\"\")","v":4},{"$f":"IF(main[[#This Row],[كود الصنف]]<>\"\",'Code'!C9,\"\")","v":"بودرة"},{"$f":"IF(main[[#This Row],[كود الصنف]]<>\"\",'Code'!E9,\"\")","v":17},{"$f":"SUMIFS(add[[#This Row],[الكمية المضافة]],add[[#This Row],[كود الصنف]],C10,add[[#This Row],[مخزن الإضافة]],$K$2)","v":0},{"$f":"SUMIFS(low[[#This Row],[الكميه المنصرفه]],low[[#This Row],[رقم الصنف]],C10,low[[#This Row],[مخزن الصرف]],$K$2)","v":0},17]
[null,5,{"$f":"IF(main[[#This Row],[الرقم المتسلسل]]<>\"\",'Code'!B10,\"\")","v":5},{"$f":"IF(main[[#This Row],[كود الصنف]]<>\"\",'Code'!C10,\"\")","v":"باطون أبيض"},{"$f":"IF(main[[#This Row],[كود الصنف]]<>\"\",'Code'!E10,\"\")","v":22},{"$f":"SUMIFS(add[[#This Row],[الكمية المضافة]],add[[#This Row],[كود الصنف]],C11,add[[#This Row],[مخزن الإضافة]],$K$2)","v":0},{"$f":"SUMIFS(low[[#This Row],[الكميه المنصرفه]],low[[#This Row],[رقم الصنف]],C11,low[[#This Row],[مخزن الصرف]],$K$2)","v":16},6]
[null,6,{"$f":"IF(main[[#This Row],[الرقم المتسلسل]]<>\"\",'Code'!B11,\"\")","v":6},{"$f":"IF(main[[#This Row],[كود الصنف]]<>\"\",'Code'!C11,\"\")","v":"ديفنول"},{"$f":"IF(main[[#This Row],[كود الصنف]]<>\"\",'Code'!E11,\"\")","v":10},{"$f":"SUMIFS(add[[#This Row],[الكمية المضافة]],add[[#This Row],[كود الصنف]],C12,add[[#This Row],[مخزن الإضافة]],$K$2)","v":0},{"$f":"SUMIFS(low[[#This Row],[الكميه المنصرفه]],low[[#This Row],[رقم الصنف]],C12,low[[#This Row],[مخزن الصرف]],$K$2)","v":0},10]
[null,7,{"$f":"IF(main[[#This Row],[الرقم المتسلسل]]<>\"\",'Code'!B12,\"\")","v":7},{"$f":"IF(main[[#This Row],[كود الصنف]]<>\"\",'Code'!C12,\"\")","v":"دعائم"},{"$f":"IF(main[[#This Row],[كود الصنف]]<>\"\",'Code'!E12,\"\")","v":15},{"$f":"SUMIFS(add[[#This Row],[الكمية المضافة]],add[[#This Row],[كود الصنف]],C13,add[[#This Row],[مخزن الإضافة]],$K$2)","v":0},{"$f":"SUMIFS(low[[#This Row],[الكميه المنصرفه]],low[[#This Row],[رقم الصنف]],C13,low[[#This Row],[مخزن الصرف]],$K$2)","v":0},15]
[null,8,{"$f":"IF(main[[#This Row],[الرقم المتسلسل]]<>\"\",'Code'!B13,\"\")","v":""},{"$f":"IF(main[[#This Row],[كود الصنف]]<>\"\",'Code'!C13,\"\")","v":""},{"$f":"IF(main[[#This Row],[كود الصنف]]<>\"\",'Code'!E13,\"\")","v":""},{"$f":"SUMIFS(add[[#This Row],[الكمية المضافة]],add[[#This Row],[كود الصنف]],C14,add[[#This Row],[مخزن الإضافة]],$K$2)","v":0},{"$f":"SUMIFS(low[[#This Row],[الكميه المنصرفه]],low[[#This Row],[رقم الصنف]],C14,low[[#This Row],[مخزن الصرف]],$K$2)","v":0},0]
[null,"",{"$f":"IF(main[[#This Row],[الرقم المتسلسل]]<>\"\",'Code'!B14,\"\")","v":""},{"$f":"IF(main[[#This Row],[كود الصنف]]<>\"\",'Code'!C14,\"\")","v":""},{"$f":"IF(main[[#This Row],[كود الصنف]]<>\"\",'Code'!E14,\"\")","v":""},{"$f":"SUMIFS(add[[#This Row],[الكمية المضافة]],add[[#This Row],[كود الصنف]],C15,add[[#This Row],[مخزن الإضافة]],$K$2)","v":0},{"$f":"SUMIFS(low[[#This Row],[الكميه المنصرفه]],low[[#This Row],[رقم الصنف]],C15,low[[#This Row],[مخزن الصرف]],$K$2)","v":0},0]
[null,"",{"$f":"IF(main[[#This Row],[الرقم المتسلسل]]<>\"\",'Code'!B15,\"\")","v":""},{"$f":"IF(main[[#This Row],[كود الصنف]]<>\"\",'Code'!C15,\"\")","v":""},{"$f":"IF(main[[#This Row],[كود الصنف]]<>\"\",'Code'!E15,\"\")","v":""},{"$f":"SUMIFS(add[[#This Row],[الكمية المضافة]],add[[#This Row],[كود الصنف]],C16,add[[#This Row],[مخزن الإضافة]],$K$2)","v":0},{"$f":"SUMIFS(low[[#This Row],[الكميه المنصرفه]],low[[#This Row],[رقم الصنف]],C16,low[[#This Row],[مخزن الصرف]],$K$2)","v":0},0]
[null,"",{"$f":"IF(main[[#This Row],[الرقم المتسلسل]]<>\"\",'Code'!B16,\"\")","v":""},{"$f":"IF(main[[#This Row],[كود الصنف]]<>\"\",'Code'!C16,\"\")","v":""},{"$f":"IF(main[[#This Row],[كود الصنف]]<>\"\",'Code'!E16,\"\")","v":""},{"$f":"SUMIFS(add[[#This Row],[الكمية المضافة]],add[[#This Row],[كود الصنف]],C17,add[[#This Row],[مخزن الإضافة]],$K$2)","v":0},{"$f":"SUMIFS(low[[#This Row],[الكميه المنصرفه]],low[[#This Row],[رقم الصنف]],C17,low[[#This Row],[مخزن الصرف]],$K$2)","v":0},0]
[null,"",{"$f":"IF(main[[#This Row],[الرقم المتسلسل]]<>\"\",'Code'!B17,\"\")","v":""},{"$f":"IF(main[[#This Row],[كود الصنف]]<>\"\",'Code'!C17,\"\")","v":""},{"$f":"IF(main[[#This Row],[كود الصنف]]<>\"\",'Code'!E17,\"\")","v":""},{"$f":"SUMIFS(add[[#This Row],[الكمية المضافة]],add[[#This Row],[كود الصنف]],C18,add[[#This Row],[مخزن الإضافة]],$K$2)","v":0},{"$f":"SUMIFS(low[[#This Row],[الكميه المنصرفه]],low[[#This Row],[رقم الصنف]],C18,low[[#This Row],[مخزن الصرف]],$K$2)","v":0},0]

{"sheet":"Sub Store","index":4,"n_rows":18,"n_cols":11,"rows_kept":18,"cut":false,"hidden":false,"merged":[[2,1,2,8]]}
[]
[null,null,null,null,null,null,null,null,null,null,"فرعي"]
[]
[]
[]
[null,"الرقم المتسلسل","كود الصنف","اسم الصنف","طبيعة الصنف","رصيد أول","وارد","صادر","رصيد آخر"]
[null,{"$f":"IF(C6<>\"\",ROW()-6,\"\")","v":1},{"$f":"IF(main[[#This Row],[الرقم المتسلسل]]<>\"\",'Code'!B6,\"\")","v":1},{"$f":"IF(main[[#This Row],[كود الصنف]]<>\"\",'Code'!C6,\"\")","v":"ترابة"},null,{"$f":"IF(substore[[#This Row],[كود الصنف]]<>\"\",'Code'!E6,\"\")","v":17},{"$f":"SUMIFS(add[[#This Row],[الكمية المضافة]],add[[#This Row],[كود الصنف]],substore[[#This Row],[كود الصنف]],add[[#This Row],[مخزن الإضافة]],$K$2)","v":0},{"$f":"SUMIFS(low[[#This Row],[الكميه المنصرفه]],low[[#This Row],[رقم الصنف]],C7,low[[#This Row],[مخزن الصرف]],$K$2)","v":0},{"$f":"SUM(F7:G7)-H7","v":17}]
[null,{"$f":"IF(C7<>\"\",ROW()-6,\"\")","v":2},{"$f":"IF(main[[#This Row],[الرقم المتسلسل]]<>\"\",'Code'!B7,\"\")","v":2},{"$f":"IF(main[[#This Row],[كود الصنف]]<>\"\",'Code'!C7,\"\")","v":"مخلوط"},null,{"$f":"IF(substore[[#This Row],[كود الصنف]]<>\"\",'Code'!E7,\"\")","v":12},{"$f":"SUMIFS(add[[#This Row],[الكمية المضافة]],add[[#This Row],[كود الصنف]],substore[[#This Row],[كود الصنف]],add[[#This Row],[مخزن الإضافة]],$K$2)","v":0},{"$f":"SUMIFS(low[[#This Row],[الكميه المنصرفه]],low[[#This Row],[رقم الصنف]],C8,low[[#This Row],[مخزن الصرف]],$K$2)","v":0},{"$f":"SUM(F8:G8)-H8","v":12}]
[null,3,{"$f":"IF(main[[#This Row],[الرقم المتسلسل]]<>\"\",'Code'!B8,\"\")","v":3},{"$f":"IF(main[[#This Row],[كود الصنف]]<>\"\",'Code'!C8,\"\")","v":"سرك"},null,{"$f":"IF(substore[[#This Row],[كود الصنف]]<>\"\",'Code'!E8,\"\")","v":10},{"$f":"SUMIFS(add[[#This Row],[الكمية المضافة]],add[[#This Row],[كود الصنف]],substore[[#This Row],[كود الصنف]],add[[#This Row],[مخزن الإضافة]],$K$2)","v":0},{"$f":"SUMIFS(low[[#This Row],[الكميه المنصرفه]],low[[#This Row],[رقم الصنف]],C9,low[[#This Row],[مخزن الصرف]],$K$2)","v":0},10]
[null,4,{"$f":"IF(main[[#This Row],[الرقم المتسلسل]]<>\"\",'Code'!B9,\"\")","v":4},{"$f":"IF(main[[#This Row],[كود الصنف]]<>\"\",'Code'!C9,\"\")","v":"بودرة"},null,{"$f":"IF(substore[[#This Row],[كود الصنف]]<>\"\",'Code'!E9,\"\")","v":17},{"$f":"SUMIFS(add[[#This Row],[الكمية المضافة]],add[[#This Row],[كود الصنف]],substore[[#This Row],[كود الصنف]],add[[#This Row],[مخزن الإضافة]],$K$2)","v":0},{"$f":"SUMIFS(low[[#This Row],[الكميه المنصرفه]],low[[#This Row],[رقم الصنف]],C10,low[[#This Row],[مخزن الصرف]],$K$2)","v":0},17]
[null,5,{"$f":"IF(main[[#This Row],[الرقم المتسلسل]]<>\"\",'Code'!B10,\"\")","v":5},{"$f":"IF(main[[#This Row],[كود الصنف]]<>\"\",'Code'!C10,\"\")","v":"باطون أبيض"},null,{"$f":"IF(substore[[#This Row],[كود الصنف]]<>\"\",'Code'!E10,\"\")","v":22},{"$f":"SUMIFS(add[[#This Row],[الكمية المضافة]],add[[#This Row],[كود الصنف]],substore[[#This Row],[كود الصنف]],add[[#This Row],[مخزن الإضافة]],$K$2)","v":0},{"$f":"SUMIFS(low[[#This Row],[الكميه المنصرفه]],low[[#This Row],[رقم الصنف]],C11,low[[#This Row],[مخزن الصرف]],$K$2)","v":0},22]
[null,6,{"$f":"IF(main[[#This Row],[الرقم المتسلسل]]<>\"\",'Code'!B11,\"\")","v":6},{"$f":"IF(main[[#This Row],[كود الصنف]]<>\"\",'Code'!C11,\"\")","v":"ديفنول"},null,{"$f":"IF(substore[[#This Row],[كود الصنف]]<>\"\",'Code'!E11,\"\")","v":10},{"$f":"SUMIFS(add[[#This Row],[الكمية المضافة]],add[[#This Row],[كود الصنف]],substore[[#This Row],[كود الصنف]],add[[#This Row],[مخزن الإضافة]],$K$2)","v":0},{"$f":"SUMIFS(low[[#This Row],[الكميه المنصرفه]],low[[#This Row],[رقم الصنف]],C12,low[[#This Row],[مخزن الصرف]],$K$2)","v":0},10]
[null,7,{"$f":"IF(main[[#This Row],[الرقم المتسلسل]]<>\"\",'Code'!B12,\"\")","v":7},{"$f":"IF(main[[#This Row],[كود الصنف]]<>\"\",'Code'!C12,\"\")","v":"دعائم"},null,{"$f":"IF(substore[[#This Row],[كود الصنف]]<>\"\",'Code'!E12,\"\")","v":15},{"$f":"SUMIFS(add[[#This Row],[الكمية المضافة]],add[[#This Row],[كود الصنف]],substore[[#This Row],[كود الصنف]],add[[#This Row],[مخزن الإضافة]],$K$2)","v":0},{"$f":"SUMIFS(low[[#This Row],[الكميه المنصرفه]],low[[#This Row],[رقم الصنف]],C13,low[[#This Row],[مخزن الصرف]],$K$2)","v":0},15]
[null,8,{"$f":"IF(main[[#This Row],[الرقم المتسلسل]]<>\"\",'Code'!B13,\"\")","v":""},{"$f":"IF(main[[#This Row],[كود الصنف]]<>\"\",'Code'!C13,\"\")","v":""},null,{"$f":"IF(substore[[#This Row],[كود الصنف]]<>\"\",'Code'!E13,\"\")","v":""},{"$f":"SUMIFS(add[[#This Row],[الكمية المضافة]],add[[#This Row],[كود الصنف]],substore[[#This Row],[كود الصنف]],add[[#This Row],[مخزن الإضافة]],$K$2)","v":0},{"$f":"SUMIFS(low[[#This Row],[الكميه المنصرفه]],low[[#This Row],[رقم الصنف]],C14,low[[#This Row],[مخزن الصرف]],$K$2)","v":0},0]
[null,"",{"$f":"IF(main[[#This Row],[الرقم المتسلسل]]<>\"\",'Code'!B14,\"\")","v":""},{"$f":"IF(main[[#This Row],[كود الصنف]]<>\"\",'Code'!C14,\"\")","v":""},null,{"$f":"IF(substore[[#This Row],[كود الصنف]]<>\"\",'Code'!E14,\"\")","v":""},{"$f":"SUMIFS(add[[#This Row],[الكمية المضافة]],add[[#This Row],[كود الصنف]],substore[[#This Row],[كود الصنف]],add[[#This Row],[مخزن الإضافة]],$K$2)","v":0},{"$f":"SUMIFS(low[[#This Row],[الكميه المنصرفه]],low[[#This Row],[رقم الصنف]],C15,low[[#This Row],[مخزن الصرف]],$K$2)","v":0},0]
[null,"",{"$f":"IF(main[[#This Row],[الرقم المتسلسل]]<>\"\",'Code'!B15,\"\")","v":""},{"$f":"IF(main[[#This Row],[كود الصنف]]<>\"\",'Code'!C15,\"\")","v":""},null,{"$f":"IF(substore[[#This Row],[كود الصنف]]<>\"\",'Code'!E15,\"\")","v":""},{"$f":"SUMIFS(add[[#This Row],[الكمية المضافة]],add[[#This Row],[كود الصنف]],substore[[#This Row],[كود الصنف]],add[[#This Row],[مخزن الإضافة]],$K$2)","v":0},{"$f":"SUMIFS(low[[#This Row],[الكميه المنصرفه]],low[[#This Row],[رقم الصنف]],C16,low[[#This Row],[مخزن الصرف]],$K$2)","v":0},0]
[null,"",{"$f":"IF(main[[#This Row],[الرقم المتسلسل]]<>\"\",'Code'!B16,\"\")","v":""},{"$f":"IF(main[[#This Row],[كود الصنف]]<>\"\",'Code'!C16,\"\")","v":""},null,{"$f":"IF(substore[[#This Row],[كود الصنف]]<>\"\",'Code'!E16,\"\")","v":""},{"$f":"SUMIFS(add[[#This Row],[الكمية المضافة]],add[[#This Row],[كود الصنف]],substore[[#This Row],[كود الصنف]],add[[#This Row],[مخزن الإضافة]],$K$2)","v":0},{"$f":"SUMIFS(low[[#This Row],[الكميه المنصرفه]],low[[#This Row],[رقم الصنف]],C17,low[[#This Row],[مخزن الصرف]],$K$2)","v":0},0]
[null,"",{"$f":"IF(main[[#This Row],[الرقم المتسلسل]]<>\"\",'Code'!B17,\"\")","v":""},{"$f":"IF(main[[#This Row],[كود الصنف]]<>\"\",'Code'!C17,\"\")","v":""},null,{"$f":"IF(substore[[#This Row],[كود الصنف]]<>\"\",'Code'!E17,\"\")","v":""},{"$f":"SUMIFS(add[[#This Row],[الكمية المضافة]],add[[#This Row],[كود الصنف]],substore[[#This Row],[كود الصنف]],add[[#This Row],[مخزن الإضافة]],$K$2)","v":0},{"$f":"SUMIFS(low[[#This Row],[الكميه المنصرفه]],low[[#This Row],[رقم الصنف]],C18,low[[#This Row],[مخزن الصرف]],$K$2)","v":0},0]

{"sheet":"Report","index":5,"n_rows":972,"n_cols":10,"rows_kept":972,"cut":false,"hidden":false,"merged":[[1,2,1,7],[12,2,12,6]]}
[null,null,null,null,null,null,null,null,{"$f":"IF('Code'!B6=1,MIN(code[كود الصنف]),MIN(code[كود الصنف])+1)","v":1},{"$f":"MAX(code[كود الصنف])","v":7}]
[]
[null,null,"رئيسي","اسم المخزن",null,"كود الصنف",1]
[]
[null,null,"2016-01-01","تاريخ بداية التقرير",null,"اسم الصنف",{"$f":"IFERROR(VLOOKUP('Report'!G3,'Code'!$B$6:$F$158,2,0),\"\")","v":"ترابة"}]
[]
[null,null,"2016-01-31","تاريخ نهاية التقرير",null,{"$f":"IF(AND(G7<>\"\",G7<>0),\"رصيد سابق\",\"\")","v":"رصيد سابق"},{"$f":"IF(C13<>\"\",VLOOKUP(G3,code[],4,0),\"\")","v":17}]
[]
[null,null,{"$f":"IF(G3=\"\",\"\",SUM(report[وارد]))","v":104},"مجموع الوارد",null,"مجموع الصادر",{"$f":"IF(G3=\"\",\"\",SUM(report[صادر]))","v":40}]
[]
[null,null,null,"الرصيد:",{"$f":"IFERROR(IF(G3=\"\",\"\",(G7+C9)-G9),\"\")","v":81}]
[]
[null,null,{"$f":"G5","v":"ترابة"}]
["تاريخ",null,"التاريخ","وارد","صادر","الرصيد","ملاحظات","ملاحظات2"]
[{"$f":"C5","v":"2016-01-01"},null,{"$f":"C5","v":"2016-01-01"},{"$f":"IF(C15<>\"\",SUMIFS(add[الكمية المضافة],add[اسم الصنف],'Report'!$G$5,add[مخزن الإضافة],'Report'!$C$3,add[تاريخ الإذن],'Report'!C15),\"\")","v":99},{"$f":"IF(C15<>\"\",SUMIFS(low[الكميه المنصرفه],low[اسم الصنف],'Report'!$G$5,low[مخزن الصرف],'Report'!$C$3,low[تاريخ الإذن],'Report'!C15),\"\")","v":15},{"$f":"IFERROR(IF(C15<>\"\",$G$7+D15-E15,\"\"),\"\")","v":101},null,{"$f":"IF( OR(report[[#This Row],[صادر]]>0,report[[#This Row],[وارد]]>0),\"يحسب\",\"\")","v":"يحسب"}]
[{"$f":"A15+1","v":"2016-01-02"},null,{"$f":"IFERROR(IF(C15+1<=$C$7,C15+1,\"\"),\"\")","v":"2016-01-02"},{"$f":"IF(C16<>\"\",SUMIFS(add[الكمية المضافة],add[اسم الصنف],'Report'!$G$5,add[مخزن الإضافة],'Report'!$C$3,add[تاريخ الإذن],'Report'!C16),\"\")","v":0},{"$f":"IF(C16<>\"\",SUMIFS(low[الكميه المنصرفه],low[اسم الصنف],'Report'!$G$5,low[مخزن الصرف],'Report'!$C$3,low[تاريخ الإذن],'Report'!C16),\"\")","v":0},{"$f":"IFERROR(IF(C16<>\"\",F15+D16-E16,\"\"),\"\")","v":101},null,{"$f":"IF( OR(report[[#This Row],[صادر]]>0,report[[#This Row],[وارد]]>0),\"يحسب\",\"\")","v":""}]
[{"$f":"A16+1","v":"2016-01-03"},null,"2016-01-03",{"$f":"IF(C17<>\"\",SUMIFS(add[الكمية المضافة],add[اسم الصنف],'Report'!$G$5,add[مخزن الإضافة],'Report'!$C$3,add[تاريخ الإذن],'Report'!C17),\"\")","v":0},{"$f":"IF(C17<>\"\",SUMIFS(low[الكميه المنصرفه],low[اسم الصنف],'Report'!$G$5,low[مخزن الصرف],'Report'!$C$3,low[تاريخ الإذن],'Report'!C17),\"\")","v":0},{"$f":"IFERROR(IF(C17<>\"\",F16+D17-E17,\"\"),\"\")","v":101},null,{"$f":"IF( OR(report[[#This Row],[صادر]]>0,report[[#This Row],[وارد]]>0),\"يحسب\",\"\")","v":""}]
["2016-01-04",null,"2016-01-04",{"$f":"IF(C18<>\"\",SUMIFS(add[الكمية المضافة],add[اسم الصنف],'Report'!$G$5,add[مخزن الإضافة],'Report'!$C$3,add[تاريخ الإذن],'Report'!C18),\"\")","v":0},{"$f":"IF(C18<>\"\",SUMIFS(low[الكميه المنصرفه],low[اسم الصنف],'Report'!$G$5,low[مخزن الصرف],'Report'!$C$3,low[تاريخ الإذن],'Report'!C18),\"\")","v":0},101,null,{"$f":"IF( OR(report[[#This Row],[صادر]]>0,report[[#This Row],[وارد]]>0),\"يحسب\",\"\")","v":""}]
["2016-01-05",null,"2016-01-05",{"$f":"IF(C19<>\"\",SUMIFS(add[الكمية المضافة],add[اسم الصنف],'Report'!$G$5,add[مخزن الإضافة],'Report'!$C$3,add[تاريخ الإذن],'Report'!C19),\"\")","v":0},{"$f":"IF(C19<>\"\",SUMIFS(low[الكميه المنصرفه],low[اسم الصنف],'Report'!$G$5,low[مخزن الصرف],'Report'!$C$3,low[تاريخ الإذن],'Report'!C19),\"\")","v":0},101,null,{"$f":"IF( OR(report[[#This Row],[صادر]]>0,report[[#This Row],[وارد]]>0),\"يحسب\",\"\")","v":""}]
["2016-01-06",null,"2016-01-06",{"$f":"IF(C20<>\"\",SUMIFS(add[الكمية المضافة],add[اسم الصنف],'Report'!$G$5,add[مخزن الإضافة],'Report'!$C$3,add[تاريخ الإذن],'Report'!C20),\"\")","v":0},{"$f":"IF(C20<>\"\",SUMIFS(low[الكميه المنصرفه],low[اسم الصنف],'Report'!$G$5,low[مخزن الصرف],'Report'!$C$3,low[تاريخ الإذن],'Report'!C20),\"\")","v":0},101,null,{"$f":"IF( OR(report[[#This Row],[صادر]]>0,report[[#This Row],[وارد]]>0),\"يحسب\",\"\")","v":""}]
{"$rows_left_out":953}
{"sheet":"Intro","index":6,"n_rows":0,"n_cols":0,"rows_kept":0,"cut":false,"hidden":false,"merged":[]}