{"text_format":"1","workbook":"xlsx","n_sheets":11,"sheets":["الرئيسية","مشتريات","مبيعات","مخزون","الاصناف","العملاء","الموردين","الفاتورة","مصروفات","ارباح وخسائر","ميزانية"],"not_rendered":{"charts":0,"images":5,"macros":1,"external_links":0,"defined_names":12,"comments":0,"pivot_tables":0},"unopened":[],"bounds":{"document_bytes":16777216,"sheet_cells":100000,"rows_first":2000,"rows_last":500,"rows_between":2000,"halvings":0,"cell_chars":16384,"cell_head_chars":4096},"cells_cut":0,"cells_raw":0,"read":"whole","date_system":"1900"}

{"sheet":"الرئيسية","index":0,"n_rows":8,"n_cols":1,"rows_kept":8,"cut":false,"hidden":false,"merged":[[7,0,22,0]]}
[]
[]
[]
[]
[]
[]
[]
["ملحوظة \nالبرنامج مازال تحت الإنشاء والتجربة"]

{"sheet":"مشتريات","index":1,"n_rows":756,"n_cols":14,"rows_kept":756,"cut":false,"hidden":false,"merged":[[1,0,1,9]]}
[]
["قـــــــائـــــــــمة المشـــــــــــــــتريــــــات / الــــــــــــــوارد"]
["الرقم","كود الصنف","اسم الصنف","نوع","كمية","عدد","سعر","اجمالى","ملاحظات","تــاريخ الشراء","اسم المورد","رقـــم الفــاتورة","المدفوع","الباقى"]
[{"$f":"IF($C$4=\"\",\"\",1)","v":1},2,"معجون اسنان جميل","دستة",10,120,20,200,null,"2019-11-01","وش السعد",1,null,{"$f":"IF(H4=\"\",\"\",H4-M4)","v":200}]
[{"$f":"IF(C5=\"\",\"\",A4+1)","v":2},1,"كريم شعر حلو قوى","عدد",5,5,7,35,null,"2019-11-01","وش السعد",1,null,{"$f":"IF(H5=\"\",\"\",H5-M5)","v":35}]
[{"$f":"IF(C6=\"\",\"\",A5+1)","v":3},1,"كريم شعر حلو قوى","عدد",25,25,4,100,null,"2019-08-01","وش السعد",2]
[""]
[""]
[""]
[""]
[""]
[""]
[""]
[""]
[""]
[""]
[""]
[""]
[""]
[""]
[""]
[""]
[""]
[""]
[""]
[""]
[""]
[""]
[""]
[""]
[""]
[""]
[""]
[""]
[""]
[""]
[""]
[""]
[""]
[""]
[""]
[""]
[""]
[""]
[""]
[""]
[""]
[""]
[""]
[""]
[""]
[""]
[""]
[""]
[""]
[""]
[""]
[""]
[""]
[""]
{"$rows_left_out":697}
{"sheet":"مبيعات","index":2,"n_rows":756,"n_cols":14,"rows_kept":756,"cut":false,"hidden":false,"merged":[[1,0,1,9]]}
[]
["قـــــــائـــــــــمة المبــيــــــــــعات / الــــــــــمـــــــنــــــــــصرف"]
["الرقم","كود الصنف","اسم الصنف","نوع","كمية","عدد","سعر","اجمالى","ملاحظات","تــاريخ الشراء","اسم المورد","رقـــم الفــاتورة","المدفوع","الباقى"]
[{"$f":"IF($C$4=\"\",\"\",1)","v":1},1,"كريم شعر حلو قوى","دستة",12,144,32,384,null,"2019-11-01","فكرى",1]
[{"$f":"IF(C5=\"\",\"\",A4+1)","v":2},2,"معجون اسنان جميل","عدد",25,25,4,100,null,"2019-11-01","فكرى",1]
[{"$f":"IF(C6=\"\",\"\",A5+1)","v":""},"",null,null,null,"",null,"",null,"","",""]
["","",null,null,null,"",null,"",null,"","",""]
["","",null,null,null,"",null,"",null,"","",""]
["","",null,null,null,"",null,"",null,"","",""]
["","",null,null,null,"",null,"",null,"","",""]
["","",null,null,null,"",null,"",null,"","",""]
["","",null,null,null,"",null,"",null,"","",""]
["","",null,null,null,"",null,"",null,"","",""]
["","",null,null,null,"",null,"",null,"","",""]
["","",null,null,null,"",null,"",null,"","",""]
["","",null,null,null,"",null,"",null,"","",""]
["","",null,null,null,"",null,"",null,"","",""]
["",null,null,null,null,null,null,null,null,"","",""]
["","",null,null,null,"",null,""]
[""]
[""]
[""]
[""]
[""]
[""]
[""]
[""]
[""]
[""]
[""]
[""]
[""]
[""]
[""]
[""]
[""]
[""]
[""]
[""]
[""]
[""]
[""]
[""]
[""]
[""]
[""]
[""]
[""]
[""]
[""]
[""]
[""]
[""]
[""]
[""]
[""]
[""]
[""]
[""]
[""]
{"$rows_left_out":697}
{"sheet":"مخزون","index":3,"n_rows":1000,"n_cols":9,"rows_kept":1000,"cut":false,"hidden":false,"merged":[[0,0,0,7],[1,1,1,8]]}
[]
[null,"قـــــــائـــــــــمه المخــــــــــــزون"]
[null,"الرقم","الصنف","الوحدة","رقم الصنف","الكمية الوادرة","الكمية المنصرفة","الرصيد","دستة"]
[null,1,"كريم شعر حلو قوى",{"$f":"الاصناف!C4","v":"علبة"},{"$f":"SUMIF(الاصناف!$B$4:$B$999,C4,الاصناف!A$4:$A1001)","v":1},{"$f":"SUMIF(مشتريات!$B$4:$B$9000,$E4,مشتريات!$E$4:$E$5000)","v":30},{"$f":"SUMIF(مبيعات!$B$4:$B$9000,$E4,مبيعات!$E$4:$E$5000)","v":12},{"$f":"F4-G4","v":18},{"$f":"H4/12","v":1.5}]
[null,{"$f":"IF(C5<>\"\",B4+1,\"\")","v":2},{"$f":"الاصناف!B5","v":"معجون اسنان جميل"},{"$f":"الاصناف!C5","v":"انبوبة"},{"$f":"SUMIF(الاصناف!$B$4:$B$999,C5,الاصناف!$A$4:B1002)","v":2},{"$f":"SUMIF(مشتريات!$B$4:$B$9000,$E5,مشتريات!$E$4:$E$5000)","v":10},{"$f":"SUMIF(مبيعات!$B$4:$B$9000,$E5,مبيعات!$E$4:$E$5000)","v":25},-15,{"$f":"H5/12","v":-1.25}]
[null,3,{"$f":"الاصناف!B6","v":0},{"$f":"الاصناف!C6","v":0},{"$f":"SUMIF(الاصناف!$B$4:$B$999,C6,الاصناف!$A$4:B1003)","v":0},{"$f":"SUMIF(مشتريات!$B$4:$B$9000,$E6,مشتريات!$E$4:$E$5000)","v":0},{"$f":"SUMIF(مبيعات!$B$4:$B$9000,$E6,مبيعات!$E$4:$E$5000)","v":0},0,0]
[null,4,{"$f":"الاصناف!B7","v":0},{"$f":"الاصناف!C7","v":0},{"$f":"SUMIF(الاصناف!$B$4:$B$999,C7,الاصناف!$A$4:B1004)","v":0},{"$f":"SUMIF(مشتريات!$B$4:$B$9000,$E7,مشتريات!$E$4:$E$5000)","v":0},{"$f":"SUMIF(مبيعات!$B$4:$B$9000,$E7,مبيعات!$E$4:$E$5000)","v":0},0,0]
[null,5,{"$f":"الاصناف!B8","v":0},{"$f":"الاصناف!C8","v":0},{"$f":"SUMIF(الاصناف!$B$4:$B$999,C8,الاصناف!$A$4:B1005)","v":0},{"$f":"SUMIF(مشتريات!$B$4:$B$9000,$E8,مشتريات!$E$4:$E$5000)","v":0},{"$f":"SUMIF(مبيعات!$B$4:$B$9000,$E8,مبيعات!$E$4:$E$5000)","v":0},0,0]
[null,6,{"$f":"الاصناف!B9","v":0},{"$f":"الاصناف!C9","v":0},{"$f":"SUMIF(الاصناف!$B$4:$B$999,C9,الاصناف!$A$4:B1006)","v":0},{"$f":"SUMIF(مشتريات!$B$4:$B$9000,$E9,مشتريات!$E$4:$E$5000)","v":0},{"$f":"SUMIF(مبيعات!$B$4:$B$9000,$E9,مبيعات!$E$4:$E$5000)","v":0},0,0]
[null,7,{"$f":"الاصناف!B10","v":0},{"$f":"الاصناف!C10","v":0},{"$f":"SUMIF(الاصناف!$B$4:$B$999,C10,الاصناف!$A$4:B1007)","v":0},{"$f":"SUMIF(مشتريات!$B$4:$B$9000,$E10,مشتريات!$E$4:$E$5000)","v":0},{"$f":"SUMIF(مبيعات!$B$4:$B$9000,$E10,مبيعات!$E$4:$E$5000)","v":0},0,0]
[null,8,{"$f":"الاصناف!B11","v":0},{"$f":"الاصناف!C11","v":0},{"$f":"SUMIF(الاصناف!$B$4:$B$999,C11,الاصناف!$A$4:B1008)","v":0},{"$f":"SUMIF(مشتريات!$B$4:$B$9000,$E11,مشتريات!$E$4:$E$5000)","v":0},{"$f":"SUMIF(مبيعات!$B$4:$B$9000,$E11,مبيعات!$E$4:$E$5000)","v":0},0,0]
[null,9,{"$f":"الاصناف!B12","v":0},{"$f":"الاصناف!C12","v":0},{"$f":"SUMIF(الاصناف!$B$4:$B$999,C12,الاصناف!$A$4:B1009)","v":0},{"$f":"SUMIF(مشتريات!$B$4:$B$9000,$E12,مشتريات!$E$4:$E$5000)","v":0},{"$f":"SUMIF(مبيعات!$B$4:$B$9000,$E12,مبيعات!$E$4:$E$5000)","v":0},0,0]
[null,10,{"$f":"الاصناف!B13","v":0},{"$f":"الاصناف!C13","v":0},{"$f":"SUMIF(الاصناف!$B$4:$B$999,C13,الاصناف!$A$4:B1010)","v":0},{"$f":"SUMIF(مشتريات!$B$4:$B$9000,$E13,مشتريات!$E$4:$E$5000)","v":0},{"$f":"SUMIF(مبيعات!$B$4:$B$9000,$E13,مبيعات!$E$4:$E$5000)","v":0},0,0]
[null,11,{"$f":"الاصناف!B14","v":0},{"$f":"الاصناف!C14","v":0},{"$f":"SUMIF(الاصناف!$B$4:$B$999,C14,الاصناف!$A$4:B1011)","v":0},{"$f":"SUMIF(مشتريات!$B$4:$B$9000,$E14,مشتريات!$E$4:$E$5000)","v":0},{"$f":"SUMIF(مبيعات!$B$4:$B$9000,$E14,مبيعات!$E$4:$E$5000)","v":0},0,0]
[null,12,{"$f":"الاصناف!B15","v":0},{"$f":"الاصناف!C15","v":0},{"$f":"SUMIF(الاصناف!$B$4:$B$999,C15,الاصناف!$A$4:B1012)","v":0},{"$f":"SUMIF(مشتريات!$B$4:$B$9000,$E15,مشتريات!$E$4:$E$5000)","v":0},{"$f":"SUMIF(مبيعات!$B$4:$B$9000,$E15,مبيعات!$E$4:$E$5000)","v":0},0,0]
[null,13,{"$f":"الاصناف!B16","v":0},{"$f":"الاصناف!C16","v":0},{"$f":"SUMIF(الاصناف!$B$4:$B$999,C16,الاصناف!$A$4:B1013)","v":0},{"$f":"SUMIF(مشتريات!$B$4:$B$9000,$E16,مشتريات!$E$4:$E$5000)","v":0},{"$f":"SUMIF(مبيعات!$B$4:$B$9000,$E16,مبيعات!$E$4:$E$5000)","v":0},0,0]
[null,14,{"$f":"الاصناف!B17","v":0},{"$f":"الاصناف!C17","v":0},{"$f":"SUMIF(الاصناف!$B$4:$B$999,C17,الاصناف!$A$4:B1014)","v":0},{"$f":"SUMIF(مشتريات!$B$4:$B$9000,$E17,مشتريات!$E$4:$E$5000)","v":0},{"$f":"SUMIF(مبيعات!$B$4:$B$9000,$E17,مبيعات!$E$4:$E$5000)","v":0},0,0]
[null,15,{"$f":"الاصناف!B18","v":0},{"$f":"الاصناف!C18","v":0},{"$f":"SUMIF(الاصناف!$B$4:$B$999,C18,الاصناف!$A$4:B1015)","v":0},{"$f":"SUMIF(مشتريات!$B$4:$B$9000,$E18,مشتريات!$E$4:$E$5000)","v":0},{"$f":"SUMIF(مبيعات!$B$4:$B$9000,$E18,مبيعات!$E$4:$E$5000)","v":0},0,0]
[null,16,{"$f":"الاصناف!B19","v":0},{"$f":"الاصناف!C19","v":0},{"$f":"SUMIF(الاصناف!$B$4:$B$999,C19,الاصناف!$A$4:B1016)","v":0},{"$f":"SUMIF(مشتريات!$B$4:$B$9000,$E19,مشتريات!$E$4:$E$5000)","v":0},{"$f":"SUMIF(مبيعات!$B$4:$B$9000,$E19,مبيعات!$E$4:$E$5000)","v":0},0,0]
[null,17,{"$f":"الاصناف!B20","v":0},{"$f":"الاصناف!C20","v":0},{"$f":"SUMIF(الاصناف!$B$4:$B$999,C20,الاصناف!$A$4:B1017)","v":0},{"$f":"SUMIF(مشتريات!$B$4:$B$9000,$E20,مشتريات!$E$4:$E$5000)","v":0},{"$f":"SUMIF(مبيعات!$B$4:$B$9000,$E20,مبيعات!$E$4:$E$5000)","v":0},0,0]
[null,18,{"$f":"الاصناف!B21","v":0},{"$f":"الاصناف!C21","v":0},{"$f":"SUMIF(الاصناف!$B$4:$B$999,C21,الاصناف!$A$4:B1018)","v":0},{"$f":"SUMIF(مشتريات!$B$4:$B$9000,$E21,مشتريات!$E$4:$E$5000)","v":0},{"$f":"SUMIF(مبيعات!$B$4:$B$9000,$E21,مبيعات!$E$4:$E$5000)","v":0},0,0]
[null,19,{"$f":"الاصناف!B22","v":0},{"$f":"الاصناف!C22","v":0},{"$f":"SUMIF(الاصناف!$B$4:$B$999,C22,الاصناف!$A$4:B1019)","v":0},{"$f":"SUMIF(مشتريات!$B$4:$B$9000,$E22,مشتريات!$E$4:$E$5000)","v":0},{"$f":"SUMIF(مبيعات!$B$4:$B$9000,$E22,مبيعات!$E$4:$E$5000)","v":0},0,0]
[null,20,{"$f":"الاصناف!B23","v":0},{"$f":"الاصناف!C23","v":0},{"$f":"SUMIF(الاصناف!$B$4:$B$999,C23,الاصناف!A$4:$A1020)","v":0},{"$f":"SUMIF(مشتريات!$B$4:$B$9000,$E23,مشتريات!$E$4:$E$5000)","v":0},{"$f":"SUMIF(مبيعات!$B$4:$B$9000,$E23,مبيعات!$E$4:$E$5000)","v":0},0,0]
[null,21,{"$f":"الاصناف!B24","v":0},{"$f":"الاصناف!C24","v":0},{"$f":"SUMIF(الاصناف!$B$4:$B$999,C24,الاصناف!$A$4:B1021)","v":0},{"$f":"SUMIF(مشتريات!$B$4:$B$9000,$E24,مشتريات!$E$4:$E$5000)","v":0},{"$f":"SUMIF(مبيعات!$B$4:$B$9000,$E24,مبيعات!$E$4:$E$5000)","v":0},0,0]
[null,22,{"$f":"الاصناف!B25","v":0},{"$f":"الاصناف!C25","v":0},{"$f":"SUMIF(الاصناف!$B$4:$B$999,C25,الاصناف!$A$4:B1022)","v":0},{"$f":"SUMIF(مشتريات!$B$4:$B$9000,$E25,مشتريات!$E$4:$E$5000)","v":0},{"$f":"SUMIF(مبيعات!$B$4:$B$9000,$E25,مبيعات!$E$4:$E$5000)","v":0},0,0]
[null,23,{"$f":"الاصناف!B26","v":0},{"$f":"الاصناف!C26","v":0},{"$f":"SUMIF(الاصناف!$B$4:$B$999,C26,الاصناف!$A$4:B1023)","v":0},{"$f":"SUMIF(مشتريات!$B$4:$B$9000,$E26,مشتريات!$E$4:$E$5000)","v":0},{"$f":"SUMIF(مبيعات!$B$4:$B$9000,$E26,مبيعات!$E$4:$E$5000)","v":0},0,0]
[null,24,{"$f":"الاصناف!B27","v":0},{"$f":"الاصناف!C27","v":0},{"$f":"SUMIF(الاصناف!$B$4:$B$999,C27,الاصناف!$A$4:B1024)","v":0},{"$f":"SUMIF(مشتريات!$B$4:$B$9000,$E27,مشتريات!$E$4:$E$5000)","v":0},{"$f":"SUMIF(مبيعات!$B$4:$B$9000,$E27,مبيعات!$E$4:$E$5000)","v":0},0,0]
[null,25,{"$f":"الاصناف!B28","v":0},{"$f":"الاصناف!C28","v":0},{"$f":"SUMIF(الاصناف!$B$4:$B$999,C28,الاصناف!$A$4:B1025)","v":0},{"$f":"SUMIF(مشتريات!$B$4:$B$9000,$E28,مشتريات!$E$4:$E$5000)","v":0},{"$f":"SUMIF(مبيعات!$B$4:$B$9000,$E28,مبيعات!$E$4:$E$5000)","v":0},0,0]
[null,26,{"$f":"الاصناف!B29","v":0},{"$f":"الاصناف!C29","v":0},{"$f":"SUMIF(الاصناف!$B$4:$B$999,C29,الاصناف!$A$4:B1026)","v":0},{"$f":"SUMIF(مشتريات!$B$4:$B$9000,$E29,مشتريات!$E$4:$E$5000)","v":0},{"$f":"SUMIF(مبيعات!$B$4:$B$9000,$E29,مبيعات!$E$4:$E$5000)","v":0},0,0]
[null,27,{"$f":"الاصناف!B30","v":0},{"$f":"الاصناف!C30","v":0},{"$f":"SUMIF(الاصناف!$B$4:$B$999,C30,الاصناف!$A$4:B1027)","v":0},{"$f":"SUMIF(مشتريات!$B$4:$B$9000,$E30,مشتريات!$E$4:$E$5000)","v":0},{"$f":"SUMIF(مبيعات!$B$4:$B$9000,$E30,مبيعات!$E$4:$E$5000)","v":0},0,0]
[null,28,{"$f":"الاصناف!B31","v":0},{"$f":"الاصناف!C31","v":0},{"$f":"SUMIF(الاصناف!$B$4:$B$999,C31,الاصناف!$A$4:B1028)","v":0},{"$f":"SUMIF(مشتريات!$B$4:$B$9000,$E31,مشتريات!$E$4:$E$5000)","v":0},{"$f":"SUMIF(مبيعات!$B$4:$B$9000,$E31,مبيعات!$E$4:$E$5000)","v":0},0,0]
[null,29,{"$f":"الاصناف!B32","v":0},{"$f":"الاصناف!C32","v":0},{"$f":"SUMIF(الاصناف!$B$4:$B$999,C32,الاصناف!$A$4:B1029)","v":0},{"$f":"SUMIF(مشتريات!$B$4:$B$9000,$E32,مشتريات!$E$4:$E$5000)","v":0},{"$f":"SUMIF(مبيعات!$B$4:$B$9000,$E32,مبيعات!$E$4:$E$5000)","v":0},0,0]
[null,30,{"$f":"الاصناف!B33","v":0},{"$f":"الاصناف!C33","v":0},{"$f":"SUMIF(الاصناف!$B$4:$B$999,C33,الاصناف!$A$4:B1030)","v":0},{"$f":"SUMIF(مشتريات!$B$4:$B$9000,$E33,مشتريات!$E$4:$E$5000)","v":0},{"$f":"SUMIF(مبيعات!$B$4:$B$9000,$E33,مبيعات!$E$4:$E$5000)","v":0},0,0]
[null,31,{"$f":"الاصناف!B34","v":0},{"$f":"الاصناف!C34","v":0},{"$f":"SUMIF(الاصناف!$B$4:$B$999,C34,الاصناف!$A$4:B1031)","v":0},{"$f":"SUMIF(مشتريات!$B$4:$B$9000,$E34,مشتريات!$E$4:$E$5000)","v":0},{"$f":"SUMIF(مبيعات!$B$4:$B$9000,$E34,مبيعات!$E$4:$E$5000)","v":0},0,0]
[null,32,{"$f":"الاصناف!B35","v":0},{"$f":"الاصناف!C35","v":0},{"$f":"SUMIF(الاصناف!$B$4:$B$999,C35,الاصناف!$A$4:B1032)","v":0},{"$f":"SUMIF(مشتريات!$B$4:$B$9000,$E35,مشتريات!$E$4:$E$5000)","v":0},{"$f":"SUMIF(مبيعات!$B$4:$B$9000,$E35,مبيعات!$E$4:$E$5000)","v":0},0,0]
[null,33,{"$f":"الاصناف!B36","v":0},{"$f":"الاصناف!C36","v":0},{"$f":"SUMIF(الاصناف!$B$4:$B$999,C36,الاصناف!$A$4:B1033)","v":0},{"$f":"SUMIF(مشتريات!$B$4:$B$9000,$E36,مشتريات!$E$4:$E$5000)","v":0},{"$f":"SUMIF(مبيعات!$B$4:$B$9000,$E36,مبيعات!$E$4:$E$5000)","v":0},0,0]
[null,{"$f":"IF(C37<>\"\",B36+1,\"\")","v":34},{"$f":"الاصناف!B37","v":0},{"$f":"الاصناف!C37","v":0},{"$f":"SUMIF(الاصناف!$B$4:$B$999,C37,الاصناف!$A$4:B1034)","v":0},{"$f":"SUMIF(مشتريات!$B$4:$B$9000,$E37,مشتريات!$E$4:$E$5000)","v":0},{"$f":"SUMIF(مبيعات!$B$4:$B$9000,$E37,مبيعات!$E$4:$E$5000)","v":0},0,0]
[null,35,{"$f":"الاصناف!B38","v":0},{"$f":"الاصناف!C38","v":0},{"$f":"SUMIF(الاصناف!$B$4:$B$999,C38,الاصناف!$A$4:B1035)","v":0},{"$f":"SUMIF(مشتريات!$B$4:$B$9000,$E38,مشتريات!$E$4:$E$5000)","v":0},{"$f":"SUMIF(مبيعات!$B$4:$B$9000,$E38,مبيعات!$E$4:$E$5000)","v":0},0,0]
[null,36,{"$f":"الاصناف!B39","v":0},{"$f":"الاصناف!C39","v":0},{"$f":"SUMIF(الاصناف!$B$4:$B$999,C39,الاصناف!$A$4:B1036)","v":0},{"$f":"SUMIF(مشتريات!$B$4:$B$9000,$E39,مشتريات!$E$4:$E$5000)","v":0},{"$f":"SUMIF(مبيعات!$B$4:$B$9000,$E39,مبيعات!$E$4:$E$5000)","v":0},0,0]
[null,37,{"$f":"الاصناف!B40","v":0},{"$f":"الاصناف!C40","v":0},{"$f":"SUMIF(الاصناف!$B$4:$B$999,C40,الاصناف!$A$4:B1037)","v":0},{"$f":"SUMIF(مشتريات!$B$4:$B$9000,$E40,مشتريات!$E$4:$E$5000)","v":0},{"$f":"SUMIF(مبيعات!$B$4:$B$9000,$E40,مبيعات!$E$4:$E$5000)","v":0},0,0]
[null,38,{"$f":"الاصناف!B41","v":0},{"$f":"الاصناف!C41","v":0},{"$f":"SUMIF(الاصناف!$B$4:$B$999,C41,الاصناف!$A$4:B1038)","v":0},{"$f":"SUMIF(مشتريات!$B$4:$B$9000,$E41,مشتريات!$E$4:$E$5000)","v":0},{"$f":"SUMIF(مبيعات!$B$4:$B$9000,$E41,مبيعات!$E$4:$E$5000)","v":0},0,0]
[null,39,{"$f":"الاصناف!B42","v":0},{"$f":"الاصناف!C42","v":0},{"$f":"SUMIF(الاصناف!$B$4:$B$999,C42,الاصناف!A$4:$A1039)","v":0},{"$f":"SUMIF(مشتريات!$B$4:$B$9000,$E42,مشتريات!$E$4:$E$5000)","v":0},{"$f":"SUMIF(مبيعات!$B$4:$B$9000,$E42,مبيعات!$E$4:$E$5000)","v":0},0,0]
[null,40,{"$f":"الاصناف!B43","v":0},{"$f":"الاصناف!C43","v":0},{"$f":"SUMIF(الاصناف!$B$4:$B$999,C43,الاصناف!$A$4:B1040)","v":0},{"$f":"SUMIF(مشتريات!$B$4:$B$9000,$E43,مشتريات!$E$4:$E$5000)","v":0},{"$f":"SUMIF(مبيعات!$B$4:$B$9000,$E43,مبيعات!$E$4:$E$5000)","v":0},0,0]
[null,41,{"$f":"الاصناف!B44","v":0},{"$f":"الاصناف!C44","v":0},{"$f":"SUMIF(الاصناف!$B$4:$B$999,C44,الاصناف!$A$4:B1041)","v":0},{"$f":"SUMIF(مشتريات!$B$4:$B$9000,$E44,مشتريات!$E$4:$E$5000)","v":0},{"$f":"SUMIF(مبيعات!$B$4:$B$9000,$E44,مبيعات!$E$4:$E$5000)","v":0},0,0]
[null,42,{"$f":"الاصناف!B45","v":0},{"$f":"الاصناف!C45","v":0},{"$f":"SUMIF(الاصناف!$B$4:$B$999,C45,الاصناف!$A$4:B1042)","v":0},{"$f":"SUMIF(مشتريات!$B$4:$B$9000,$E45,مشتريات!$E$4:$E$5000)","v":0},{"$f":"SUMIF(مبيعات!$B$4:$B$9000,$E45,مبيعات!$E$4:$E$5000)","v":0},0,0]
[null,43,{"$f":"الاصناف!B46","v":0},{"$f":"الاصناف!C46","v":0},{"$f":"SUMIF(الاصناف!$B$4:$B$999,C46,الاصناف!$A$4:B1043)","v":0},{"$f":"SUMIF(مشتريات!$B$4:$B$9000,$E46,مشتريات!$E$4:$E$5000)","v":0},{"$f":"SUMIF(مبيعات!$B$4:$B$9000,$E46,مبيعات!$E$4:$E$5000)","v":0},0,0]
[null,44,{"$f":"الاصناف!B47","v":0},{"$f":"الاصناف!C47","v":0},{"$f":"SUMIF(الاصناف!$B$4:$B$999,C47,الاصناف!$A$4:B1044)","v":0},{"$f":"SUMIF(مشتريات!$B$4:$B$9000,$E47,مشتريات!$E$4:$E$5000)","v":0},{"$f":"SUMIF(مبيعات!$B$4:$B$9000,$E47,مبيعات!$E$4:$E$5000)","v":0},0,0]
[null,45,{"$f":"الاصناف!B48","v":0},{"$f":"الاصناف!C48","v":0},{"$f":"SUMIF(الاصناف!$B$4:$B$999,C48,الاصناف!$A$4:B1045)","v":0},{"$f":"SUMIF(مشتريات!$B$4:$B$9000,$E48,مشتريات!$E$4:$E$5000)","v":0},{"$f":"SUMIF(مبيعات!$B$4:$B$9000,$E48,مبيعات!$E$4:$E$5000)","v":0},0,0]
[null,46,{"$f":"الاصناف!B49","v":0},{"$f":"الاصناف!C49","v":0},{"$f":"SUMIF(الاصناف!$B$4:$B$999,C49,الاصناف!$A$4:B1046)","v":0},{"$f":"SUMIF(مشتريات!$B$4:$B$9000,$E49,مشتريات!$E$4:$E$5000)","v":0},{"$f":"SUMIF(مبيعات!$B$4:$B$9000,$E49,مبيعات!$E$4:$E$5000)","v":0},0,0]
[null,47,{"$f":"الاصناف!B50","v":0},{"$f":"الاصناف!C50","v":0},{"$f":"SUMIF(الاصناف!$B$4:$B$999,C50,الاصناف!$A$4:B1047)","v":0},{"$f":"SUMIF(مشتريات!$B$4:$B$9000,$E50,مشتريات!$E$4:$E$5000)","v":0},{"$f":"SUMIF(مبيعات!$B$4:$B$9000,$E50,مبيعات!$E$4:$E$5000)","v":0},0,0]
[null,48,{"$f":"الاصناف!B51","v":0},{"$f":"الاصناف!C51","v":0},{"$f":"SUMIF(الاصناف!$B$4:$B$999,C51,الاصناف!$A$4:B1048)","v":0},{"$f":"SUMIF(مشتريات!$B$4:$B$9000,$E51,مشتريات!$E$4:$E$5000)","v":0},{"$f":"SUMIF(مبيعات!$B$4:$B$9000,$E51,مبيعات!$E$4:$E$5000)","v":0},0,0]
[null,49,{"$f":"الاصناف!B52","v":0},{"$f":"الاصناف!C52","v":0},{"$f":"SUMIF(الاصناف!$B$4:$B$999,C52,الاصناف!$A$4:B1049)","v":0},{"$f":"SUMIF(مشتريات!$B$4:$B$9000,$E52,مشتريات!$E$4:$E$5000)","v":0},{"$f":"SUMIF(مبيعات!$B$4:$B$9000,$E52,مبيعات!$E$4:$E$5000)","v":0},0,0]
[null,50,{"$f":"الاصناف!B53","v":0},{"$f":"الاصناف!C53","v":0},{"$f":"SUMIF(الاصناف!$B$4:$B$999,C53,الاصناف!$A$4:B1050)","v":0},{"$f":"SUMIF(مشتريات!$B$4:$B$9000,$E53,مشتريات!$E$4:$E$5000)","v":0},{"$f":"SUMIF(مبيعات!$B$4:$B$9000,$E53,مبيعات!$E$4:$E$5000)","v":0},0,0]
[null,51,{"$f":"الاصناف!B54","v":0},{"$f":"الاصناف!C54","v":0},{"$f":"SUMIF(الاصناف!$B$4:$B$999,C54,الاصناف!$A$4:B1051)","v":0},{"$f":"SUMIF(مشتريات!$B$4:$B$9000,$E54,مشتريات!$E$4:$E$5000)","v":0},{"$f":"SUMIF(مبيعات!$B$4:$B$9000,$E54,مبيعات!$E$4:$E$5000)","v":0},0,0]
[null,52,{"$f":"الاصناف!B55","v":0},{"$f":"الاصناف!C55","v":0},{"$f":"SUMIF(الاصناف!$B$4:$B$999,C55,الاصناف!$A$4:B1052)","v":0},{"$f":"SUMIF(مشتريات!$B$4:$B$9000,$E55,مشتريات!$E$4:$E$5000)","v":0},{"$f":"SUMIF(مبيعات!$B$4:$B$9000,$E55,مبيعات!$E$4:$E$5000)","v":0},0,0]
[null,53,{"$f":"الاصناف!B56","v":0},{"$f":"الاصناف!C56","v":0},{"$f":"SUMIF(الاصناف!$B$4:$B$999,C56,الاصناف!$A$4:B1053)","v":0},{"$f":"SUMIF(مشتريات!$B$4:$B$9000,$E56,مشتريات!$E$4:$E$5000)","v":0},{"$f":"SUMIF(مبيعات!$B$4:$B$9000,$E56,مبيعات!$E$4:$E$5000)","v":0},0,0]
[null,54,{"$f":"الاصناف!B57","v":0},{"$f":"الاصناف!C57","v":0},{"$f":"SUMIF(الاصناف!$B$4:$B$999,C57,الاصناف!$A$4:B1054)","v":0},{"$f":"SUMIF(مشتريات!$B$4:$B$9000,$E57,مشتريات!$E$4:$E$5000)","v":0},{"$f":"SUMIF(مبيعات!$B$4:$B$9000,$E57,مبيعات!$E$4:$E$5000)","v":0},0,0]
[null,55,{"$f":"الاصناف!B58","v":0},{"$f":"الاصناف!C58","v":0},{"$f":"SUMIF(الاصناف!$B$4:$B$999,C58,الاصناف!$A$4:B1055)","v":0},{"$f":"SUMIF(مشتريات!$B$4:$B$9000,$E58,مشتريات!$E$4:$E$5000)","v":0},{"$f":"SUMIF(مبيعات!$B$4:$B$9000,$E58,مبيعات!$E$4:$E$5000)","v":0},0,0]
[null,56,{"$f":"الاصناف!B59","v":0},{"$f":"الاصناف!C59","v":0},{"$f":"SUMIF(الاصناف!$B$4:$B$999,C59,الاصناف!$A$4:B1056)","v":0},{"$f":"SUMIF(مشتريات!$B$4:$B$9000,$E59,مشتريات!$E$4:$E$5000)","v":0},{"$f":"SUMIF(مبيعات!$B$4:$B$9000,$E59,مبيعات!$E$4:$E$5000)","v":0},0,0]
[null,57,{"$f":"الاصناف!B60","v":0},{"$f":"الاصناف!C60","v":0},{"$f":"SUMIF(الاصناف!$B$4:$B$999,C60,الاصناف!$A$4:B1057)","v":0},{"$f":"SUMIF(مشتريات!$B$4:$B$9000,$E60,مشتريات!$E$4:$E$5000)","v":0},{"$f":"SUMIF(مبيعات!$B$4:$B$9000,$E60,مبيعات!$E$4:$E$5000)","v":0},0,0]
{"$rows_left_out":941}
{"sheet":"الاصناف","index":4,"n_rows":1000,"n_cols":4,"rows_kept":1000,"cut":false,"hidden":false,"merged":[[0,0,0,3],[1,1,1,3]]}
[]
[null,"قـــائمــــــة الاصــــــــــــناف"]
["كود الصنف","أســــم الــصــنــف","الــوحـــده","مــلاحــظـــات"]
[{"$f":"IF(B4<>\"\",1,\"\")","v":1},"كريم شعر حلو قوى","علبة"]
[{"$f":"IF(B5<>\"\",A4+1,\"\")","v":2},"معجون اسنان جميل","انبوبة"]
[]
[""]
[""]
[""]
[""]
[""]
[""]
[""]
[""]
[""]
[""]
[""]
[""]
[""]
[""]
[""]
[""]
[""]
[""]
[""]
[""]
[""]
[""]
[""]
[""]
[""]
[""]
[""]
[""]
[""]
[""]
[{"$f":"IF(B37<>\"\",A36+1,\"\")","v":""}]
[""]
[""]
[""]
[""]
[""]
[""]
[""]
[""]
[""]
[""]
[""]
[""]
[""]
[""]
[""]
[""]
[""]
[""]
[""]
[""]
[""]
[""]
[""]
{"$rows_left_out":941}
{"sheet":"العملاء","index":5,"n_rows":1000,"n_cols":4,"rows_kept":1000,"cut":false,"hidden":false,"merged":[[0,0,0,3],[1,0,1,3]]}
[]
["قائمة العملاء"]
["مسلسل","أســــم العميل","رقم التليفون","العنوان"]
[{"$f":"IF(B4<>\"\",1,\"\")","v":1},"فكرى"]
[{"$f":"IF(B5<>\"\",A4+1,\"\")","v":""}]
[""]
[""]
[""]
[""]
[""]
[""]
[""]
[""]
[""]
[""]
[""]
[""]
[""]
[""]
[""]
[""]
[""]
[""]
[""]
[""]
[""]
[""]
[""]
[""]
[""]
[""]
[""]
[""]
[""]
[""]
[""]
[""]
[""]
[""]
[""]
[""]
[""]
[""]
[""]
[""]
[""]
[""]
[""]
[""]
[""]
[""]
[""]
[""]
[""]
[""]
[""]
[""]
[""]
[""]
[""]
{"$rows_left_out":941}
{"sheet":"الموردين","index":6,"n_rows":1000,"n_cols":4,"rows_kept":1000,"cut":false,"hidden":false,"merged":[[0,0,0,3],[1,0,1,3]]}
[]
["قائمة الموردين"]
["مسلسل","أســــم المورد","رقم التليفون","العنوان"]
[{"$f":"IF(B4<>\"\",1,\"\")","v":1},"وش السعد"]
[{"$f":"IF(B5<>\"\",A4+1,\"\")","v":""}]
[""]
[""]
[""]
[""]
[""]
[""]
[""]
[""]
[""]
[""]
[""]
[""]
[""]
[""]
[""]
[""]
[""]
[""]
[""]
[""]
[""]
[""]
[""]
[""]
[""]
[""]
[""]
[""]
[""]
[""]
[""]
[""]
[""]
[""]
[""]
[""]
[""]
[""]
[""]
[""]
[""]
[""]
[""]
[""]
[""]
[""]
[""]
[""]
[""]
[""]
[""]
[""]
[""]
[""]
[""]
{"$rows_left_out":941}
{"sheet":"الفاتورة","index":7,"n_rows":24,"n_cols":16,"rows_kept":24,"cut":false,"hidden":false,"merged":[[21,1,23,2],[23,3,23,7],[3,6,3,7],[1,3,1,5],[2,0,2,1],[2,7,2,8]]}
[]
[null,null,"فـــــاتــورة :"]
["التاريخ:",null,null,null,null,null,{"$f":"IF($D$2=\"مبيعات\",\"العميل\",\"المورد\")","v":"المورد"},null,null,null,null,null,null,null,"دستة",12]
[null,null,null,null,null,null,"رقــــم الفــــــاتـــورة",null,{"$f":"IF($D$2=\"مبيعات\",MAX(مبيعات!$L$4:$L$1892)+1,MAX(مشتريات!$L$4:$L$1500)+1)","v":3},null,null,null,null,null,"نصف دستة",6]
["مسلسل","كود الصنف","اسم الصنف","نوع","كمية","عدد","سعر","اجمالى","ملاحظات","التــاريــخ","إسم المورد","رقـــم الفــاتورة","قيمة الوحدة",null,"عدد",1]
[{"$f":"IF($C$6=\"\",\"\",1)","v":""},{"$f":"IFERROR(INDEX(الاصناف!A:A,MATCH($C6,الاصناف!B:B,0)),\"\")","v":""},null,null,null,{"$f":"IFERROR($E6*VLOOKUP($D6,$O$3:$P$5,2,0),\"\")","v":""},null,{"$f":"IF(AND(E6=\"\",G6=\"\"),\"\",E6*G6)","v":""},null,{"$f":"IF(B6=\"\",\"\",$C$3)","v":""},{"$f":"IF(B6=\"\",\"\",$H$3)","v":""},{"$f":"IF(B6=\"\",\"\",$I$4)","v":""},{"$f":"IF(D6=$O$3,G6/$P$3,IF(D6=$O$4,G6/$P$4,IF(D6=$O$5,G6,\"-\")))","v":"-"}]
[{"$f":"IF(C7=\"\",\"\",A6+1)","v":""},{"$f":"IFERROR(INDEX(الاصناف!A:A,MATCH($C7,الاصناف!B:B,0)),\"\")","v":""},null,null,null,"",null,{"$f":"IF(AND(E7=\"\",G7=\"\"),\"\",E7*G7)","v":""},null,{"$f":"IF(B7=\"\",\"\",$C$3)","v":""},{"$f":"IF(B7=\"\",\"\",$H$3)","v":""},{"$f":"IF(B7=\"\",\"\",$I$4)","v":""},{"$f":"IF(D7=$O$3,G7/$P$3,IF(D7=$O$4,G7/$P$4,IF(D7=$O$5,G7,\"-\")))","v":"-"}]
[{"$f":"IF(C8=\"\",\"\",A7+1)","v":""},{"$f":"IFERROR(INDEX(الاصناف!A:A,MATCH($C8,الاصناف!B:B,0)),\"\")","v":""},null,null,null,"",null,"",null,"","","","-"]
["",{"$f":"IFERROR(INDEX(الاصناف!A:A,MATCH($C9,الاصناف!B:B,0)),\"\")","v":""},null,null,null,"",null,"",null,"","","","-"]
["",{"$f":"IFERROR(INDEX(الاصناف!A:A,MATCH($C10,الاصناف!B:B,0)),\"\")","v":""},null,null,null,"",null,"",null,"","","","-"]
["",{"$f":"IFERROR(INDEX(الاصناف!A:A,MATCH($C11,الاصناف!B:B,0)),\"\")","v":""},null,null,null,"",null,"",null,"","","","-"]
["",{"$f":"IFERROR(INDEX(الاصناف!A:A,MATCH($C12,الاصناف!B:B,0)),\"\")","v":""},null,null,null,"",null,"",null,"","","","-"]
["",{"$f":"IFERROR(INDEX(الاصناف!A:A,MATCH($C13,الاصناف!B:B,0)),\"\")","v":""},null,null,null,"",null,"",null,"","","","-"]
["",{"$f":"IFERROR(INDEX(الاصناف!A:A,MATCH($C14,الاصناف!B:B,0)),\"\")","v":""},null,null,null,"",null,"",null,"","","","-"]
["",{"$f":"IFERROR(INDEX(الاصناف!A:A,MATCH($C15,الاصناف!B:B,0)),\"\")","v":""},null,null,null,"",null,"",null,"","","","-"]
["",{"$f":"IFERROR(INDEX(الاصناف!A:A,MATCH($C16,الاصناف!B:B,0)),\"\")","v":""},null,null,null,"",null,"",null,"","","","-"]
["",{"$f":"IFERROR(INDEX(الاصناف!A:A,MATCH($C17,الاصناف!B:B,0)),\"\")","v":""},null,null,null,"",null,"",null,"","","","-"]
["",{"$f":"IFERROR(INDEX(الاصناف!A:A,MATCH($C18,الاصناف!B:B,0)),\"\")","v":""},null,null,null,"",null,"",null,"","","","-"]
["",{"$f":"IFERROR(INDEX(الاصناف!A:A,MATCH($C19,الاصناف!B:B,0)),\"\")","v":""},null,null,null,"",null,"",null,"","","","-"]
["",null,null,null,null,null,null,null,null,{"$f":"IF(B20=\"\",\"\",$C$3)","v":""},{"$f":"IF(B20=\"\",\"\",$H$3)","v":""},{"$f":"IF(B20=\"\",\"\",$I$4)","v":""},{"$f":"IF(D20=$O$3,G20/$P$3,IF(D20=$O$4,G20/$P$4,IF(D20=$O$5,G20,\"-\")))","v":"-"}]
[]
[null,"    أجمالي الفاتورة :",null,{"$f":"SUM($H$6:$H$20)","v":0},null,null,null,null,null,"مبيعـــــات"]
[null,null,null,null,null,null,null,null,null,"مشتريات"]
[null,null,null,{"$f":"NumtoTxt($D$22,\"جنيه\",\"قرش\")","v":"صفر"},null,null,null,null,null,"آجــــــــل"]

{"sheet":"مصروفات","index":8,"n_rows":0,"n_cols":0,"rows_kept":0,"cut":false,"hidden":false,"merged":[]}

{"sheet":"ارباح وخسائر","index":9,"n_rows":0,"n_cols":0,"rows_kept":0,"cut":false,"hidden":false,"merged":[]}

{"sheet":"ميزانية","index":10,"n_rows":0,"n_cols":0,"rows_kept":0,"cut":false,"hidden":false,"merged":[]}