{"text_format":"1","workbook":"xlsx","n_sheets":3,"sheets":["ورقة1","ورقة2","ورقة3"],"not_rendered":{"charts":0,"images":0,"macros":1,"external_links":1,"defined_names":1,"comments":0,"pivot_tables":0},"unopened":[],"bounds":{"document_bytes":16777216,"sheet_cells":100000,"rows_first":2000,"rows_last":500,"rows_between":2000,"halvings":0,"cell_chars":16384,"cell_head_chars":4096},"cells_cut":0,"cells_raw":0,"read":"whole","date_system":"1900"}

{"sheet":"ورقة1","index":0,"n_rows":17,"n_cols":13,"rows_kept":17,"cut":false,"hidden":false,"merged":[[1,1,2,1],[16,9,17,10],[16,6,17,7],[10,4,11,5],[13,4,14,5],[4,9,5,10],[7,9,8,10],[10,9,11,10],[13,9,14,10],[13,2,14,3],[4,2,5,3],[10,2,11,3],[4,7,5,8],[7,7,8,8],[10,7,11,8],[13,7,14,8],[16,3,17,4],[1,5,2,5],[1,6,2,9],[1,2,2,2],[7,2,8,3],[7,4,8,5],[4,4,5,5]]}
[null,null,"بحث",null,null,null,null,null,null,null,null,null,"السلام عليكم ورحمة الله وبركاته "]
[2,"كود",1,null,null,"بحث بالاسم"]
[null,null,null,null,null,null,null,null,null,null,null,null,"محتاج كود للبحث باسم الطالب وربطه بباقى الحقول"]
[]
[null,null,"اسم الطالب",null,{"$f":"VLOOKUP(C2,ورقة2!A:P,2,0)","v":"محمد"},null,null,"الديانة",null,{"$f":"VLOOKUP(C2,ورقة2!A:P,6,0)","v":"مسلم"},null,null,"وكود لحذف سجل من الجدول  ( ورقة 2 ) والاحتفاظ بالترقيم "]
[null,null,null,null,null,null,null,null,null,null,null,null,"فى المسلسل يعنى ترحيل الصفوف لاعلى مكان الصف المحذوف"]
[]
[null,null,"الرقم القومى",null,{"$f":"VLOOKUP(C2,ورقة2!A:P,3,0)","v":23658947561245},null,null,"الفصل",null,{"$f":"VLOOKUP(C2,ورقة2!A:O,7,0)","v":1},null,null,"وزيادة فى الكرم هل يمكن التعديل فى هذه الصفحة ويظهر  "]
[null,null,null,null,null,null,null,null,null,null,null,null,"اثر ذلك التعديل فى الجدول"]
[]
[null,null,"تاريخ الميلاد",null,{"$f":"VLOOKUP(C2,ورقة2!A:P,4,0)","v":"1970-10-06"},null,null,"الهواية",null,{"$f":"VLOOKUP(C2,ورقة2!A:O,8,0)","v":"كرة القدم"}]
[]
[]
[null,null,"الصف",null,{"$f":"VLOOKUP(C2,ورقة2!A:S,5,0)","v":"الأول"},null,null,"العنوان",null,{"$f":"VLOOKUP(C2,ورقة2!A:Q,9,0)","v":"المنيا"}]
[]
[]
[null,null,null,"بحث  ",null,null,"تعديل بيانات",null,null,"حذف طالب"]

{"sheet":"ورقة2","index":1,"n_rows":6,"n_cols":19,"rows_kept":6,"cut":false,"hidden":false,"merged":[]}
["مسلسل","اسم الطالب","الرقم القومى","تاريخ الميلاد","الصف","الديانة","الفصل","الهواية","العنوان","عمود9","عمود10","عمود11","عمود12","عمود13","عمود14","عمود15","عمود16","عمود17","عمود18"]
[{"$f":"ROW()-1","v":1},"محمد",23658947561245,"1970-10-06","الأول","مسلم",1,"كرة القدم","المنيا"]
[{"$f":"ROW()-1","v":2},"محمود",23658947561245,"2003-05-12","الأول","مسلم",1,"كرة القدم","اسيوط"]
[3,"حسن",23658947561245,"2010-05-12","الأول","مسلم",1,"كرة القدم","الجيزة"]
[4,"على",23658947561245,"2015-08-06","الأول","مسلم",1,"كرة القدم","المنيا"]
[{"$f":"ROW()-1","v":5},"خالد",23658947561245,"2000-08-11","الأول","مسلم",1,"كرة القدم","اسيوط"]

{"sheet":"ورقة3","index":2,"n_rows":0,"n_cols":0,"rows_kept":0,"cut":false,"hidden":false,"merged":[]}