{"text_format":"1","workbook":"xlsx","n_sheets":2,"sheets":["بيانات","تكت"],"not_rendered":{"charts":0,"images":0,"macros":1,"external_links":1,"defined_names":2,"comments":0,"pivot_tables":0},"unopened":[],"bounds":{"document_bytes":16777216,"sheet_cells":100000,"rows_first":2000,"rows_last":500,"rows_between":2000,"halvings":0,"cell_chars":16384,"cell_head_chars":4096},"cells_cut":0,"cells_raw":0,"read":"whole","date_system":"1900"}

{"sheet":"بيانات","index":0,"n_rows":601,"n_cols":4,"rows_kept":601,"cut":false,"hidden":false,"merged":[]}
["م","اسم الطالب","صناعة التلميذ","رقم الجلوس"]
[1,"ابراهيم ابراهيم محمد1"," تركيبات ومعدات كهربية",1]
[2,"احمد احمد محمد"," تركيبات ومعدات كهربية",2]
[3,"احمد  محمد رضوان"," تركيبات ومعدات كهربية",3]
[4,"احمد  احمد الحسينى "," تركيبات ومعدات كهربية",4]
[5,"احمد  احمد الحسينى "," تركيبات ومعدات كهربية",5]
[6,"احمد  احمد الحسينى "," تركيبات ومعدات كهربية",6]
[7,"احمد  احمد الحسينى "," تركيبات ومعدات كهربية",7]
[8,"احمد  احمد الحسينى "," تركيبات ومعدات كهربية",8]
[9,"احمد  احمد الحسينى "," تركيبات ومعدات كهربية",9]
[10,"احمد  احمد الحسينى "," تركيبات ومعدات كهربية",10]
[11,"احمد  احمد الحسينى "," تركيبات ومعدات كهربية",11]
[12,"احمد  احمد الحسينى "," تركيبات ومعدات كهربية",12]
[13,"احمد  احمد الحسينى "," تركيبات ومعدات كهربية",13]
[14,"احمد  احمد الحسينى "," تركيبات ومعدات كهربية",14]
[15,"احمد  احمد الحسينى "," تركيبات ومعدات كهربية",15]
[16,"احمد  احمد الحسينى "," تركيبات ومعدات كهربية",16]
[17,"احمد  احمد الحسينى "," تركيبات ومعدات كهربية",17]
[18,"احمد  احمد الحسينى "," تركيبات ومعدات كهربية",18]
[19,"احمد  احمد الحسينى "," تركيبات ومعدات كهربية",19]
[20,"احمد  احمد الحسينى "," تركيبات ومعدات كهربية",20]
[21,"احمد  احمد الحسينى "," تركيبات ومعدات كهربية",21]
[22,"احمد  احمد الحسينى "," تركيبات ومعدات كهربية",22]
[23,"احمد  احمد الحسينى "," تركيبات ومعدات كهربية",23]
[24,"احمد  احمد الحسينى "," تركيبات ومعدات كهربية",24]
[25,"احمد  احمد الحسينى "," تركيبات ومعدات كهربية",25]
[26,"احمد  احمد الحسينى "," تركيبات ومعدات كهربية",26]
[27,"احمد  احمد الحسينى "," تركيبات ومعدات كهربية",27]
[28,"احمد  احمد الحسينى "," تركيبات ومعدات كهربية",28]
[29,"احمد  احمد الحسينى "," تركيبات ومعدات كهربية",29]
[30,"احمد  احمد الحسينى "," تركيبات ومعدات كهربية",30]
[31,"احمد  احمد الحسينى "," تركيبات ومعدات كهربية",31]
[32,"احمد  احمد الحسينى "," تركيبات ومعدات كهربية",32]
[33,"احمد  احمد الحسينى "," تركيبات ومعدات كهربية",33]
[34,"احمد  احمد الحسينى "," تركيبات ومعدات كهربية",34]
[35,"احمد  احمد الحسينى "," تركيبات ومعدات كهربية",35]
[36,"احمد  احمد الحسينى "," تركيبات ومعدات كهربية",36]
[37,"احمد  احمد الحسينى "," تركيبات ومعدات كهربية",37]
[38,"احمد  احمد الحسينى "," تركيبات ومعدات كهربية",38]
[39,"احمد  احمد الحسينى "," تركيبات ومعدات كهربية",39]
[40,"احمد  احمد الحسينى "," تركيبات ومعدات كهربية",40]
[41,"احمد  احمد الحسينى "," تركيبات ومعدات كهربية",41]
[42,"احمد  احمد الحسينى "," تركيبات ومعدات كهربية",42]
[43,"احمد  احمد الحسينى "," تركيبات ومعدات كهربية",43]
[44,"احمد  احمد الحسينى "," تركيبات ومعدات كهربية",44]
[45,"احمد  احمد الحسينى "," تركيبات ومعدات كهربية",45]
[46,"احمد  احمد الحسينى "," تركيبات ومعدات كهربية",46]
[47,"احمد  احمد الحسينى "," تركيبات ومعدات كهربية",47]
[48,"احمد  احمد الحسينى "," تركيبات ومعدات كهربية",48]
[49,"احمد  احمد الحسينى "," تركيبات ومعدات كهربية",49]
[50,"احمد  احمد الحسينى "," تركيبات ومعدات كهربية",50]
[51,"احمد  احمد الحسينى "," تركيبات ومعدات كهربية",51]
[52,"احمد  احمد الحسينى "," تركيبات ومعدات كهربية",52]
[53,"احمد  احمد الحسينى "," تركيبات ومعدات كهربية",53]
[54,"احمد  احمد الحسينى "," تركيبات ومعدات كهربية",54]
[55,"احمد  احمد الحسينى "," تركيبات ومعدات كهربية",55]
[56,"احمد  احمد الحسينى "," تركيبات ومعدات كهربية",56]
[57,"احمد  احمد الحسينى "," تركيبات ومعدات كهربية",57]
[58,"احمد  احمد الحسينى "," تركيبات ومعدات كهربية",58]
[59,"احمد  احمد الحسينى "," تركيبات ومعدات كهربية",59]
[60,"احمد  احمد الحسينى "," تركيبات ومعدات كهربية",60]
[61,"احمد  احمد الحسينى "," تركيبات ومعدات كهربية",61]
[62,"احمد  احمد الحسينى "," تركيبات ومعدات كهربية",62]
[63,"احمد  احمد الحسينى "," تركيبات ومعدات كهربية",63]
[64,"احمد  احمد الحسينى "," تركيبات ومعدات كهربية",64]
[65,"احمد  احمد الحسينى "," تركيبات ومعدات كهربية",65]
[66,"احمد  احمد الحسينى "," تركيبات ومعدات كهربية",66]
[67,"احمد  احمد الحسينى "," تركيبات ومعدات كهربية",67]
[68,"احمد  احمد الحسينى "," تركيبات ومعدات كهربية",68]
[69,"احمد  احمد الحسينى "," تركيبات ومعدات كهربية",69]
[70,"احمد  احمد الحسينى "," تركيبات ومعدات كهربية",70]
[71,"احمد  احمد الحسينى "," تركيبات ومعدات كهربية",71]
[72,"احمد  احمد الحسينى "," تركيبات ومعدات كهربية",72]
[73,"احمد  احمد الحسينى "," تركيبات ومعدات كهربية",73]
[74,"احمد  احمد الحسينى "," تركيبات ومعدات كهربية",74]
[75,"احمد  احمد الحسينى "," تركيبات ومعدات كهربية",75]
[76,"احمد  احمد الحسينى "," تركيبات ومعدات كهربية",76]
[77,"احمد  احمد الحسينى "," تركيبات ومعدات كهربية",77]
[78,"احمد  احمد الحسينى "," تركيبات ومعدات كهربية",78]
[79,"احمد  احمد الحسينى "," تركيبات ومعدات كهربية",79]
[80,"احمد  احمد الحسينى "," تركيبات ومعدات كهربية",80]
[81,"احمد  احمد الحسينى "," تركيبات ومعدات كهربية",81]
[82,"احمد  احمد الحسينى "," تركيبات ومعدات كهربية",82]
[83,"احمد  احمد الحسينى "," تركيبات ومعدات كهربية",83]
[84,"احمد  احمد الحسينى "," تركيبات ومعدات كهربية",84]
[85,"احمد  احمد الحسينى "," تركيبات ومعدات كهربية",85]
[86,"احمد  احمد الحسينى "," تركيبات ومعدات كهربية",86]
[87,"احمد  احمد الحسينى "," تركيبات ومعدات كهربية",87]
[88,"احمد  احمد الحسينى "," تركيبات ومعدات كهربية",88]
[89,"احمد  احمد الحسينى "," تركيبات ومعدات كهربية",89]
[90,"احمد  احمد الحسينى "," تركيبات ومعدات كهربية",90]
[91,"احمد  احمد الحسينى "," تركيبات ومعدات كهربية",91]
[92,"احمد  احمد الحسينى "," تركيبات ومعدات كهربية",92]
[93,"احمد  احمد الحسينى "," تركيبات ومعدات كهربية",93]
[94,"احمد  احمد الحسينى "," تركيبات ومعدات كهربية",94]
[95,"احمد  احمد الحسينى "," تركيبات ومعدات كهربية",95]
[96,"احمد  احمد الحسينى "," تركيبات ومعدات كهربية",96]
[97,"احمد  احمد الحسينى "," تركيبات ومعدات كهربية",97]
[98,"احمد  احمد الحسينى "," تركيبات ومعدات كهربية",98]
[99,"احمد  احمد الحسينى "," تركيبات ومعدات كهربية",99]
[100,"احمد  احمد الحسينى "," تركيبات ومعدات كهربية",100]
[101,"احمد  احمد الحسينى "," تركيبات ومعدات كهربية",101]
[102,"احمد  احمد الحسينى "," تركيبات ومعدات كهربية",102]
[103,"احمد  احمد الحسينى "," تركيبات ومعدات كهربية",103]
[104,"احمد  احمد الحسينى "," تركيبات ومعدات كهربية",104]
[105,"احمد  احمد الحسينى "," تركيبات ومعدات كهربية",105]
[106,"احمد  احمد الحسينى "," تركيبات ومعدات كهربية",106]
[107,"احمد  احمد الحسينى "," تركيبات ومعدات كهربية",107]
[108,"احمد  احمد الحسينى "," تركيبات ومعدات كهربية",108]
[109,"احمد  احمد الحسينى "," تركيبات ومعدات كهربية",109]
[110,"احمد  احمد الحسينى "," تركيبات ومعدات كهربية",110]
[111,"احمد  احمد الحسينى "," تركيبات ومعدات كهربية",111]
[112,"احمد  احمد الحسينى "," تركيبات ومعدات كهربية",112]
[113,"احمد  احمد الحسينى "," تركيبات ومعدات كهربية",113]
[114,"احمد  احمد الحسينى "," تركيبات ومعدات كهربية",114]
[115,"احمد  احمد الحسينى "," تركيبات ومعدات كهربية",115]
[116,"احمد  احمد الحسينى "," تركيبات ومعدات كهربية",116]
[117,"احمد  احمد الحسينى "," تركيبات ومعدات كهربية",117]
[118,"احمد  احمد الحسينى "," تركيبات ومعدات كهربية",118]
[119,"احمد  احمد الحسينى "," تركيبات ومعدات كهربية",119]
[120,"احمد  احمد الحسينى "," تركيبات ومعدات كهربية",120]
[121,"احمد  احمد الحسينى "," تركيبات ومعدات كهربية",121]
[122,"احمد  احمد الحسينى "," تركيبات ومعدات كهربية",122]
[123,"احمد  احمد الحسينى "," تركيبات ومعدات كهربية",123]
[124,"احمد  احمد الحسينى "," تركيبات ومعدات كهربية",124]
[125,"احمد  احمد الحسينى "," تركيبات ومعدات كهربية",125]
[126,"احمد  احمد الحسينى "," تركيبات ومعدات كهربية",126]
[127,"احمد  احمد الحسينى "," تركيبات ومعدات كهربية",127]
[128,"احمد  احمد الحسينى "," تركيبات ومعدات كهربية",128]
[129,"احمد  احمد الحسينى "," تركيبات ومعدات كهربية",129]
[130,"احمد  احمد الحسينى "," تركيبات ومعدات كهربية",130]
[131,"احمد  احمد الحسينى "," تركيبات ومعدات كهربية",131]
[132,"احمد  احمد الحسينى "," تركيبات ومعدات كهربية",132]
[133,"احمد  احمد الحسينى "," تركيبات ومعدات كهربية",133]
[134,"احمد  احمد الحسينى "," تركيبات ومعدات كهربية",134]
[135,"احمد  احمد الحسينى "," تركيبات ومعدات كهربية",135]
[136,"احمد  احمد الحسينى "," تركيبات ومعدات كهربية",136]
[137,"احمد  احمد الحسينى "," تركيبات ومعدات كهربية",137]
[138,"احمد  احمد الحسينى "," تركيبات ومعدات كهربية",138]
[139,"احمد  احمد الحسينى "," تركيبات ومعدات كهربية",139]
[140,"احمد  احمد الحسينى "," تركيبات ومعدات كهربية",140]
[141,"احمد  احمد الحسينى "," تركيبات ومعدات كهربية",141]
[142,"احمد  احمد الحسينى "," تركيبات ومعدات كهربية",142]
[143,"احمد  احمد الحسينى "," تركيبات ومعدات كهربية",143]
[144,"احمد  احمد الحسينى "," تركيبات ومعدات كهربية",144]
[145,"احمد  احمد الحسينى "," تركيبات ومعدات كهربية",145]
[146,"احمد  احمد الحسينى "," تركيبات ومعدات كهربية",146]
[147,"احمد  احمد الحسينى "," تركيبات ومعدات كهربية",147]
[148,"احمد  احمد الحسينى "," تركيبات ومعدات كهربية",148]
[149,"احمد  احمد الحسينى "," تركيبات ومعدات كهربية",149]
[150,"احمد  احمد الحسينى "," تركيبات ومعدات كهربية",150]
[151,"احمد  احمد الحسينى "," تركيبات ومعدات كهربية",151]
[152,"احمد  احمد الحسينى "," تركيبات ومعدات كهربية",152]
[153,"احمد  احمد الحسينى "," تركيبات ومعدات كهربية",153]
[154,"احمد  احمد الحسينى "," تركيبات ومعدات كهربية",154]
[155,"احمد  احمد الحسينى "," تركيبات ومعدات كهربية",155]
[156,"احمد  احمد الحسينى "," تركيبات ومعدات كهربية",156]
[157,"احمد  احمد الحسينى "," تركيبات ومعدات كهربية",157]
[158,"احمد  احمد الحسينى "," تركيبات ومعدات كهربية",158]
[159,"احمد  احمد الحسينى "," تركيبات ومعدات كهربية",159]
[160,"احمد  احمد الحسينى "," تركيبات ومعدات كهربية",160]
[161,"احمد  احمد الحسينى "," تركيبات ومعدات كهربية",161]
[162,"احمد  احمد الحسينى "," تركيبات ومعدات كهربية",162]
[163,"احمد  احمد الحسينى "," تركيبات ومعدات كهربية",163]
[164,"احمد  احمد الحسينى "," تركيبات ومعدات كهربية",164]
[165,"احمد  احمد الحسينى "," تركيبات ومعدات كهربية",165]
[166,"احمد  احمد الحسينى "," تركيبات ومعدات كهربية",166]
[167,"احمد  احمد الحسينى "," تركيبات ومعدات كهربية",167]
[168,"احمد  احمد الحسينى "," تركيبات ومعدات كهربية",168]
[169,"احمد  احمد الحسينى "," تركيبات ومعدات كهربية",169]
[170,"احمد  احمد الحسينى "," تركيبات ومعدات كهربية",170]
[171,"احمد  احمد الحسينى "," تركيبات ومعدات كهربية",171]
[172,"احمد  احمد الحسينى "," تركيبات ومعدات كهربية",172]
[173,"احمد  احمد الحسينى "," تركيبات ومعدات كهربية",173]
[174,"احمد  احمد الحسينى "," تركيبات ومعدات كهربية",174]
[175,"احمد  احمد الحسينى "," تركيبات ومعدات كهربية",175]
[176,"احمد  احمد الحسينى "," تركيبات ومعدات كهربية",176]
[177,"احمد  احمد الحسينى "," تركيبات ومعدات كهربية",177]
[178,"احمد  احمد الحسينى "," تركيبات ومعدات كهربية",178]
[179,"احمد  احمد الحسينى "," تركيبات ومعدات كهربية",179]
[180,"احمد  احمد الحسينى "," تركيبات ومعدات كهربية",180]
[181,"احمد  احمد الحسينى "," تركيبات ومعدات كهربية",181]
[182,"احمد  احمد الحسينى "," تركيبات ومعدات كهربية",182]
[183,"احمد  احمد الحسينى "," تركيبات ومعدات كهربية",183]
[184,"احمد  احمد الحسينى "," تركيبات ومعدات كهربية",184]
[185,"احمد  احمد الحسينى "," تركيبات ومعدات كهربية",185]
[186,"احمد  احمد الحسينى "," تركيبات ومعدات كهربية",186]
[187,"احمد  احمد الحسينى "," تركيبات ومعدات كهربية",187]
[188,"احمد  احمد الحسينى "," تركيبات ومعدات كهربية",188]
[189,"احمد  احمد الحسينى "," تركيبات ومعدات كهربية",189]
[190,"احمد  احمد الحسينى "," تركيبات ومعدات كهربية",190]
[191,"احمد  احمد الحسينى "," تركيبات ومعدات كهربية",191]
[192,"احمد  احمد الحسينى "," تركيبات ومعدات كهربية",192]
[193,"احمد  احمد الحسينى "," تركيبات ومعدات كهربية",193]
[194,"احمد  احمد الحسينى "," تركيبات ومعدات كهربية",194]
[195,"احمد  احمد الحسينى "," تركيبات ومعدات كهربية",195]
[196,"احمد  احمد الحسينى "," تركيبات ومعدات كهربية",196]
[197,"احمد  احمد الحسينى "," تركيبات ومعدات كهربية",197]
[198,"احمد  احمد الحسينى "," تركيبات ومعدات كهربية",198]
[199,"احمد  احمد الحسينى "," تركيبات ومعدات كهربية",199]
[200,"احمد  احمد الحسينى "," تركيبات ومعدات كهربية",200]
[201,"احمد  احمد الحسينى "," تركيبات ومعدات كهربية",201]
[202,"احمد  احمد الحسينى "," تركيبات ومعدات كهربية",202]
[203,"احمد  احمد الحسينى "," تركيبات ومعدات كهربية",203]
[204,"احمد  احمد الحسينى "," تركيبات ومعدات كهربية",204]
[205,"احمد  احمد الحسينى "," تركيبات ومعدات كهربية",205]
[206,"احمد  احمد الحسينى "," تركيبات ومعدات كهربية",206]
[207,"احمد  احمد الحسينى "," تركيبات ومعدات كهربية",207]
[208,"احمد  احمد الحسينى "," تركيبات ومعدات كهربية",208]
[209,"احمد  احمد الحسينى "," تركيبات ومعدات كهربية",209]
[210,"احمد  احمد الحسينى "," تركيبات ومعدات كهربية",210]
[211,"احمد  احمد الحسينى "," تركيبات ومعدات كهربية",211]
[212,"احمد  احمد الحسينى "," تركيبات ومعدات كهربية",212]
[213,"احمد  احمد الحسينى "," تركيبات ومعدات كهربية",213]
[214,"احمد  احمد الحسينى "," تركيبات ومعدات كهربية",214]
[215,"احمد  احمد الحسينى "," تركيبات ومعدات كهربية",215]
[216,"احمد  احمد الحسينى "," تركيبات ومعدات كهربية",216]
[217,"احمد  احمد الحسينى "," تركيبات ومعدات كهربية",217]
[218,"احمد  احمد الحسينى "," تركيبات ومعدات كهربية",218]
[219,"احمد  احمد الحسينى "," تركيبات ومعدات كهربية",219]
[220,"احمد  احمد الحسينى "," تركيبات ومعدات كهربية",220]
[221,"احمد  احمد الحسينى "," تركيبات ومعدات كهربية",221]
[222,"احمد  احمد الحسينى "," تركيبات ومعدات كهربية",222]
[223,"احمد  احمد الحسينى "," تركيبات ومعدات كهربية",223]
[224,"احمد  احمد الحسينى "," تركيبات ومعدات كهربية",224]
[225,"احمد  احمد الحسينى "," تركيبات ومعدات كهربية",225]
[226,"احمد  احمد الحسينى "," تركيبات ومعدات كهربية",226]
[227,"احمد  احمد الحسينى "," تركيبات ومعدات كهربية",227]
[228,"احمد  احمد الحسينى "," تركيبات ومعدات كهربية",228]
[229,"احمد  احمد الحسينى "," تركيبات ومعدات كهربية",229]
[230,"احمد  احمد الحسينى "," تركيبات ومعدات كهربية",230]
[231,"احمد  احمد الحسينى "," تركيبات ومعدات كهربية",231]
[232,"احمد  احمد الحسينى "," تركيبات ومعدات كهربية",232]
[233,"احمد  احمد الحسينى "," تركيبات ومعدات كهربية",233]
[234,"احمد  احمد الحسينى "," تركيبات ومعدات كهربية",234]
[235,"احمد  احمد الحسينى "," تركيبات ومعدات كهربية",235]
[236,"احمد  احمد الحسينى "," تركيبات ومعدات كهربية",236]
[237,"احمد  احمد الحسينى "," تركيبات ومعدات كهربية",237]
[238,"احمد  احمد الحسينى "," تركيبات ومعدات كهربية",238]
[239,"احمد  احمد الحسينى "," تركيبات ومعدات كهربية",239]
[240,"احمد  احمد الحسينى "," تركيبات ومعدات كهربية",240]
[241,"احمد  احمد الحسينى "," تركيبات ومعدات كهربية",241]
[242,"احمد  احمد الحسينى "," تركيبات ومعدات كهربية",242]
[243,"احمد  احمد الحسينى "," تركيبات ومعدات كهربية",243]
[244,"احمد  احمد الحسينى "," تركيبات ومعدات كهربية",244]
[245,"احمد  احمد الحسينى "," تركيبات ومعدات كهربية",245]
[246,"احمد  احمد الحسينى "," تركيبات ومعدات كهربية",246]
[247,"احمد  احمد الحسينى "," تركيبات ومعدات كهربية",247]
[248,"احمد  احمد الحسينى "," تركيبات ومعدات كهربية",248]
[249,"احمد  احمد الحسينى "," تركيبات ومعدات كهربية",249]
[250,"احمد  احمد الحسينى "," تركيبات ومعدات كهربية",250]
[251,"احمد  احمد الحسينى "," تركيبات ومعدات كهربية",251]
[252,"احمد  احمد الحسينى "," تركيبات ومعدات كهربية",252]
[253,"احمد  احمد الحسينى "," تركيبات ومعدات كهربية",253]
[254,"احمد  احمد الحسينى "," تركيبات ومعدات كهربية",254]
[255,"احمد  احمد الحسينى "," تركيبات ومعدات كهربية",255]
[256,"احمد  احمد الحسينى "," تركيبات ومعدات كهربية",256]
[257,"احمد  احمد الحسينى "," تركيبات ومعدات كهربية",257]
[258,"احمد  احمد الحسينى "," تركيبات ومعدات كهربية",258]
[259,"احمد  احمد الحسينى "," تركيبات ومعدات كهربية",259]
[260,"احمد  احمد الحسينى "," تركيبات ومعدات كهربية",260]
[261,"احمد  احمد الحسينى "," تركيبات ومعدات كهربية",261]
[262,"احمد  احمد الحسينى "," تركيبات ومعدات كهربية",262]
[263,"احمد  احمد الحسينى "," تركيبات ومعدات كهربية",263]
[264,"احمد  احمد الحسينى "," تركيبات ومعدات كهربية",264]
[265,"احمد  احمد الحسينى "," تركيبات ومعدات كهربية",265]
[266,"احمد  احمد الحسينى "," تركيبات ومعدات كهربية",266]
[267,"احمد  احمد الحسينى "," تركيبات ومعدات كهربية",267]
[268,"احمد  احمد الحسينى "," تركيبات ومعدات كهربية",268]
[269,"احمد  احمد الحسينى "," تركيبات ومعدات كهربية",269]
[270,"احمد  احمد الحسينى "," تركيبات ومعدات كهربية",270]
[271,"احمد  احمد الحسينى "," تركيبات ومعدات كهربية",271]
[272,"احمد  احمد الحسينى "," تركيبات ومعدات كهربية",272]
[273,"احمد  احمد الحسينى "," تركيبات ومعدات كهربية",273]
[274,"احمد  احمد الحسينى "," تركيبات ومعدات كهربية",274]
[275,"احمد  احمد الحسينى "," تركيبات ومعدات كهربية",275]
[276,"احمد  احمد الحسينى "," تركيبات ومعدات كهربية",276]
[277,"احمد  احمد الحسينى "," تركيبات ومعدات كهربية",277]
[278,"احمد  احمد الحسينى "," تركيبات ومعدات كهربية",278]
[279,"احمد  احمد الحسينى "," تركيبات ومعدات كهربية",279]
[280,"احمد  احمد الحسينى "," تركيبات ومعدات كهربية",280]
[281,"احمد  احمد الحسينى "," تركيبات ومعدات كهربية",281]
[282,"احمد  احمد الحسينى "," تركيبات ومعدات كهربية",282]
[283,"احمد  احمد الحسينى "," تركيبات ومعدات كهربية",283]
[284,"احمد  احمد الحسينى "," تركيبات ومعدات كهربية",284]
[285,"احمد  احمد الحسينى "," تركيبات ومعدات كهربية",285]
[286,"احمد  احمد الحسينى "," تركيبات ومعدات كهربية",286]
[287,"احمد  احمد الحسينى "," تركيبات ومعدات كهربية",287]
[288,"احمد  احمد الحسينى "," تركيبات ومعدات كهربية",288]
[289,"احمد  احمد الحسينى "," تركيبات ومعدات كهربية",289]
[290,"احمد  احمد الحسينى "," تركيبات ومعدات كهربية",290]
[291,"احمد  احمد الحسينى "," تركيبات ومعدات كهربية",291]
[292,"احمد  احمد الحسينى "," تركيبات ومعدات كهربية",292]
[293,"احمد  احمد الحسينى "," تركيبات ومعدات كهربية",293]
[294,"احمد  احمد الحسينى "," تركيبات ومعدات كهربية",294]
[295,"احمد  احمد الحسينى "," تركيبات ومعدات كهربية",295]
[296,"احمد  احمد الحسينى "," تركيبات ومعدات كهربية",296]
[297,"احمد  احمد الحسينى "," تركيبات ومعدات كهربية",297]
[298,"احمد  احمد الحسينى "," تركيبات ومعدات كهربية",298]
[299,"احمد  احمد الحسينى "," تركيبات ومعدات كهربية",299]
[300,"احمد  احمد الحسينى "," تركيبات ومعدات كهربية",300]
[301,"احمد  احمد الحسينى "," تركيبات ومعدات كهربية",301]
[302,"احمد  احمد الحسينى "," تركيبات ومعدات كهربية",302]
[303,"احمد  احمد الحسينى "," تركيبات ومعدات كهربية",303]
[304,"احمد  احمد الحسينى "," تركيبات ومعدات كهربية",304]
[305,"احمد  احمد الحسينى "," تركيبات ومعدات كهربية",305]
[306,"احمد  احمد الحسينى "," تركيبات ومعدات كهربية",306]
[307,"احمد  احمد الحسينى "," تركيبات ومعدات كهربية",307]
[308,"احمد  احمد الحسينى "," تركيبات ومعدات كهربية",308]
[309,"احمد  احمد الحسينى "," تركيبات ومعدات كهربية",309]
[310,"احمد  احمد الحسينى "," تركيبات ومعدات كهربية",310]
[311,"احمد  احمد الحسينى "," تركيبات ومعدات كهربية",311]
[312,"احمد  احمد الحسينى "," تركيبات ومعدات كهربية",312]
[313,"احمد  احمد الحسينى "," تركيبات ومعدات كهربية",313]
[314,"احمد  احمد الحسينى "," تركيبات ومعدات كهربية",314]
[315,"احمد  احمد الحسينى "," تركيبات ومعدات كهربية",315]
[316,"احمد  احمد الحسينى "," تركيبات ومعدات كهربية",316]
[317,"احمد  احمد الحسينى "," تركيبات ومعدات كهربية",317]
[318,"احمد  احمد الحسينى "," تركيبات ومعدات كهربية",318]
[319,"احمد  احمد الحسينى "," تركيبات ومعدات كهربية",319]
[320,"احمد  احمد الحسينى "," تركيبات ومعدات كهربية",320]
[321,"احمد  احمد الحسينى "," تركيبات ومعدات كهربية",321]
[322,"احمد  احمد الحسينى "," تركيبات ومعدات كهربية",322]
[323,"احمد  احمد الحسينى "," تركيبات ومعدات كهربية",323]
[324,"احمد  احمد الحسينى "," تركيبات ومعدات كهربية",324]
[325,"احمد  احمد الحسينى "," تركيبات ومعدات كهربية",325]
[326,"احمد  احمد الحسينى "," تركيبات ومعدات كهربية",326]
[327,"احمد  احمد الحسينى "," تركيبات ومعدات كهربية",327]
[328,"احمد  احمد الحسينى "," تركيبات ومعدات كهربية",328]
[329,"احمد  احمد الحسينى "," تركيبات ومعدات كهربية",329]
[330,"احمد  احمد الحسينى "," تركيبات ومعدات كهربية",330]
[331,"احمد  احمد الحسينى "," تركيبات ومعدات كهربية",331]
[332,"احمد  احمد الحسينى "," تركيبات ومعدات كهربية",332]
[333,"احمد  احمد الحسينى "," تركيبات ومعدات كهربية",333]
[334,"احمد  احمد الحسينى "," تركيبات ومعدات كهربية",334]
[335,"احمد  احمد الحسينى "," تركيبات ومعدات كهربية",335]
[336,"احمد  احمد الحسينى "," تركيبات ومعدات كهربية",336]
[337,"احمد  احمد الحسينى "," تركيبات ومعدات كهربية",337]
[338,"احمد  احمد الحسينى "," تركيبات ومعدات كهربية",338]
[339,"احمد  احمد الحسينى "," تركيبات ومعدات كهربية",339]
[340,"احمد  احمد الحسينى "," تركيبات ومعدات كهربية",340]
[341,"احمد  احمد الحسينى "," تركيبات ومعدات كهربية",341]
[342,"احمد  احمد الحسينى "," تركيبات ومعدات كهربية",342]
[343,"احمد  احمد الحسينى "," تركيبات ومعدات كهربية",343]
[344,"احمد  احمد الحسينى "," تركيبات ومعدات كهربية",344]
[345,"احمد  احمد الحسينى "," تركيبات ومعدات كهربية",345]
[346,"احمد  احمد الحسينى "," تركيبات ومعدات كهربية",346]
[347,"احمد  احمد الحسينى "," تركيبات ومعدات كهربية",347]
[348,"احمد  احمد الحسينى "," تركيبات ومعدات كهربية",348]
[349,"احمد  احمد الحسينى "," تركيبات ومعدات كهربية",349]
[350,"احمد  احمد الحسينى "," تركيبات ومعدات كهربية",350]
[351,"احمد  احمد الحسينى "," تركيبات ومعدات كهربية",351]
[352,"احمد  احمد الحسينى "," تركيبات ومعدات كهربية",352]
[353,"احمد  احمد الحسينى "," تركيبات ومعدات كهربية",353]
[354,"احمد  احمد الحسينى "," تركيبات ومعدات كهربية",354]
[355,"احمد  احمد الحسينى "," تركيبات ومعدات كهربية",355]
[356,"احمد  احمد الحسينى "," تركيبات ومعدات كهربية",356]
[357,"احمد  احمد الحسينى "," تركيبات ومعدات كهربية",357]
[358,"احمد  احمد الحسينى "," تركيبات ومعدات كهربية",358]
[359,"احمد  احمد الحسينى "," تركيبات ومعدات كهربية",359]
[360,"احمد  احمد الحسينى "," تركيبات ومعدات كهربية",360]
[361,"احمد  احمد الحسينى "," تركيبات ومعدات كهربية",361]
[362,"احمد  احمد الحسينى "," تركيبات ومعدات كهربية",362]
[363,"احمد  احمد الحسينى "," تركيبات ومعدات كهربية",363]
[364,"احمد  احمد الحسينى "," تركيبات ومعدات كهربية",364]
[365,"احمد  احمد الحسينى "," تركيبات ومعدات كهربية",365]
[366,"احمد  احمد الحسينى "," تركيبات ومعدات كهربية",366]
[367,"احمد  احمد الحسينى "," تركيبات ومعدات كهربية",367]
[368,"احمد  احمد الحسينى "," تركيبات ومعدات كهربية",368]
[369,"احمد  احمد الحسينى "," تركيبات ومعدات كهربية",369]
[370,"احمد  احمد الحسينى "," تركيبات ومعدات كهربية",370]
[371,"احمد  احمد الحسينى "," تركيبات ومعدات كهربية",371]
[372,"احمد  احمد الحسينى "," تركيبات ومعدات كهربية",372]
[373,"احمد  احمد الحسينى "," تركيبات ومعدات كهربية",373]
[374,"احمد  احمد الحسينى "," تركيبات ومعدات كهربية",374]
[375,"احمد  احمد الحسينى "," تركيبات ومعدات كهربية",375]
[376,"احمد  احمد الحسينى "," تركيبات ومعدات كهربية",376]
[377,"احمد  احمد الحسينى "," تركيبات ومعدات كهربية",377]
[378,"احمد  احمد الحسينى "," تركيبات ومعدات كهربية",378]
[379,"احمد  احمد الحسينى "," تركيبات ومعدات كهربية",379]
[380,"احمد  احمد الحسينى "," تركيبات ومعدات كهربية",380]
[381,"احمد  احمد الحسينى "," تركيبات ومعدات كهربية",381]
[382,"احمد  احمد الحسينى "," تركيبات ومعدات كهربية",382]
[383,"احمد  احمد الحسينى "," تركيبات ومعدات كهربية",383]
[384,"احمد  احمد الحسينى "," تركيبات ومعدات كهربية",384]
[385,"احمد  احمد الحسينى "," تركيبات ومعدات كهربية",385]
[386,"احمد  احمد الحسينى "," تركيبات ومعدات كهربية",386]
[387,"احمد  احمد الحسينى "," تركيبات ومعدات كهربية",387]
[388,"احمد  احمد الحسينى "," تركيبات ومعدات كهربية",388]
[389,"احمد  احمد الحسينى "," تركيبات ومعدات كهربية",389]
[390,"احمد  احمد الحسينى "," تركيبات ومعدات كهربية",390]
[391,"احمد  احمد الحسينى "," تركيبات ومعدات كهربية",391]
[392,"احمد  احمد الحسينى "," تركيبات ومعدات كهربية",392]
[393,"احمد  احمد الحسينى "," تركيبات ومعدات كهربية",393]
[394,"احمد  احمد الحسينى "," تركيبات ومعدات كهربية",394]
[395,"احمد  احمد الحسينى "," تركيبات ومعدات كهربية",395]
[396,"احمد  احمد الحسينى "," تركيبات ومعدات كهربية",396]
[397,"احمد  احمد الحسينى "," تركيبات ومعدات كهربية",397]
[398,"احمد  احمد الحسينى "," تركيبات ومعدات كهربية",398]
[399,"احمد  احمد الحسينى "," تركيبات ومعدات كهربية",399]
{"$rows_left_out":202}
{"sheet":"تكت","index":1,"n_rows":17,"n_cols":7,"rows_kept":17,"cut":false,"hidden":false,"merged":[[12,0,12,1],[12,3,12,4],[3,0,3,1],[3,3,3,4],[0,0,0,1],[0,3,0,4],[1,0,1,1],[1,3,1,4],[2,0,2,1],[2,3,2,4],[9,0,9,1],[9,3,9,4],[10,0,10,1],[10,3,10,4],[11,0,11,1],[11,3,11,4]]}
["وزارة التربية والتعليم والتعليم الفنى ",null,null,"وزارة التربية والتعليم والتعليم الفنى ",null,null,9]
["امتحان دبلوم المدارس الثانوية الفنية الصناعية ",null,null,"امتحان دبلوم المدارس الثانوية الفنية الصناعية "]
["نظام السنوات الثلاث",null,null,"نظام السنوات الثلاث"]
["( سنة 2020/2019 ) م",null,null,"( سنة 2020/2019 ) م"]
["اسم التلميذ   /",{"$f":"IFERROR(INDEX(بيانات!$B:$B,MATCH($G$1,بيانات!$A:$A,0)),\"\")","v":"احمد  احمد الحسينى "},null,"اسم التلميذ   /",{"$f":"IFERROR(INDEX(بيانات!$B:$B,MATCH($G$1+1,بيانات!$A:$A,0)),\"\")","v":"احمد  احمد الحسينى "}]
["صناعة التلميذ  :",{"$f":"IFERROR(INDEX(بيانات!$C:$C,MATCH($G$1,بيانات!$A:$A,0)),\"\")","v":" تركيبات ومعدات كهربية"},null,"صناعة التلميذ  :",{"$f":"IFERROR(INDEX(بيانات!$C:$C,MATCH($G$1+1,بيانات!$A:$A,0)),\"\")","v":" تركيبات ومعدات كهربية"}]
["اسم المدرسة :","سسس الصناعية",null,"اسم المدرسة :","سسس الصناعية"]
["رقم الجلوس:",{"$f":"IFERROR(INDEX(بيانات!$D:$D,MATCH($G$1,بيانات!$A:$A,0)),\"\")","v":9},null,"رقم الجلوس:",{"$f":"IFERROR(INDEX(بيانات!$D:$D,MATCH($G$1+1,بيانات!$A:$A,0)),\"\")","v":10}]
[]
["وزارة التربية والتعليم والتعليم الفنى ",null,null,"وزارة التربية والتعليم والتعليم الفنى "]
["امتحان دبلوم المدارس الثانوية الفنية الصناعية ",null,null,"امتحان دبلوم المدارس الثانوية الفنية الصناعية "]
["نظام السنوات الثلاث",null,null,"نظام السنوات الثلاث"]
["( سنة 2020/2019 ) م",null,null,"( سنة 2020/2019 ) م"]
["اسم التلميذ   /",{"$f":"IFERROR(INDEX(بيانات!$B:$B,MATCH($G$1+2,بيانات!$A:$A,0)),\"\")","v":"احمد  احمد الحسينى "},null,"اسم التلميذ   /",{"$f":"IFERROR(INDEX(بيانات!$B:$B,MATCH($G$1+3,بيانات!$A:$A,0)),\"\")","v":"احمد  احمد الحسينى "}]
["صناعة التلميذ  :",{"$f":"IFERROR(INDEX(بيانات!$C:$C,MATCH($G$1+2,بيانات!$A:$A,0)),\"\")","v":" تركيبات ومعدات كهربية"},null,"صناعة التلميذ  :",{"$f":"IFERROR(INDEX(بيانات!$C:$C,MATCH($G$1+3,بيانات!$A:$A,0)),\"\")","v":" تركيبات ومعدات كهربية"}]
["اسم المدرسة :","سسس الصناعية",null,"اسم المدرسة :","سسس الصناعية"]
["رقم الجلوس:",{"$f":"IFERROR(INDEX(بيانات!$D:$D,MATCH($G$1+2,بيانات!$A:$A,0)),\"\")","v":11},null,"رقم الجلوس:",{"$f":"IFERROR(INDEX(بيانات!$D:$D,MATCH($G$1+3,بيانات!$A:$A,0)),\"\")","v":12}]