{"text_format":"1","workbook":"xlsx","n_sheets":4,"sheets":["Main","DB","date","INV"],"not_rendered":{"charts":0,"images":0,"macros":1,"external_links":0,"defined_names":5,"comments":0,"pivot_tables":0},"unopened":[],"bounds":{"document_bytes":16777216,"sheet_cells":100000,"rows_first":2000,"rows_last":500,"rows_between":2000,"halvings":0,"cell_chars":16384,"cell_head_chars":4096},"cells_cut":0,"cells_raw":0,"read":"whole","date_system":"1900"}

{"sheet":"Main","index":0,"n_rows":153,"n_cols":17,"rows_kept":153,"cut":false,"hidden":false,"merged":[[28,6,29,6],[28,7,29,7],[28,8,29,8],[27,6,27,8],[1,1,2,17],[5,2,5,3],[6,2,6,3],[7,2,7,3],[8,2,8,3],[4,9,5,9],[4,10,5,10],[9,2,9,3],[10,2,10,3],[4,6,5,6],[4,7,5,7],[4,8,5,8],[4,12,5,12],[4,13,5,13],[4,14,5,14],[4,15,5,15],[4,16,5,16]]}
[]
[null,"قائمة لفحص الأسعار وإضافة الطلبات"]
[]
[]
[null,null,null,null,null,null,{"$f":"G29","v":"الصنف"},{"$f":"H29","v":"التعبئة"},{"$f":"I29","v":"السعر KD"},"المطلوب","المخزن",null,"الصنف","التعبئة",{"$f":"I29","v":"السعر KD"},"المطلوب","المخزن"]
[null,null,"المنطقه"]
[null,null,"العنوان",null,null,null,{"$f":"G31","v":"كوجا احمر "},{"$f":"H31","v":"كيلو"},2.2000000000000002,null,{"$f":"DB!$I$5","v":{"$error":"#REF!"}},null,{"$f":"G42","v":"نيكتارين "},"سحارة",1.75,null,{"$f":"DB!$T$5","v":{"$error":"#REF!"}}]
[null,null,"التيلفون",null,null,null,"توت ","كيلو",3,null,{"$f":"DB!$J$5","v":{"$error":"#REF!"}},null,"خوخ ابيض","سحارة",3.75,null,{"$f":"DB!$U$5","v":{"$error":"#REF!"}}]
[null,null,"التاريخ",null,{"$f":"IF(E6<>\"\",TODAY(),\"\")","v":""},null,"جزر بيبي","علبة",0.5,null,{"$f":"DB!$K$5","v":{"$error":"#REF!"}},null,"باميه","15كيلو",15,null,{"$f":"DB!$V$5","v":{"$error":"#REF!"}}]
[null,null,"اسم السائق",null,null,null,"كرز","كيلو",1.5,null,{"$f":"DB!$L$5","v":{"$error":"#REF!"}},null,{"$f":"G46","v":0},{"$f":"H46","v":0},{"$f":"I46","v":0},null,{"$f":"DB!$W$5","v":{"$error":"#REF!"}}]
[null,null,"ملاحظات",null,null,null,"مشمش","كيلو",1.5,null,{"$f":"DB!$M$5","v":{"$error":"#REF!"}},null,0,0,0,null,{"$f":"DB!$X$5","v":{"$error":"#REF!"}}]
[null,null,null,null,null,null,"تفاح","2.5كيلو",2.75,null,{"$f":"DB!$N$5","v":{"$error":"#REF!"}},null,0,0,0,null,{"$f":"DB!$Y$5","v":{"$error":"#REF!"}}]
[null,null,null,null,null,null,"مضغوط","سحارة",3.75,null,{"$f":"DB!$O$5","v":{"$error":"#REF!"}},null,0,0,0,null,{"$f":"DB!$Z$5","v":{"$error":"#REF!"}}]
[null,null,null,null,null,null,"لوبيا ","كيلو",1.5,null,{"$f":"DB!$P$5","v":{"$error":"#REF!"}},null,0,0,0,null,{"$f":"DB!$AA$5","v":{"$error":"#REF!"}}]
[null,null,null,null,null,null,"خوخ زعفران","علبه",2,null,{"$f":"DB!$Q$5","v":{"$error":"#REF!"}},null,0,{"$f":"H51","v":0},{"$f":"I51","v":0},null,{"$f":"DB!$AB$5","v":{"$error":"#REF!"}}]
[null,null,null,null,null,null,"فراوله","علبه",1.25,null,{"$f":"DB!$R$5","v":{"$error":"#REF!"}},null,0,{"$f":"H52","v":0},{"$f":"I52","v":0},null,{"$f":"DB!$AC$5","v":{"$error":"#REF!"}}]
[null,null,null,null,null,null,"خوخ اخضر ","سحارة",3.75,null,{"$f":"DB!$S$5","v":{"$error":"#REF!"}}]
[null,null,null,null,null,null,null,"المجموع",null,{"$f":"(J6*I30)+(J7*I31)+(J8*I32)+(J9*I33)+(J10*I34)+(J11*I35)+(J12*I36)+(J13*I37)+(J14*I38)+(J15*I39)+(J16*I40)+(J17*I41)+(P6*#REF!)+(P7*I42)+(P8*I43)+(P9*I44)+(P10*I46)+(P11*I47)+(P12*I48)+(P13*I49)+(P14*I50)+(P15*I51)+(P16*I52)+(P17*I53)","v":{"$error":"#REF!"}}]
[]
[]
[]
[]
[]
[]
[]
[]
[]
[null,null,null,null,"أسماء السائقين",null,"قائمه الأسعار والاصناف",null,null,null,null,null,null,null,"المدن"]
[null,null,null,null,"شاذلي ربيع",null,"الصنف","التعبئة","السعر KD",null,null,null,null,null," الدوحة",{"$f":"IFERROR(IF(SEARCH($E$6,O29)>0,ROW(O29),\"\"),\"\")","v":29},{"$f":"IFERROR(INDEX(المدن,MATCH(SMALL($P$29:$P$153,ROWS($Q$29:Q29)),$P$29:$P$153,0)),\"\")","v":" الدوحة"}]
[null,null,null,null,"عبد الحميد همام",null,null,null,null,null,null,null,null,null,"الأندلس",30,{"$f":"IFERROR(INDEX(المدن,MATCH(SMALL($P$29:$P$153,ROWS($Q$29:Q30)),$P$29:$P$153,0)),\"\")","v":"الأندلس"}]
{"$rows_left_out":124}
{"sheet":"DB","index":1,"n_rows":3003,"n_cols":49,"rows_kept":3003,"cut":false,"hidden":false,"merged":[]}
[null,null,null,null,null,null,{"$f":"INV!$G$1","v":1},null,{"$f":"IF(OFFSET(I$2,MATCH($G$1,$A:$A,0)-2,0)=\"\",\"\",COLUMN()-8)","v":""},{"$f":"IF(OFFSET(J$2,MATCH($G$1,$A:$A,0)-2,0)=\"\",\"\",COLUMN()-8)","v":2},3,"","","",7,8,9,10,"",12,"","","","","","","","","","","","","","","","","","","","","","","","","","","","",""]
[null,"المنطقه","العنوان","التيلفون","التاريخ","اسم السائق","ملاحظات","المجموع",{"$f":"Main!G31&\"\n\"&Main!H31&\"\n\"&Main!I31","v":"كوجا احمر \nكيلو\n2.2"},{"$f":"Main!G32&\"\n\"&Main!H32&\"\n\"&Main!I32","v":"توت \nكيلو\n3"},{"$f":"Main!G33&\"\n\"&Main!H33&\"\n\"&Main!I33","v":"جزر بيبي\nعلبة\n0.5"},{"$f":"Main!G34&\"\n\"&Main!H34&\"\n\"&Main!I34","v":"كرز\nكيلو\n1.5"},{"$f":"Main!G35&\"\n\"&Main!H35&\"\n\"&Main!I35","v":"مشمش\nكيلو\n1.5"},{"$f":"Main!G36&\"\n\"&Main!H36&\"\n\"&Main!I36","v":"تفاح\n2.5كيلو\n2.75"},{"$f":"Main!G37&\"\n\"&Main!H37&\"\n\"&Main!I37","v":"مضغوط\nسحارة\n3.75"},{"$f":"Main!G38&\"\n\"&Main!H38&\"\n\"&Main!I38","v":"لوبيا \nكيلو\n1.5"},{"$f":"Main!G39&\"\n\"&Main!H39&\"\n\"&Main!I39","v":"خوخ زعفران\nعلبه\n2"},{"$f":"Main!G40&\"\n\"&Main!H40&\"\n\"&Main!I40","v":"فراوله\nعلبه\n1.25"},{"$f":"Main!G41&\"\n\"&Main!H41&\"\n\"&Main!I41","v":"خوخ اخضر \nسحارة\n3.75"},{"$f":"Main!G42&\"\n\"&Main!H42&\"\n\"&Main!I42","v":"نيكتارين \nسحارة\n1.75"},{"$f":"Main!G43&\"\n\"&Main!H43&\"\n\"&Main!I43","v":"خوخ ابيض\nسحارة\n3.75"},{"$f":"Main!G44&\"\n\"&Main!H44&\"\n\"&Main!I44","v":"باميه\n15كيلو\n15"},{"$f":"Main!G46&\"\n\"&Main!H46&\"\n\"&Main!I46","v":"\n\n"},{"$f":"Main!G47&\"\n\"&Main!H47&\"\n\"&Main!I47","v":"\n\n"},{"$f":"Main!G48&\"\n\"&Main!H48&\"\n\"&Main!I48","v":"\n\n"},{"$f":"Main!G49&\"\n\"&Main!H49&\"\n\"&Main!I49","v":"\n\n"},{"$f":"Main!G50&\"\n\"&Main!H50&\"\n\"&Main!I50","v":"\n\n"},{"$f":"Main!G51&\"\n\"&Main!H51&\"\n\"&Main!I51","v":"\n\n"},{"$f":"Main!G52&\"\n\"&Main!H52&\"\n\"&Main!I52","v":"\n\n"}]
[null,"المجموع",null,null,null,null,null,{"$f":"SUM($H$7:$H$1993)","v":411.5},{"$f":"SUM($I$7:$I$2001)","v":2},{"$f":"SUM($J$7:$J$2001)","v":8},{"$f":"SUM($K$7:$K$2001)","v":6},{"$f":"SUM($L$7:$L$2001)","v":0},{"$f":"SUM($M$7:$M$2001)","v":0},{"$f":"SUM($N$7:$N$2001)","v":0},{"$f":"SUM($O$7:$O$2001)","v":85.5},{"$f":"SUM($P$7:$P$2001)","v":70},{"$f":"SUM($Q$7:$Q$2001)","v":13},{"$f":"SUM($R$7:$R$2001)","v":16},{"$f":"SUM($S$7:$S$2001)","v":0},{"$f":"SUM($T$7:$T$2001)","v":8},{"$f":"SUM($U$7:$U$2001)","v":0},{"$f":"SUM($V$7:$V$2001)","v":0},{"$f":"SUM($W$7:$W$2001)","v":0},{"$f":"SUM($X$7:$X$2001)","v":0},{"$f":"SUM($Y$7:$Y$2001)","v":0},{"$f":"SUM($Z$7:$Z$2001)","v":0},{"$f":"SUM($AA$7:$AA$2001)","v":0},{"$f":"SUM($AB$7:$AB$2001)","v":0},{"$f":"SUM($AC$7:$AC$2001)","v":0}]
[null,"الوارد"]
[null,"المخزن",null,null,null,null,null,{"$f":"H4-H3+#REF!","v":{"$error":"#REF!"}},{"$f":"I4-I3+#REF!","v":{"$error":"#REF!"}},{"$f":"J4-J3+#REF!","v":{"$error":"#REF!"}},{"$f":"K4-K3+#REF!","v":{"$error":"#REF!"}},{"$f":"L4-L3+#REF!","v":{"$error":"#REF!"}},{"$f":"M4-M3+#REF!","v":{"$error":"#REF!"}},{"$f":"N4-N3+#REF!","v":{"$error":"#REF!"}},{"$f":"O4-O3+#REF!","v":{"$error":"#REF!"}},{"$f":"P4-P3+#REF!","v":{"$error":"#REF!"}},{"$f":"Q4-Q3+#REF!","v":{"$error":"#REF!"}},{"$f":"R4-R3+#REF!","v":{"$error":"#REF!"}},{"$f":"S4-S3+#REF!","v":{"$error":"#REF!"}},{"$f":"T4-T3+#REF!","v":{"$error":"#REF!"}},{"$f":"U4-U3+#REF!","v":{"$error":"#REF!"}},{"$f":"V4-V3+#REF!","v":{"$error":"#REF!"}},{"$f":"W4-W3+#REF!","v":{"$error":"#REF!"}},{"$f":"X4-X3+#REF!","v":{"$error":"#REF!"}},{"$f":"Y4-Y3+#REF!","v":{"$error":"#REF!"}},{"$f":"Z4-Z3+#REF!","v":{"$error":"#REF!"}},{"$f":"AA4-AA3+#REF!","v":{"$error":"#REF!"}},{"$f":"AB4-AB3+#REF!","v":{"$error":"#REF!"}},{"$f":"AC4-AC3+#REF!","v":{"$error":"#REF!"}}]
[null,"إجمالي عدد الطلبات",null,null,null,null,null,{"$f":"SUBTOTAL(109,(H7:H1993))","v":131},{"$f":"SUBTOTAL(109,($I$7:$I$1993))","v":0},{"$f":"SUBTOTAL(109,($J$7:$J$1993))","v":2},{"$f":"SUBTOTAL(109,($K$7:$K$1993))","v":1},{"$f":"SUBTOTAL(109,($L$7:$L$1993))","v":0},{"$f":"SUBTOTAL(109,($M$7:$M$1993))","v":0},{"$f":"SUBTOTAL(109,($N$7:$N$1993))","v":0},{"$f":"SUBTOTAL(109,($O$7:$O$1993))","v":31.5},{"$f":"SUBTOTAL(109,($P$7:$P$1993))","v":31.5},{"$f":"SUBTOTAL(109,($Q$7:$Q$1993))","v":3},{"$f":"SUBTOTAL(109,($R$7:$R$1993))","v":4},{"$f":"SUBTOTAL(109,($S$7:$S$1993))","v":0},{"$f":"SUBTOTAL(109,($T$7:$T$1993))","v":3},{"$f":"SUBTOTAL(109,($U$7:$U$1993))","v":0},{"$f":"SUBTOTAL(109,($V$7:$V$1993))","v":0},{"$f":"SUBTOTAL(109,($W$7:$W$1993))","v":0},{"$f":"SUBTOTAL(109,($X$7:$X$1993))","v":0},{"$f":"SUBTOTAL(109,($Y$7:$Y$1993))","v":0},{"$f":"SUBTOTAL(109,($Z$7:$Z$1993))","v":0},{"$f":"SUBTOTAL(109,($AA$7:$AA$1993))","v":0},{"$f":"SUBTOTAL(109,($AB$7:$AB$1993))","v":0},{"$f":"SUBTOTAL(109,($AC$7:$AC$1993))","v":0}]
[{"$f":"IF($F7=\"\",\"\",SUBTOTAL(3,$F$7:$F7))","v":1},"الرميثيه","ق7ش حراء ",12345645,null,"A",null,24.5,null,1,1,null,null,null,4.5,2.5,1,1,null,1]
[{"$f":"IF($F8=\"\",\"\",SUBTOTAL(3,$F$7:$F8))","v":1},"القصور","ق7ش",23456789,null,"D",null,18,null,null,null,null,null,null,4.5,2.5,null,2]
[{"$f":"IF($F9=\"\",\"\",SUBTOTAL(3,$F$7:$F9))","v":1},"مشرف","ق1ش",34567891,null,"D",null,17,null,null,null,null,null,null,4.5,2.5,1,1]
[{"$f":"IF($F10=\"\",\"\",SUBTOTAL(3,$F$7:$F10))","v":1},"العقيله","ق3ش30",98765432,null,"D",null,15,1]
[{"$f":"IF($F11=\"\",\"\",SUBTOTAL(3,$F$7:$F11))","v":1},"السره","ق6ش9",65412378,null,"D",null,13.25,null,null,null,null,null,null,4.5,2.5,1]
[{"$f":"IF($F12=\"\",\"\",SUBTOTAL(3,$F$7:$F12))","v":1},"الرميثيه","ش حراء ج",14785236,null,"B",null,20.75,null,null,1,null,null,null,4.5,2.5,1,1]
[{"$f":"IF($F13=\"\",\"\",SUBTOTAL(3,$F$7:$F13))","v":1},"السلام","ق3ش24",22244455,null,"B",null,8.5,null,1,null,null,null,null,4.5]
[{"$f":"IF($F14=\"\",\"\",SUBTOTAL(3,$F$7:$F14))","v":1},"صباح السالم","ق6ش1",44967948.142857097,null,"B",null,18.75,1,null,null,null,null,null,null,2.5]
[{"$f":"IF($F15=\"\",\"\",SUBTOTAL(3,$F$7:$F15))","v":1},"جابر الاحمد","ق1ش110",46510727.107142799,null,"B",null,17,null,1,1,null,null,null,4.5,null,1,null,null,1]
[{"$f":"IF($F16=\"\",\"\",SUBTOTAL(3,$F$7:$F16))","v":1},"السره","ق3ش5",48053506.071428597,null,"B",null,17.75,null,2,1,null,null,null,null,null,1,1,null,2]
[{"$f":"IF($F17=\"\",\"\",SUBTOTAL(3,$F$7:$F17))","v":1},"الدسمه","ق3ش الرميثيه ",49596285.035714298,null,"B",null,15.25,null,null,null,null,null,null,4.5,2.5,1,null,null,1]
[{"$f":"IF($F18=\"\",\"\",SUBTOTAL(3,$F$7:$F18))","v":2},"سلوى","ق10ش14",62995543.961904697,null,"A",null,11.25,null,null,null,null,null,null,null,5,null,1]
[{"$f":"IF($F19=\"\",\"\",SUBTOTAL(3,$F$7:$F19))","v":3},"المنقف","ق3ش303ع20",70224834.743537396,null,"A",null,23.5,null,1,null,null,null,null,4.5,5,2,null,null,1]
[{"$f":"IF($F20=\"\",\"\",SUBTOTAL(3,$F$7:$F20))","v":4},"الجابريه","ق8ش",77454125.525169998,null,"A",null,55.5,null,null,null,null,null,null,18,16.5,null,1]
[{"$f":"IF($F21=\"\",\"\",SUBTOTAL(3,$F$7:$F21))","v":5},"صباح السالم","ق9ش1ع51",84683416.306802705,null,"A",null,16.25,null,null,null,null,null,null,4.5,2.5,null,1,null,1]
[{"$f":"IF($F22=\"\",\"\",SUBTOTAL(3,$F$7:$F22))","v":5},"قرناطه","ق2ش",91912707.088435397,null,"E",null,13,null,1,null,null,null,null,null,5,null,1]
[{"$f":"IF($F23=\"\",\"\",SUBTOTAL(3,$F$7:$F23))","v":5},"مبارك الكبير","ق1ش2",99141997.870067999,null,"E",null,18.5,null,null,null,null,null,null,null,5.5,1,2]
[{"$f":"IF($F24=\"\",\"\",SUBTOTAL(3,$F$7:$F24))","v":5},"مشرف","ق1ش7",99141997.870067999,null,"E",null,7.5,null,null,null,null,null,null,null,null,null,2]
[{"$f":"IF($F25=\"\",\"\",SUBTOTAL(3,$F$7:$F25))","v":5},"الرميثيه","ق10ش ",99141997.870067999,null,"E",null,0]
[{"$f":"IF($F26=\"\",\"\",SUBTOTAL(3,$F$7:$F26))","v":5},"صباح السالم","ق4ش13",99141997.870067999,null,"E",null,6.75,null,null,null,null,null,null,4.5]
[{"$f":"IF($F27=\"\",\"\",SUBTOTAL(3,$F$7:$F27))","v":5},"الدعيه","ق4ش الم13 ",99141997.870067999,null,"E",null,0]
[{"$f":"IF($F28=\"\",\"\",SUBTOTAL(3,$F$7:$F28))","v":5},"العدان","ق7 ش11",99141997.870067999,null,"H",null,17,null,null,null,null,null,null,4.5,2.5,1,1]
[{"$f":"IF($F29=\"\",\"\",SUBTOTAL(3,$F$7:$F29))","v":5},"مبارك الكبير","ق4 ش12 ",99141997.870067999,null,"H",null,23.25,null,1,1,null,null,null,4.5,5.5,1]
[{"$f":"IF($F30=\"\",\"\",SUBTOTAL(3,$F$7:$F30))","v":5},"الدعيه","ق3ش39 ",99141997.870067999,null,"H",null,18,null,null,1,null,null,null,4.5,2.5,null,1]
{"$rows_left_out":2974}
{"sheet":"date","index":2,"n_rows":31,"n_cols":1,"rows_kept":31,"cut":false,"hidden":false,"merged":[]}
["2020-07-01"]
["2020-07-02"]
["2020-07-03"]
["2020-07-04"]
["2020-07-05"]
["2020-07-06"]
["2020-07-07"]
["2020-07-08"]
["2020-07-09"]
["2020-07-10"]
["2020-07-11"]
["2020-07-12"]
["2020-07-13"]
["2020-07-14"]
["2020-07-15"]
["2020-07-16"]
["2020-07-17"]
["2020-07-18"]
["2020-07-19"]
["2020-07-20"]
["2020-07-21"]
["2020-07-22"]
["2020-07-23"]
["2020-07-24"]
["2020-07-25"]
["2020-07-26"]
["2020-07-27"]
["2020-07-28"]
["2020-07-29"]
["2020-07-30"]
{"$rows_left_out":2}
{"sheet":"INV","index":3,"n_rows":33,"n_cols":9,"rows_kept":33,"cut":false,"hidden":false,"merged":[[5,2,5,3],[1,2,1,3]]}
[null,null,null,null,null,null,1,{"$f":"MAX(DB!$A:$A)","v":5},{"$f":"IF($G$1>$H$1,\"\",INDEX(DB!$H:$H,MATCH($G$1,DB!$A:$A,0)))","v":24.5}]
[null,null," INVOICE"]
[null,null,{"$f":"IF($G$1>$H$1,\"\",IF(INDEX(DB!$E:$E,MATCH($G$1,DB!$A:$A,0))=\"\",\"\",INDEX(DB!$E:$E,MATCH($G$1,DB!$A:$A,0))))","v":""},null,"DATE"]
[null,null,{"$f":"IF($G$1>$H$1,\"\",$G$1)","v":1},null,"INVOICE NO."]
["المدينة",null,{"$f":"IF($G$1>$H$1,\"\",INDEX(DB!$B:$B,MATCH($G$1,DB!$A:$A,0)))","v":"الرميثيه"}]
["العنوان",null,{"$f":"IF($G$1>$H$1,\"\",INDEX(DB!$C:$C,MATCH($G$1,DB!$A:$A,0)))","v":"ق7ش حراء "}]
["التيلفون",null,{"$f":"IF($G$1>$H$1,\"\",INDEX(DB!$D:$D,MATCH($G$1,DB!$A:$A,0)))","v":12345645}]
[]
["DESCRIPTION","UNIT","UNIT PRICE","QTY","TOTAL"]
[{"$f":"IF(ROW($A1)<=COUNTIF(DB!$I$1:$AW$1,\">0\"),INDEX(Main!$G$31:$G$53,SMALL(DB!$I$1:$AW$1,ROW($A1))),\"\")","v":"توت "},{"$f":"IF(ROW($A1)<=COUNTIF(DB!$I$1:$AW$1,\">0\"),INDEX(Main!$H$31:$H$53,SMALL(DB!$I$1:$AW$1,ROW($A1))),\"\")","v":"كيلو"},{"$f":"IF(ROW($A1)<=COUNTIF(DB!$I$1:$AW$1,\">0\"),INDEX(Main!$I$31:$I$53,SMALL(DB!$I$1:$AW$1,ROW($A1))),\"\")","v":3},{"$f":"IF(ROW($A1)<=COUNTIF(DB!$I$1:$AW$1,\">0\"),INDEX(OFFSET(DB!$I$2:$AW$2,MATCH($G$1,DB!$A:$A,0)-2,0),SMALL(DB!$I$1:$AW$1,ROW($A1))),\"\")","v":1},{"$f":"IF($A10=\"\",\"\",$C10*$D10)","v":3}]
[{"$f":"IF(ROW($A2)<=COUNTIF(DB!$I$1:$AW$1,\">0\"),INDEX(Main!$G$31:$G$53,SMALL(DB!$I$1:$AW$1,ROW($A2))),\"\")","v":"جزر بيبي"},{"$f":"IF(ROW($A2)<=COUNTIF(DB!$I$1:$AW$1,\">0\"),INDEX(Main!$H$31:$H$53,SMALL(DB!$I$1:$AW$1,ROW($A2))),\"\")","v":"علبة"},{"$f":"IF(ROW($A2)<=COUNTIF(DB!$I$1:$AW$1,\">0\"),INDEX(Main!$I$31:$I$53,SMALL(DB!$I$1:$AW$1,ROW($A2))),\"\")","v":0.5},{"$f":"IF(ROW($A2)<=COUNTIF(DB!$I$1:$AW$1,\">0\"),INDEX(OFFSET(DB!$I$2:$AW$2,MATCH($G$1,DB!$A:$A,0)-2,0),SMALL(DB!$I$1:$AW$1,ROW($A2))),\"\")","v":1},{"$f":"IF($A11=\"\",\"\",$C11*$D11)","v":0.5}]
[{"$f":"IF(ROW($A3)<=COUNTIF(DB!$I$1:$AW$1,\">0\"),INDEX(Main!$G$31:$G$53,SMALL(DB!$I$1:$AW$1,ROW($A3))),\"\")","v":"مضغوط"},{"$f":"IF(ROW($A3)<=COUNTIF(DB!$I$1:$AW$1,\">0\"),INDEX(Main!$H$31:$H$53,SMALL(DB!$I$1:$AW$1,ROW($A3))),\"\")","v":"سحارة"},{"$f":"IF(ROW($A3)<=COUNTIF(DB!$I$1:$AW$1,\">0\"),INDEX(Main!$I$31:$I$53,SMALL(DB!$I$1:$AW$1,ROW($A3))),\"\")","v":3.75},{"$f":"IF(ROW($A3)<=COUNTIF(DB!$I$1:$AW$1,\">0\"),INDEX(OFFSET(DB!$I$2:$AW$2,MATCH($G$1,DB!$A:$A,0)-2,0),SMALL(DB!$I$1:$AW$1,ROW($A3))),\"\")","v":4.5},{"$f":"IF($A12=\"\",\"\",$C12*$D12)","v":16.875}]
[{"$f":"IF(ROW($A4)<=COUNTIF(DB!$I$1:$AW$1,\">0\"),INDEX(Main!$G$31:$G$53,SMALL(DB!$I$1:$AW$1,ROW($A4))),\"\")","v":"لوبيا "},{"$f":"IF(ROW($A4)<=COUNTIF(DB!$I$1:$AW$1,\">0\"),INDEX(Main!$H$31:$H$53,SMALL(DB!$I$1:$AW$1,ROW($A4))),\"\")","v":"كيلو"},{"$f":"IF(ROW($A4)<=COUNTIF(DB!$I$1:$AW$1,\">0\"),INDEX(Main!$I$31:$I$53,SMALL(DB!$I$1:$AW$1,ROW($A4))),\"\")","v":1.5},{"$f":"IF(ROW($A4)<=COUNTIF(DB!$I$1:$AW$1,\">0\"),INDEX(OFFSET(DB!$I$2:$AW$2,MATCH($G$1,DB!$A:$A,0)-2,0),SMALL(DB!$I$1:$AW$1,ROW($A4))),\"\")","v":2.5},3.75]
[{"$f":"IF(ROW($A5)<=COUNTIF(DB!$I$1:$AW$1,\">0\"),INDEX(Main!$G$31:$G$53,SMALL(DB!$I$1:$AW$1,ROW($A5))),\"\")","v":"خوخ زعفران"},{"$f":"IF(ROW($A5)<=COUNTIF(DB!$I$1:$AW$1,\">0\"),INDEX(Main!$H$31:$H$53,SMALL(DB!$I$1:$AW$1,ROW($A5))),\"\")","v":"علبه"},{"$f":"IF(ROW($A5)<=COUNTIF(DB!$I$1:$AW$1,\">0\"),INDEX(Main!$I$31:$I$53,SMALL(DB!$I$1:$AW$1,ROW($A5))),\"\")","v":2},{"$f":"IF(ROW($A5)<=COUNTIF(DB!$I$1:$AW$1,\">0\"),INDEX(OFFSET(DB!$I$2:$AW$2,MATCH($G$1,DB!$A:$A,0)-2,0),SMALL(DB!$I$1:$AW$1,ROW($A5))),\"\")","v":1},2]
[{"$f":"IF(ROW($A6)<=COUNTIF(DB!$I$1:$AW$1,\">0\"),INDEX(Main!$G$31:$G$53,SMALL(DB!$I$1:$AW$1,ROW($A6))),\"\")","v":"فراوله"},{"$f":"IF(ROW($A6)<=COUNTIF(DB!$I$1:$AW$1,\">0\"),INDEX(Main!$H$31:$H$53,SMALL(DB!$I$1:$AW$1,ROW($A6))),\"\")","v":"علبه"},{"$f":"IF(ROW($A6)<=COUNTIF(DB!$I$1:$AW$1,\">0\"),INDEX(Main!$I$31:$I$53,SMALL(DB!$I$1:$AW$1,ROW($A6))),\"\")","v":1.25},{"$f":"IF(ROW($A6)<=COUNTIF(DB!$I$1:$AW$1,\">0\"),INDEX(OFFSET(DB!$I$2:$AW$2,MATCH($G$1,DB!$A:$A,0)-2,0),SMALL(DB!$I$1:$AW$1,ROW($A6))),\"\")","v":1},1.25]
[{"$f":"IF(ROW($A7)<=COUNTIF(DB!$I$1:$AW$1,\">0\"),INDEX(Main!$G$31:$G$53,SMALL(DB!$I$1:$AW$1,ROW($A7))),\"\")","v":"نيكتارين "},{"$f":"IF(ROW($A7)<=COUNTIF(DB!$I$1:$AW$1,\">0\"),INDEX(Main!$H$31:$H$53,SMALL(DB!$I$1:$AW$1,ROW($A7))),\"\")","v":"سحارة"},{"$f":"IF(ROW($A7)<=COUNTIF(DB!$I$1:$AW$1,\">0\"),INDEX(Main!$I$31:$I$53,SMALL(DB!$I$1:$AW$1,ROW($A7))),\"\")","v":1.75},{"$f":"IF(ROW($A7)<=COUNTIF(DB!$I$1:$AW$1,\">0\"),INDEX(OFFSET(DB!$I$2:$AW$2,MATCH($G$1,DB!$A:$A,0)-2,0),SMALL(DB!$I$1:$AW$1,ROW($A7))),\"\")","v":1},1.75]
[{"$f":"IF(ROW($A8)<=COUNTIF(DB!$I$1:$AW$1,\">0\"),INDEX(Main!$G$31:$G$53,SMALL(DB!$I$1:$AW$1,ROW($A8))),\"\")","v":""},{"$f":"IF(ROW($A8)<=COUNTIF(DB!$I$1:$AW$1,\">0\"),INDEX(Main!$H$31:$H$53,SMALL(DB!$I$1:$AW$1,ROW($A8))),\"\")","v":""},{"$f":"IF(ROW($A8)<=COUNTIF(DB!$I$1:$AW$1,\">0\"),INDEX(Main!$I$31:$I$53,SMALL(DB!$I$1:$AW$1,ROW($A8))),\"\")","v":""},{"$f":"IF(ROW($A8)<=COUNTIF(DB!$I$1:$AW$1,\">0\"),INDEX(OFFSET(DB!$I$2:$AW$2,MATCH($G$1,DB!$A:$A,0)-2,0),SMALL(DB!$I$1:$AW$1,ROW($A8))),\"\")","v":""},""]
[{"$f":"IF(ROW($A9)<=COUNTIF(DB!$I$1:$AW$1,\">0\"),INDEX(Main!$G$31:$G$53,SMALL(DB!$I$1:$AW$1,ROW($A9))),\"\")","v":""},{"$f":"IF(ROW($A9)<=COUNTIF(DB!$I$1:$AW$1,\">0\"),INDEX(Main!$H$31:$H$53,SMALL(DB!$I$1:$AW$1,ROW($A9))),\"\")","v":""},{"$f":"IF(ROW($A9)<=COUNTIF(DB!$I$1:$AW$1,\">0\"),INDEX(Main!$I$31:$I$53,SMALL(DB!$I$1:$AW$1,ROW($A9))),\"\")","v":""},{"$f":"IF(ROW($A9)<=COUNTIF(DB!$I$1:$AW$1,\">0\"),INDEX(OFFSET(DB!$I$2:$AW$2,MATCH($G$1,DB!$A:$A,0)-2,0),SMALL(DB!$I$1:$AW$1,ROW($A9))),\"\")","v":""},""]
[{"$f":"IF(ROW($A10)<=COUNTIF(DB!$I$1:$AW$1,\">0\"),INDEX(Main!$G$31:$G$53,SMALL(DB!$I$1:$AW$1,ROW($A10))),\"\")","v":""},{"$f":"IF(ROW($A10)<=COUNTIF(DB!$I$1:$AW$1,\">0\"),INDEX(Main!$H$31:$H$53,SMALL(DB!$I$1:$AW$1,ROW($A10))),\"\")","v":""},{"$f":"IF(ROW($A10)<=COUNTIF(DB!$I$1:$AW$1,\">0\"),INDEX(Main!$I$31:$I$53,SMALL(DB!$I$1:$AW$1,ROW($A10))),\"\")","v":""},{"$f":"IF(ROW($A10)<=COUNTIF(DB!$I$1:$AW$1,\">0\"),INDEX(OFFSET(DB!$I$2:$AW$2,MATCH($G$1,DB!$A:$A,0)-2,0),SMALL(DB!$I$1:$AW$1,ROW($A10))),\"\")","v":""},""]
[{"$f":"IF(ROW($A11)<=COUNTIF(DB!$I$1:$AW$1,\">0\"),INDEX(Main!$G$31:$G$53,SMALL(DB!$I$1:$AW$1,ROW($A11))),\"\")","v":""},{"$f":"IF(ROW($A11)<=COUNTIF(DB!$I$1:$AW$1,\">0\"),INDEX(Main!$H$31:$H$53,SMALL(DB!$I$1:$AW$1,ROW($A11))),\"\")","v":""},{"$f":"IF(ROW($A11)<=COUNTIF(DB!$I$1:$AW$1,\">0\"),INDEX(Main!$I$31:$I$53,SMALL(DB!$I$1:$AW$1,ROW($A11))),\"\")","v":""},{"$f":"IF(ROW($A11)<=COUNTIF(DB!$I$1:$AW$1,\">0\"),INDEX(OFFSET(DB!$I$2:$AW$2,MATCH($G$1,DB!$A:$A,0)-2,0),SMALL(DB!$I$1:$AW$1,ROW($A11))),\"\")","v":""},""]
[{"$f":"IF(ROW($A12)<=COUNTIF(DB!$I$1:$AW$1,\">0\"),INDEX(Main!$G$31:$G$53,SMALL(DB!$I$1:$AW$1,ROW($A12))),\"\")","v":""},{"$f":"IF(ROW($A12)<=COUNTIF(DB!$I$1:$AW$1,\">0\"),INDEX(Main!$H$31:$H$53,SMALL(DB!$I$1:$AW$1,ROW($A12))),\"\")","v":""},{"$f":"IF(ROW($A12)<=COUNTIF(DB!$I$1:$AW$1,\">0\"),INDEX(Main!$I$31:$I$53,SMALL(DB!$I$1:$AW$1,ROW($A12))),\"\")","v":""},{"$f":"IF(ROW($A12)<=COUNTIF(DB!$I$1:$AW$1,\">0\"),INDEX(OFFSET(DB!$I$2:$AW$2,MATCH($G$1,DB!$A:$A,0)-2,0),SMALL(DB!$I$1:$AW$1,ROW($A12))),\"\")","v":""},""]
[{"$f":"IF(ROW($A13)<=COUNTIF(DB!$I$1:$AW$1,\">0\"),INDEX(Main!$G$31:$G$53,SMALL(DB!$I$1:$AW$1,ROW($A13))),\"\")","v":""},{"$f":"IF(ROW($A13)<=COUNTIF(DB!$I$1:$AW$1,\">0\"),INDEX(Main!$H$31:$H$53,SMALL(DB!$I$1:$AW$1,ROW($A13))),\"\")","v":""},{"$f":"IF(ROW($A13)<=COUNTIF(DB!$I$1:$AW$1,\">0\"),INDEX(Main!$I$31:$I$53,SMALL(DB!$I$1:$AW$1,ROW($A13))),\"\")","v":""},{"$f":"IF(ROW($A13)<=COUNTIF(DB!$I$1:$AW$1,\">0\"),INDEX(OFFSET(DB!$I$2:$AW$2,MATCH($G$1,DB!$A:$A,0)-2,0),SMALL(DB!$I$1:$AW$1,ROW($A13))),\"\")","v":""},""]
[{"$f":"IF(ROW($A14)<=COUNTIF(DB!$I$1:$AW$1,\">0\"),INDEX(Main!$G$31:$G$53,SMALL(DB!$I$1:$AW$1,ROW($A14))),\"\")","v":""},{"$f":"IF(ROW($A14)<=COUNTIF(DB!$I$1:$AW$1,\">0\"),INDEX(Main!$H$31:$H$53,SMALL(DB!$I$1:$AW$1,ROW($A14))),\"\")","v":""},{"$f":"IF(ROW($A14)<=COUNTIF(DB!$I$1:$AW$1,\">0\"),INDEX(Main!$I$31:$I$53,SMALL(DB!$I$1:$AW$1,ROW($A14))),\"\")","v":""},{"$f":"IF(ROW($A14)<=COUNTIF(DB!$I$1:$AW$1,\">0\"),INDEX(OFFSET(DB!$I$2:$AW$2,MATCH($G$1,DB!$A:$A,0)-2,0),SMALL(DB!$I$1:$AW$1,ROW($A14))),\"\")","v":""},""]
[{"$f":"IF(ROW($A15)<=COUNTIF(DB!$I$1:$AW$1,\">0\"),INDEX(Main!$G$31:$G$53,SMALL(DB!$I$1:$AW$1,ROW($A15))),\"\")","v":""},{"$f":"IF(ROW($A15)<=COUNTIF(DB!$I$1:$AW$1,\">0\"),INDEX(Main!$H$31:$H$53,SMALL(DB!$I$1:$AW$1,ROW($A15))),\"\")","v":""},{"$f":"IF(ROW($A15)<=COUNTIF(DB!$I$1:$AW$1,\">0\"),INDEX(Main!$I$31:$I$53,SMALL(DB!$I$1:$AW$1,ROW($A15))),\"\")","v":""},{"$f":"IF(ROW($A15)<=COUNTIF(DB!$I$1:$AW$1,\">0\"),INDEX(OFFSET(DB!$I$2:$AW$2,MATCH($G$1,DB!$A:$A,0)-2,0),SMALL(DB!$I$1:$AW$1,ROW($A15))),\"\")","v":""},""]
[{"$f":"IF(ROW($A16)<=COUNTIF(DB!$I$1:$AW$1,\">0\"),INDEX(Main!$G$31:$G$53,SMALL(DB!$I$1:$AW$1,ROW($A16))),\"\")","v":""},{"$f":"IF(ROW($A16)<=COUNTIF(DB!$I$1:$AW$1,\">0\"),INDEX(Main!$H$31:$H$53,SMALL(DB!$I$1:$AW$1,ROW($A16))),\"\")","v":""},{"$f":"IF(ROW($A16)<=COUNTIF(DB!$I$1:$AW$1,\">0\"),INDEX(Main!$I$31:$I$53,SMALL(DB!$I$1:$AW$1,ROW($A16))),\"\")","v":""},{"$f":"IF(ROW($A16)<=COUNTIF(DB!$I$1:$AW$1,\">0\"),INDEX(OFFSET(DB!$I$2:$AW$2,MATCH($G$1,DB!$A:$A,0)-2,0),SMALL(DB!$I$1:$AW$1,ROW($A16))),\"\")","v":""},""]
[{"$f":"IF(ROW($A17)<=COUNTIF(DB!$I$1:$AW$1,\">0\"),INDEX(Main!$G$31:$G$53,SMALL(DB!$I$1:$AW$1,ROW($A17))),\"\")","v":""},{"$f":"IF(ROW($A17)<=COUNTIF(DB!$I$1:$AW$1,\">0\"),INDEX(Main!$H$31:$H$53,SMALL(DB!$I$1:$AW$1,ROW($A17))),\"\")","v":""},{"$f":"IF(ROW($A17)<=COUNTIF(DB!$I$1:$AW$1,\">0\"),INDEX(Main!$I$31:$I$53,SMALL(DB!$I$1:$AW$1,ROW($A17))),\"\")","v":""},{"$f":"IF(ROW($A17)<=COUNTIF(DB!$I$1:$AW$1,\">0\"),INDEX(OFFSET(DB!$I$2:$AW$2,MATCH($G$1,DB!$A:$A,0)-2,0),SMALL(DB!$I$1:$AW$1,ROW($A17))),\"\")","v":""},""]
[{"$f":"IF(ROW($A18)<=COUNTIF(DB!$I$1:$AW$1,\">0\"),INDEX(Main!$G$31:$G$53,SMALL(DB!$I$1:$AW$1,ROW($A18))),\"\")","v":""},{"$f":"IF(ROW($A18)<=COUNTIF(DB!$I$1:$AW$1,\">0\"),INDEX(Main!$H$31:$H$53,SMALL(DB!$I$1:$AW$1,ROW($A18))),\"\")","v":""},{"$f":"IF(ROW($A18)<=COUNTIF(DB!$I$1:$AW$1,\">0\"),INDEX(Main!$I$31:$I$53,SMALL(DB!$I$1:$AW$1,ROW($A18))),\"\")","v":""},{"$f":"IF(ROW($A18)<=COUNTIF(DB!$I$1:$AW$1,\">0\"),INDEX(OFFSET(DB!$I$2:$AW$2,MATCH($G$1,DB!$A:$A,0)-2,0),SMALL(DB!$I$1:$AW$1,ROW($A18))),\"\")","v":""},""]
[{"$f":"IF(ROW($A19)<=COUNTIF(DB!$I$1:$AW$1,\">0\"),INDEX(Main!$G$31:$G$53,SMALL(DB!$I$1:$AW$1,ROW($A19))),\"\")","v":""},{"$f":"IF(ROW($A19)<=COUNTIF(DB!$I$1:$AW$1,\">0\"),INDEX(Main!$H$31:$H$53,SMALL(DB!$I$1:$AW$1,ROW($A19))),\"\")","v":""},{"$f":"IF(ROW($A19)<=COUNTIF(DB!$I$1:$AW$1,\">0\"),INDEX(Main!$I$31:$I$53,SMALL(DB!$I$1:$AW$1,ROW($A19))),\"\")","v":""},{"$f":"IF(ROW($A19)<=COUNTIF(DB!$I$1:$AW$1,\">0\"),INDEX(OFFSET(DB!$I$2:$AW$2,MATCH($G$1,DB!$A:$A,0)-2,0),SMALL(DB!$I$1:$AW$1,ROW($A19))),\"\")","v":""},""]
[{"$f":"IF(ROW($A20)<=COUNTIF(DB!$I$1:$AW$1,\">0\"),INDEX(Main!$G$31:$G$53,SMALL(DB!$I$1:$AW$1,ROW($A20))),\"\")","v":""},{"$f":"IF(ROW($A20)<=COUNTIF(DB!$I$1:$AW$1,\">0\"),INDEX(Main!$H$31:$H$53,SMALL(DB!$I$1:$AW$1,ROW($A20))),\"\")","v":""},{"$f":"IF(ROW($A20)<=COUNTIF(DB!$I$1:$AW$1,\">0\"),INDEX(Main!$I$31:$I$53,SMALL(DB!$I$1:$AW$1,ROW($A20))),\"\")","v":""},{"$f":"IF(ROW($A20)<=COUNTIF(DB!$I$1:$AW$1,\">0\"),INDEX(OFFSET(DB!$I$2:$AW$2,MATCH($G$1,DB!$A:$A,0)-2,0),SMALL(DB!$I$1:$AW$1,ROW($A20))),\"\")","v":""},""]
[{"$f":"IF(ROW($A21)<=COUNTIF(DB!$I$1:$AW$1,\">0\"),INDEX(Main!$G$31:$G$53,SMALL(DB!$I$1:$AW$1,ROW($A21))),\"\")","v":""},{"$f":"IF(ROW($A21)<=COUNTIF(DB!$I$1:$AW$1,\">0\"),INDEX(Main!$H$31:$H$53,SMALL(DB!$I$1:$AW$1,ROW($A21))),\"\")","v":""},{"$f":"IF(ROW($A21)<=COUNTIF(DB!$I$1:$AW$1,\">0\"),INDEX(Main!$I$31:$I$53,SMALL(DB!$I$1:$AW$1,ROW($A21))),\"\")","v":""},{"$f":"IF(ROW($A21)<=COUNTIF(DB!$I$1:$AW$1,\">0\"),INDEX(OFFSET(DB!$I$2:$AW$2,MATCH($G$1,DB!$A:$A,0)-2,0),SMALL(DB!$I$1:$AW$1,ROW($A21))),\"\")","v":""},""]
{"$rows_left_out":3}