{"text_format":"1","workbook":"xlsx","n_sheets":4,"sheets":["1","بيانات","data","حساب سائق"],"not_rendered":{"charts":0,"images":0,"macros":1,"external_links":0,"defined_names":6,"comments":0,"pivot_tables":1},"unopened":[],"bounds":{"document_bytes":16777216,"sheet_cells":100000,"rows_first":2000,"rows_last":500,"rows_between":2000,"halvings":0,"cell_chars":16384,"cell_head_chars":4096},"cells_cut":0,"cells_raw":0,"read":"whole","date_system":"1900"}

{"sheet":"1","index":0,"n_rows":68,"n_cols":13,"rows_kept":68,"cut":false,"hidden":false,"merged":[[65,7,65,8],[62,8,62,10],[63,7,63,8],[64,7,64,8],[4,6,4,7],[4,9,4,11],[5,4,5,7],[5,9,5,11],[6,3,6,6],[0,3,0,6],[0,9,0,11],[1,3,1,6],[1,10,1,11],[2,6,3,7],[2,9,2,11]]}
["مـنـتـج تــام","زيـوت خــام",null,"شركة عباد  الرحمن  للنقل الداخلي",null,null,null,null,1093,"كمال محمد السيد محمد                          "]
["الايمان    737","أحمد ع القوى   2691",null,"العاشر من رمضان ",null,null,null,null,1204,"ملف ضريبي"," 35-03-552-01584-5"]
["محرم     1619","المستقبل        1317",null,null,null,"فـــاتــورة  ",null,null,null,"ماموريه ضرائب العاشر من رمضان"]
[]
["جمعية    1220","الامين         2546",null,null,null,null,"منتج تام  ",null,{"$f":"SUM(I1:I4)","v":2297},"سجل  تجارى : 6707"]
["الاسراء    1630","المؤسسة      2631",null,null,"المطلوب من :- شركة ارما التجاريه",null,null,null,null,"التسجيل ضريبي 576-885-259"]
[null,null,null,"2019-10-10",null,null,null,null,1203]
[null,null,"عمود1","م","القيمة +\n 14 %","القيمة\n بالجنيه","سعر \nالطن","الكميه","المحافظة","رقم \nShipment","نوع\nالسيارة","الميزان","عمود2"]
[]
[]
[]
[]
[]
[]
[]
[]
[]
[]
[]
[]
{"$rows_left_out":49}
{"sheet":"بيانات","index":1,"n_rows":107,"n_cols":34,"rows_kept":107,"cut":false,"hidden":false,"merged":[[2,1,2,5],[0,8,0,23],[1,3,1,23],[0,5,0,6],[0,1,0,4]]}
[null,"المستحق بالجنيه",null,null,null,{"$f":"(W3+V3+K3)-(G3+I3+J3)","v":-17995},null,"جنيه",{"$f":"NOW()","v":"2020-08-27T15:07:52.870"}]
[null,null,null,{"$f":"CurrText(F1,1,\"جنيه\",\"جنيهات\",1,\"قرش\",\"قروش\",2)","v":"سبعة عشر ألفاً وتسعمائة وخمس وتسعون جنيه فقط لاغير"}]
[null,"اجماليات",null,null,null,null,{"$f":"SUBTOTAL(9,G5:G94254)","v":30340},null,{"$f":"SUBTOTAL(9,I5:I94254)","v":15},{"$f":"SUBTOTAL(9,J5:J94254)","v":0},{"$f":"SUBTOTAL(9,K5:K94254)","v":0},null,null,null,null,null,null,{"$f":"SUBTOTAL(9,R5:R94254)","v":10450},null,null,null,{"$f":"SUBTOTAL(9,V5:V94254)","v":3860},{"$f":"SUBTOTAL(9,W5:W94254)","v":8500}]
["عمود1","التاريخ","السائق","السياره ","مكان التحميل","مكان التعتيق","عهدة","المحافظة","خصم","سلفه","شيك","تحميل","غسيل","تشحيم","صيانه","كاوتش","زيت","سولار","ملاحظات","مقاول","نوع_النقله","ميزان","القيمه","الشيب","الكمية","سعر_الطن","نوع السيارة","محاسبة","ت المحاسبه","عمود5","نوع السيارة4","جرار","5 طن","نقله"]
[{"$f":"بيانات!$X5","v":194157},"2020-01-01","هاني عبدالمنعم",9626,null,"فوكس",400,"القاهره",null,null,null,null,null,null,null,null,null,null,null,null,"طن",75,{"$f":"IFERROR(IF($U5=\"نقلة\",$Z5,IF(AND(Y5>=SUMIF(data!$A$18:$A$21,$AA5,data!$B$18:$B$21),$U5=\"طن\"),($Y5*$Z5),$Z5*SUMIF(data!$A$18:$A$21,$AA5,data!$B$18:$B$21))),\"\")","v":1140},194157,12,{"$f":"IFERROR(IF(بيانات!$U5=\"نقلة\",INDEX(الجدول35[[5 طن]:[وش]],MATCH(بيانات!$H5,الجدول35[عمود1],0),MATCH(بيانات!$AA5,الجدول35[[#Headers],[5 طن]:[وش]],0)),INDEX(الجدول3[[5 طن]:[وش]],MATCH(بيانات!$H5,الجدول3[عمود1],0),MATCH(بيانات!$AA5,الجدول3[[#Headers],[5 طن]:[وش]],0))),\"\")","v":95},"فرداني",null,null,null,null,{"$f":"IF(AND(بيانات!$Y5>=24,بيانات!$U5=\"طن\",بيانات!$AA5=\"جرار\"),بيانات!$Z5*بيانات!$Y5,بيانات!$Z5*24)","v":2280},{"$f":"IF(AND(بيانات!$Y5>=5,AND(بيانات!$U5=\"طن\",بيانات!$AA5=\"5 طن\")),بيانات!$Z5*بيانات!$Y5,بيانات!$Z5*5)","v":475},{"$f":"IF(بيانات!$U5=\"نقلة\",بيانات!$Z5,\"\")","v":""}]
[{"$f":"بيانات!$X6","v":194034},"2020-01-01","محمود احمد",7421,null,"الفيوم",600,"القاهره",null,null,null,null,null,null,null,null,null,null,null,null,"طن",75,{"$f":"IFERROR(IF($U6=\"نقلة\",$Z6,IF(AND(Y6>=SUMIF(data!$A$18:$A$21,AA6,data!$B$18:$B$21),$U6=\"طن\"),($Y6*$Z6),$Z6*AC6)),\"\")","v":0},194034,7,{"$f":"IFERROR(IF(بيانات!$U6=\"نقلة\",INDEX(الجدول35[[5 طن]:[وش]],MATCH(بيانات!$H6,الجدول35[عمود1],0),MATCH(بيانات!$AA6,الجدول35[[#Headers],[5 طن]:[وش]],0)),INDEX(الجدول3[[5 طن]:[وش]],MATCH(بيانات!$H6,الجدول3[عمود1],0),MATCH(بيانات!$AA6,الجدول3[[#Headers],[5 طن]:[وش]],0))),\"\")","v":80},"جرار",null,null,null,null,{"$f":"IF(AND(بيانات!$Y6>=24,بيانات!$U6=\"طن\",بيانات!$AA6=\"جرار\"),بيانات!$Z6*بيانات!$Y6,بيانات!$Z6*24)","v":1920},{"$f":"IF(AND(بيانات!$Y6>=5,AND(بيانات!$U6=\"طن\",بيانات!$AA6=\"5 طن\")),بيانات!$Z6*بيانات!$Y6,بيانات!$Z6*5)","v":400},{"$f":"IF(بيانات!$U6=\"نقلة\",بيانات!$Z6,\"\")","v":""}]
[{"$f":"بيانات!$X7","v":194079},"2020-01-02","علاء شحاته",7462,null,"البدرشين",300,"الجيزه",null,null,null,null,null,null,null,null,null,null,null,null,"نقلة",75,{"$f":"IFERROR(IF($U7=\"نقلة\",$Z7,IF(AND(Y7>=SUMIF(data!$A$18:$A$21,AA7,data!$B$18:$B$21),$U7=\"طن\"),($Y7*$Z7),$Z7*AC7)),\"\")","v":550},194079,5,{"$f":"IFERROR(IF(بيانات!$U7=\"نقلة\",INDEX(الجدول35[[5 طن]:[وش]],MATCH(بيانات!$H7,الجدول35[عمود1],0),MATCH(بيانات!$AA7,الجدول35[[#Headers],[5 طن]:[وش]],0)),INDEX(الجدول3[[5 طن]:[وش]],MATCH(بيانات!$H7,الجدول3[عمود1],0),MATCH(بيانات!$AA7,الجدول3[[#Headers],[5 طن]:[وش]],0))),\"\")","v":550},"5 طن",null,null,null,null,{"$f":"IF(AND(بيانات!$Y7>=24,بيانات!$U7=\"طن\",بيانات!$AA7=\"جرار\"),بيانات!$Z7*بيانات!$Y7,بيانات!$Z7*24)","v":13200},{"$f":"IF(AND(بيانات!$Y7>=5,AND(بيانات!$U7=\"طن\",بيانات!$AA7=\"5 طن\")),بيانات!$Z7*بيانات!$Y7,بيانات!$Z7*5)","v":2750},{"$f":"IF(بيانات!$U7=\"نقلة\",بيانات!$Z7,\"\")","v":550}]
[{"$f":"بيانات!$X8","v":194162},"2020-01-05","محمود عبدالعظيم",7594,null,"اسكندريه",500,"الاسكندريه",null,null,null,null,null,null,null,null,null,null,null,null,"طن",80,{"$f":"IFERROR(IF($U8=\"نقلة\",$Z8,IF(AND(Y8>=SUMIF(data!$A$18:$A$21,AA8,data!$B$18:$B$21),$U8=\"طن\"),($Y8*$Z8),$Z8*AC8)),\"\")","v":1935},194162,9,{"$f":"IFERROR(IF(بيانات!$U8=\"نقلة\",INDEX(الجدول35[[5 طن]:[وش]],MATCH(بيانات!$H8,الجدول35[عمود1],0),MATCH(بيانات!$AA8,الجدول35[[#Headers],[5 طن]:[وش]],0)),INDEX(الجدول3[[5 طن]:[وش]],MATCH(بيانات!$H8,الجدول3[عمود1],0),MATCH(بيانات!$AA8,الجدول3[[#Headers],[5 طن]:[وش]],0))),\"\")","v":215},"5 طن",null,null,null,null,{"$f":"IF(AND(بيانات!$Y8>=24,بيانات!$U8=\"طن\",بيانات!$AA8=\"جرار\"),بيانات!$Z8*بيانات!$Y8,بيانات!$Z8*24)","v":5160},{"$f":"IF(AND(بيانات!$Y8>=5,AND(بيانات!$U8=\"طن\",بيانات!$AA8=\"5 طن\")),بيانات!$Z8*بيانات!$Y8,بيانات!$Z8*5)","v":1935},{"$f":"IF(بيانات!$U8=\"نقلة\",بيانات!$Z8,\"\")","v":""}]
[{"$f":"بيانات!$X9","v":"194093/4/5/6/7/8"},"2020-01-07","حامد رفعت",1698,null,"اسكندريه",null,"الاسكندريه",null,null,null,null,null,null,null,null,null,1000,"لفه4",null,"طن",80,{"$f":"IFERROR(IF($U9=\"نقلة\",$Z9,IF(AND(Y9>=SUMIF(data!$A$18:$A$21,AA9,data!$B$18:$B$21),$U9=\"طن\"),($Y9*$Z9),$Z9*AC9)),\"\")","v":3225},"194093/4/5/6/7/8",15,{"$f":"IFERROR(IF(بيانات!$U9=\"نقلة\",INDEX(الجدول35[[5 طن]:[وش]],MATCH(بيانات!$H9,الجدول35[عمود1],0),MATCH(بيانات!$AA9,الجدول35[[#Headers],[5 طن]:[وش]],0)),INDEX(الجدول3[[5 طن]:[وش]],MATCH(بيانات!$H9,الجدول3[عمود1],0),MATCH(بيانات!$AA9,الجدول3[[#Headers],[5 طن]:[وش]],0))),\"\")","v":215},"5 طن",null,null,null,null,{"$f":"IF(AND(بيانات!$Y9>=24,بيانات!$U9=\"طن\",بيانات!$AA9=\"جرار\"),بيانات!$Z9*بيانات!$Y9,بيانات!$Z9*24)","v":5160},{"$f":"IF(AND(بيانات!$Y9>=5,AND(بيانات!$U9=\"طن\",بيانات!$AA9=\"5 طن\")),بيانات!$Z9*بيانات!$Y9,بيانات!$Z9*5)","v":3225},{"$f":"IF(بيانات!$U9=\"نقلة\",بيانات!$Z9,\"\")","v":""}]
[{"$f":"بيانات!$X10","v":193904},"2020-01-18","رمضان محمود",7293,null,"جيزه",null,"الجيزه",null,null,null,null,null,null,null,null,null,null,null,null,"طن",75,{"$f":"IFERROR(IF($U10=\"نقلة\",$Z10,IF(AND(Y10>=SUMIF(data!$A$18:$A$21,AA10,data!$B$18:$B$21),$U10=\"طن\"),($Y10*$Z10),$Z10*AC10)),\"\")","v":1100},193904,10,{"$f":"IFERROR(IF(بيانات!$U10=\"نقلة\",INDEX(الجدول35[[5 طن]:[وش]],MATCH(بيانات!$H10,الجدول35[عمود1],0),MATCH(بيانات!$AA10,الجدول35[[#Headers],[5 طن]:[وش]],0)),INDEX(الجدول3[[5 طن]:[وش]],MATCH(بيانات!$H10,الجدول3[عمود1],0),MATCH(بيانات!$AA10,الجدول3[[#Headers],[5 طن]:[وش]],0))),\"\")","v":110},"5 طن",null,null,null,null,{"$f":"IF(AND(بيانات!$Y10>=24,بيانات!$U10=\"طن\",بيانات!$AA10=\"جرار\"),بيانات!$Z10*بيانات!$Y10,بيانات!$Z10*24)","v":2640},{"$f":"IF(AND(بيانات!$Y10>=5,AND(بيانات!$U10=\"طن\",بيانات!$AA10=\"5 طن\")),بيانات!$Z10*بيانات!$Y10,بيانات!$Z10*5)","v":1100},{"$f":"IF(بيانات!$U10=\"نقلة\",بيانات!$Z10,\"\")","v":""}]
[{"$f":"بيانات!$X11","v":194087},"2020-02-01","رمضان محمود",7293,null,"ام زغو",200,"الاسكندريه",null,null,null,null,null,null,null,null,null,null,null,null,"طن",80,{"$f":"IFERROR(IF($U11=\"نقلة\",$Z11,IF(AND(Y11>=SUMIF(data!$A$18:$A$21,AA11,data!$B$18:$B$21),$U11=\"طن\"),($Y11*$Z11),$Z11*AC11)),\"\")","v":0},194087,null,{"$f":"IFERROR(IF(بيانات!$U11=\"نقلة\",INDEX(الجدول35[[5 طن]:[وش]],MATCH(بيانات!$H11,الجدول35[عمود1],0),MATCH(بيانات!$AA11,الجدول35[[#Headers],[5 طن]:[وش]],0)),INDEX(الجدول3[[5 طن]:[وش]],MATCH(بيانات!$H11,الجدول3[عمود1],0),MATCH(بيانات!$AA11,الجدول3[[#Headers],[5 طن]:[وش]],0))),\"\")","v":215},"5 طن",null,null,null,null,{"$f":"IF(AND(بيانات!$Y11>=24,بيانات!$U11=\"طن\",بيانات!$AA11=\"جرار\"),بيانات!$Z11*بيانات!$Y11,بيانات!$Z11*24)","v":5160},{"$f":"IF(AND(بيانات!$Y11>=5,AND(بيانات!$U11=\"طن\",بيانات!$AA11=\"5 طن\")),بيانات!$Z11*بيانات!$Y11,بيانات!$Z11*5)","v":1075},{"$f":"IF(بيانات!$U11=\"نقلة\",بيانات!$Z11,\"\")","v":""}]
[{"$f":"بيانات!$X12","v":194031},"2020-02-05","رمضان حمدي",1328,null,"الحرمين",null,"الجيزه",null,null,null,null,null,null,null,null,null,null,null,null,"نقلة",65,{"$f":"IFERROR(IF($U12=\"نقلة\",$Z12,IF(AND(Y12>=SUMIF(data!$A$18:$A$21,AA12,data!$B$18:$B$21),$U12=\"طن\"),($Y12*$Z12),$Z12*AC12)),\"\")","v":550},194031,null,{"$f":"IFERROR(IF(بيانات!$U12=\"نقلة\",INDEX(الجدول35[[5 طن]:[وش]],MATCH(بيانات!$H12,الجدول35[عمود1],0),MATCH(بيانات!$AA12,الجدول35[[#Headers],[5 طن]:[وش]],0)),INDEX(الجدول3[[5 طن]:[وش]],MATCH(بيانات!$H12,الجدول3[عمود1],0),MATCH(بيانات!$AA12,الجدول3[[#Headers],[5 طن]:[وش]],0))),\"\")","v":550},"5 طن",null,null,null,null,{"$f":"IF(AND(بيانات!$Y12>=24,بيانات!$U12=\"طن\",بيانات!$AA12=\"جرار\"),بيانات!$Z12*بيانات!$Y12,بيانات!$Z12*24)","v":13200},{"$f":"IF(AND(بيانات!$Y12>=5,AND(بيانات!$U12=\"طن\",بيانات!$AA12=\"5 طن\")),بيانات!$Z12*بيانات!$Y12,بيانات!$Z12*5)","v":2750},{"$f":"IF(بيانات!$U12=\"نقلة\",بيانات!$Z12,\"\")","v":550}]
[{"$f":"بيانات!$X13","v":194111},"2020-02-07","رمضان حمدي",1328,null,"العاشر",null,"العاشر",null,null,null,null,null,null,null,null,null,null,null,null,"طن",null,{"$f":"IFERROR(IF($U13=\"نقلة\",$Z13,IF(AND(Y13>=SUMIF(data!$A$18:$A$21,AA13,data!$B$18:$B$21),$U13=\"طن\"),($Y13*$Z13),$Z13*AC13)),\"\")","v":0},194111,null,{"$f":"IFERROR(IF(بيانات!$U13=\"نقلة\",INDEX(الجدول35[[5 طن]:[وش]],MATCH(بيانات!$H13,الجدول35[عمود1],0),MATCH(بيانات!$AA13,الجدول35[[#Headers],[5 طن]:[وش]],0)),INDEX(الجدول3[[5 طن]:[وش]],MATCH(بيانات!$H13,الجدول3[عمود1],0),MATCH(بيانات!$AA13,الجدول3[[#Headers],[5 طن]:[وش]],0))),\"\")","v":40},"5 طن",null,null,null,null,{"$f":"IF(AND(بيانات!$Y13>=24,بيانات!$U13=\"طن\",بيانات!$AA13=\"جرار\"),بيانات!$Z13*بيانات!$Y13,بيانات!$Z13*24)","v":960},{"$f":"IF(AND(بيانات!$Y13>=5,AND(بيانات!$U13=\"طن\",بيانات!$AA13=\"5 طن\")),بيانات!$Z13*بيانات!$Y13,بيانات!$Z13*5)","v":200},{"$f":"IF(بيانات!$U13=\"نقلة\",بيانات!$Z13,\"\")","v":""}]
[{"$f":"بيانات!$X14","v":193910},"2020-03-09","محمد عادل",1279,null,"مترو",100,"اكتوبر",null,null,null,null,null,null,null,null,null,850,null,null,"طن",75,{"$f":"IFERROR(IF($U14=\"نقلة\",$Z14,IF(AND(Y14>=SUMIF(data!$A$18:$A$21,AA14,data!$B$18:$B$21),$U14=\"طن\"),($Y14*$Z14),$Z14*AC14)),\"\")","v":0},193910,null,{"$f":"IFERROR(IF(بيانات!$U14=\"نقلة\",INDEX(الجدول35[[5 طن]:[وش]],MATCH(بيانات!$H14,الجدول35[عمود1],0),MATCH(بيانات!$AA14,الجدول35[[#Headers],[5 طن]:[وش]],0)),INDEX(الجدول3[[5 طن]:[وش]],MATCH(بيانات!$H14,الجدول3[عمود1],0),MATCH(بيانات!$AA14,الجدول3[[#Headers],[5 طن]:[وش]],0))),\"\")","v":120},"5 طن",null,null,null,null,{"$f":"IF(AND(بيانات!$Y14>=24,بيانات!$U14=\"طن\",بيانات!$AA14=\"جرار\"),بيانات!$Z14*بيانات!$Y14,بيانات!$Z14*24)","v":2880},{"$f":"IF(AND(بيانات!$Y14>=5,AND(بيانات!$U14=\"طن\",بيانات!$AA14=\"5 طن\")),بيانات!$Z14*بيانات!$Y14,بيانات!$Z14*5)","v":600},{"$f":"IF(بيانات!$U14=\"نقلة\",بيانات!$Z14,\"\")","v":""}]
[{"$f":"بيانات!$X15","v":193888},"2020-03-23","بشير السيد",3751,null,"ام زغو",150,"الاسكندريه",null,null,null,null,null,null,null,null,null,800,null,null,"طن",75,{"$f":"IFERROR(IF($U15=\"نقلة\",$Z15,IF(AND(Y15>=SUMIF(data!$A$18:$A$21,AA15,data!$B$18:$B$21),$U15=\"طن\"),($Y15*$Z15),$Z15*AC15)),\"\")","v":0},193888,null,{"$f":"IFERROR(IF(بيانات!$U15=\"نقلة\",INDEX(الجدول35[[5 طن]:[وش]],MATCH(بيانات!$H15,الجدول35[عمود1],0),MATCH(بيانات!$AA15,الجدول35[[#Headers],[5 طن]:[وش]],0)),INDEX(الجدول3[[5 طن]:[وش]],MATCH(بيانات!$H15,الجدول3[عمود1],0),MATCH(بيانات!$AA15,الجدول3[[#Headers],[5 طن]:[وش]],0))),\"\")","v":215},"5 طن",null,null,null,null,{"$f":"IF(AND(بيانات!$Y15>=24,بيانات!$U15=\"طن\",بيانات!$AA15=\"جرار\"),بيانات!$Z15*بيانات!$Y15,بيانات!$Z15*24)","v":5160},{"$f":"IF(AND(بيانات!$Y15>=5,AND(بيانات!$U15=\"طن\",بيانات!$AA15=\"5 طن\")),بيانات!$Z15*بيانات!$Y15,بيانات!$Z15*5)","v":1075},{"$f":"IF(بيانات!$U15=\"نقلة\",بيانات!$Z15,\"\")","v":""}]
[{"$f":"بيانات!$X16","v":194042},"2020-03-25","ابراهيم حسن",6718,null,"قاهره",100,"القاهره",null,null,null,null,null,null,null,null,null,null,"بروفت",null,"طن",75,{"$f":"IFERROR(IF($U16=\"نقلة\",$Z16,IF(AND(Y16>=SUMIF(data!$A$18:$A$21,AA16,data!$B$18:$B$21),$U16=\"طن\"),($Y16*$Z16),$Z16*AC16)),\"\")","v":0},194042,null,{"$f":"IFERROR(IF(بيانات!$U16=\"نقلة\",INDEX(الجدول35[[5 طن]:[وش]],MATCH(بيانات!$H16,الجدول35[عمود1],0),MATCH(بيانات!$AA16,الجدول35[[#Headers],[5 طن]:[وش]],0)),INDEX(الجدول3[[5 طن]:[وش]],MATCH(بيانات!$H16,الجدول3[عمود1],0),MATCH(بيانات!$AA16,الجدول3[[#Headers],[5 طن]:[وش]],0))),\"\")","v":100},"5 طن",null,null,null,null,{"$f":"IF(AND(بيانات!$Y16>=24,بيانات!$U16=\"طن\",بيانات!$AA16=\"جرار\"),بيانات!$Z16*بيانات!$Y16,بيانات!$Z16*24)","v":2400},{"$f":"IF(AND(بيانات!$Y16>=5,AND(بيانات!$U16=\"طن\",بيانات!$AA16=\"5 طن\")),بيانات!$Z16*بيانات!$Y16,بيانات!$Z16*5)","v":500},{"$f":"IF(بيانات!$U16=\"نقلة\",بيانات!$Z16,\"\")","v":""}]
[{"$f":"بيانات!$X17","v":194131},"2020-03-26","ابراهيم محمد",6847,null,"السويس",400,"السويس",null,null,null,null,null,null,null,null,null,null,null,null,"طن",75,{"$f":"IFERROR(IF($U17=\"نقلة\",$Z17,IF(AND(Y17>=SUMIF(data!$A$18:$A$21,AA17,data!$B$18:$B$21),$U17=\"طن\"),($Y17*$Z17),$Z17*AC17)),\"\")","v":0},194131,null,{"$f":"IFERROR(IF(بيانات!$U17=\"نقلة\",INDEX(الجدول35[[5 طن]:[وش]],MATCH(بيانات!$H17,الجدول35[عمود1],0),MATCH(بيانات!$AA17,الجدول35[[#Headers],[5 طن]:[وش]],0)),INDEX(الجدول3[[5 طن]:[وش]],MATCH(بيانات!$H17,الجدول3[عمود1],0),MATCH(بيانات!$AA17,الجدول3[[#Headers],[5 طن]:[وش]],0))),\"\")","v":120},"5 طن",null,null,null,null,{"$f":"IF(AND(بيانات!$Y17>=24,بيانات!$U17=\"طن\",بيانات!$AA17=\"جرار\"),بيانات!$Z17*بيانات!$Y17,بيانات!$Z17*24)","v":2880},{"$f":"IF(AND(بيانات!$Y17>=5,AND(بيانات!$U17=\"طن\",بيانات!$AA17=\"5 طن\")),بيانات!$Z17*بيانات!$Y17,بيانات!$Z17*5)","v":600},{"$f":"IF(بيانات!$U17=\"نقلة\",بيانات!$Z17,\"\")","v":""}]
[{"$f":"بيانات!$X18","v":194014},"2020-04-01","محمود حسن",9562,null,"السويس",null,"السويس",null,null,null,null,null,null,null,null,null,null,null,null,"طن",65,{"$f":"IFERROR(IF($U18=\"نقلة\",$Z18,IF(AND(Y18>=SUMIF(data!$A$18:$A$21,AA18,data!$B$18:$B$21),$U18=\"طن\"),($Y18*$Z18),$Z18*AC18)),\"\")","v":0},194014,null,{"$f":"IFERROR(IF(بيانات!$U18=\"نقلة\",INDEX(الجدول35[[5 طن]:[وش]],MATCH(بيانات!$H18,الجدول35[عمود1],0),MATCH(بيانات!$AA18,الجدول35[[#Headers],[5 طن]:[وش]],0)),INDEX(الجدول3[[5 طن]:[وش]],MATCH(بيانات!$H18,الجدول3[عمود1],0),MATCH(بيانات!$AA18,الجدول3[[#Headers],[5 طن]:[وش]],0))),\"\")","v":120},"5 طن",null,null,null,null,{"$f":"IF(AND(بيانات!$Y18>=24,بيانات!$U18=\"طن\",بيانات!$AA18=\"جرار\"),بيانات!$Z18*بيانات!$Y18,بيانات!$Z18*24)","v":2880},{"$f":"IF(AND(بيانات!$Y18>=5,AND(بيانات!$U18=\"طن\",بيانات!$AA18=\"5 طن\")),بيانات!$Z18*بيانات!$Y18,بيانات!$Z18*5)","v":600},{"$f":"IF(بيانات!$U18=\"نقلة\",بيانات!$Z18,\"\")","v":""}]
[{"$f":"بيانات!$X19","v":193906},"2020-04-02","محمود حسن",9562,null,"الحرمين",null,"الجيزه",null,null,null,null,null,null,null,null,null,null,null,null,"طن",50,{"$f":"IFERROR(IF($U19=\"نقلة\",$Z19,IF(AND(Y19>=SUMIF(data!$A$18:$A$21,AA19,data!$B$18:$B$21),$U19=\"طن\"),($Y19*$Z19),$Z19*AC19)),\"\")","v":0},193906,null,{"$f":"IFERROR(IF(بيانات!$U19=\"نقلة\",INDEX(الجدول35[[5 طن]:[وش]],MATCH(بيانات!$H19,الجدول35[عمود1],0),MATCH(بيانات!$AA19,الجدول35[[#Headers],[5 طن]:[وش]],0)),INDEX(الجدول3[[5 طن]:[وش]],MATCH(بيانات!$H19,الجدول3[عمود1],0),MATCH(بيانات!$AA19,الجدول3[[#Headers],[5 طن]:[وش]],0))),\"\")","v":110},"5 طن",null,null,null,null,{"$f":"IF(AND(بيانات!$Y19>=24,بيانات!$U19=\"طن\",بيانات!$AA19=\"جرار\"),بيانات!$Z19*بيانات!$Y19,بيانات!$Z19*24)","v":2640},{"$f":"IF(AND(بيانات!$Y19>=5,AND(بيانات!$U19=\"طن\",بيانات!$AA19=\"5 طن\")),بيانات!$Z19*بيانات!$Y19,بيانات!$Z19*5)","v":550},{"$f":"IF(بيانات!$U19=\"نقلة\",بيانات!$Z19,\"\")","v":""}]
[{"$f":"بيانات!$X20","v":194164},"2020-04-03","محمود حسن",9562,null,"فوكس",100,"الجيزه",null,null,null,null,null,null,null,null,null,null,null,null,"طن",65,{"$f":"IFERROR(IF($U20=\"نقلة\",$Z20,IF(AND(Y20>=SUMIF(data!$A$18:$A$21,AA20,data!$B$18:$B$21),$U20=\"طن\"),($Y20*$Z20),$Z20*AC20)),\"\")","v":0},194164,null,{"$f":"IFERROR(IF(بيانات!$U20=\"نقلة\",INDEX(الجدول35[[5 طن]:[وش]],MATCH(بيانات!$H20,الجدول35[عمود1],0),MATCH(بيانات!$AA20,الجدول35[[#Headers],[5 طن]:[وش]],0)),INDEX(الجدول3[[5 طن]:[وش]],MATCH(بيانات!$H20,الجدول3[عمود1],0),MATCH(بيانات!$AA20,الجدول3[[#Headers],[5 طن]:[وش]],0))),\"\")","v":110},"5 طن",null,null,null,null,{"$f":"IF(AND(بيانات!$Y20>=24,بيانات!$U20=\"طن\",بيانات!$AA20=\"جرار\"),بيانات!$Z20*بيانات!$Y20,بيانات!$Z20*24)","v":2640},{"$f":"IF(AND(بيانات!$Y20>=5,AND(بيانات!$U20=\"طن\",بيانات!$AA20=\"5 طن\")),بيانات!$Z20*بيانات!$Y20,بيانات!$Z20*5)","v":550},{"$f":"IF(بيانات!$U20=\"نقلة\",بيانات!$Z20,\"\")","v":""}]
{"$rows_left_out":88}
{"sheet":"data","index":2,"n_rows":21,"n_cols":23,"rows_kept":21,"cut":false,"hidden":false,"merged":[[0,18,0,21],[0,0,0,3],[0,6,0,9],[0,12,0,15]]}
["سعر السائق بالطن",null,null,null,null,null,"سعر المصنع بالطن",null,null,null,null,null,"سعر السائق بالنقله",null,null,null,null,null,"سعر السائق بالنقله"]
["عمود1","5 طن","فرداني","جرار","وش",null,"عمود1","5 طن","فرداني","جرار","وش",null,"عمود1","5 طن","فرداني","جرار","وش",null,"عمود1","5 طن","فرداني","جرار","وش"]
["القاهره",100,95,80,95,null,"القاهره",126,105,92,105,null,"القاهره",500,600,700,800,null,"القاهره",550,650,750,850]
["الجيزه",110,95,80,95,null,"الجيزه",137,105,92,105,null,"الجيزه",550,650,750,850,null,"الجيزه",600,700,800,900]
["القليوبيه",110,95,80,95,null,"القليوبيه",137,105,92,105,null,"القليوبيه",600,700,800,900,null,"القليوبيه",650,750,850,950]
["الشرقيه",100,85,80,85,null,"الشرقيه",114,97,92,97,null,"الشرقيه",650,750,850,950,null,"الشرقيه",700,800,900,1000]
["الاسماعيليه",105,95,80,95,null,"الاسماعيليه",161,105,92,105,null,"الاسماعيليه",700,800,900,1000,null,"الاسماعيليه",750,850,950,1050]
["السويس",120,95,80,95,null,"السويس",183,119,105,119,null,"السويس",750,850,950,1050,null,"السويس",800,900,1000,1100]
["اكتوبر",120,100,90,100,null,"اكتوبر",161,108,102,108,null,"اكتوبر",800,900,1000,1100,null,"اكتوبر",850,950,1050,1150]
["البحيره",165,125,120,125,null,"البحيره",198,149,143,149,null,"البحيره",850,950,1050,1150,null,"البحيره",900,1000,1100,1200]
["الاسكندريه",215,150,140,150,null,"الاسكندريه",280,171,164,171,null,"الاسكندريه",900,1000,1100,1200,null,"الاسكندريه",950,1050,1150,1250]
["العاشر",40,35,30,35,null,"العاشر",50,45,35,45,null,"العاشر",950,1050,1150,1250,null,"العاشر",1000,1100,1200,1300]
[]
[]
[]
[]
[]
["5 طن",5]
["فرداني",10]
["جرار",24]
{"$rows_left_out":2}
{"sheet":"حساب سائق","index":3,"n_rows":9,"n_cols":11,"rows_kept":9,"cut":false,"hidden":false,"merged":[]}
["تاريخ المحاسبه","(فارغ)"]
["السائق","محمد صلاح"]
[]
[null,null,null,"القيم"]
["التاريخ","مكان التعتيق","Ship","العهدة","الخصم","الشيك","سلفة","قيمه النقله","ميزان ط","كميه","االصافي"]
["2020-06-01","ام زغو",194197,150,null,null,null,1369.77,65,6.3710000000000004,1284.77]
["2020-06-02","اولاد رجب",194534,100,null,null,null,682.6,75,6.8259999999999996,657.6]
["2020-06-03","بحيره",0,200,null,null,null,0,null,null,-200]
["الإجمالي الكلي",null,null,450,null,null,null,2052.37,140,13.196999999999999,1742.37]