{"text_format":"1","workbook":"xlsx","n_sheets":8,"sheets":["insert","today ","casher","count","sales","data","Sheet1","Sheet2"],"not_rendered":{"charts":0,"images":0,"macros":1,"external_links":0,"defined_names":8,"comments":0,"pivot_tables":0},"unopened":[],"bounds":{"document_bytes":16777216,"sheet_cells":100000,"rows_first":2000,"rows_last":500,"rows_between":2000,"halvings":0,"cell_chars":16384,"cell_head_chars":4096},"cells_cut":0,"cells_raw":0,"read":"whole","date_system":"1900"}

{"sheet":"insert","index":0,"n_rows":19,"n_cols":29,"rows_kept":19,"cut":false,"hidden":false,"merged":[[12,28,12,29],[7,28,7,29],[15,22,15,23],[15,24,15,25],[15,26,15,27],[15,28,15,29],[9,10,14,12],[10,24,10,25],[10,26,10,27],[10,28,10,29],[11,22,11,23],[11,24,11,25],[11,26,11,27],[11,28,11,29],[13,22,13,23],[13,24,13,25],[13,26,13,27],[13,28,13,29],[14,22,14,23],[14,24,14,25],[14,26,14,27],[14,28,14,29],[12,22,12,23],[12,24,12,25],[12,26,12,27],[10,22,10,23],[4,28,4,29],[4,26,4,27],[4,24,4,25],[4,22,4,23],[5,22,5,23],[5,24,5,25],[5,26,5,27],[5,28,5,29],[8,22,8,23],[8,24,8,25],[8,26,8,27],[8,28,8,29],[9,22,9,23],[9,24,9,25],[9,26,9,27],[9,28,9,29],[6,22,6,23],[6,24,6,25],[6,26,6,27],[6,28,6,29],[7,22,7,23],[7,24,7,25],[7,26,7,27],[16,21,16,24],[16,25,16,28],[16,0,17,0],[9,14,14,16],[9,18,14,20],[16,1,16,4],[16,5,16,8],[16,9,16,12],[16,13,16,16],[16,17,16,20],[15,6,15,8],[15,0,15,5],[12,0,12,2],[13,0,13,2],[13,3,13,5],[13,6,13,8],[14,3,14,5],[14,6,14,8],[14,0,14,2],[12,3,12,5],[12,6,12,8],[10,0,10,2],[10,3,10,5],[10,6,10,8],[11,0,11,2],[11,3,11,5],[11,6,11,8],[8,0,8,2],[8,3,8,5],[8,6,8,8],[9,0,9,2],[9,3,9,5],[9,6,9,8],[7,0,7,2],[7,3,7,5],[7,6,7,8],[4,0,4,2],[4,3,4,5],[4,6,4,8],[5,0,5,2],[5,3,5,5],[5,6,5,8],[0,0,2,0],[0,25,0,28],[0,1,0,4],[0,5,0,8],[0,9,0,12],[0,13,0,16],[0,17,0,20],[0,21,0,24],[6,0,6,2],[6,3,6,5],[6,6,6,8]]}
["ادخال","لحم",null,null,null,"كفتة",null,null,null,"فراخ",null,null,null,"كبدة",null,null,null,"سجق",null,null,null,"طرب",null,null,null,"رغيف"]
[null,"كمية","سعر","تاريخ","مرجع","كمية","سعر","تاريخ","مرجع","كمية","سعر","تاريخ","مرجع","كمية","سعر","تاريخ","مرجع","كمية","سعر","تاريخ","مرجع","كمية","سعر","تاريخ","مرجع","كمية","سعر","تاريخ","مرجع"]
[null,null,null,null,null,2,5,"2020-09-12",2,null,null,null,null,null,null,null,null,4,5,"2020-09-12",2,null,null,null,null,6,5,"2020-09-12",2]
[]
["عدد",null,null,"فئة",null,null,"الاجمالي",null,null,null,null,null,null,null,null,null,null,null,null,null,null,null,"الصنف",null,"الكمية",null,"سعر",null,"الاجمالي"]
[null,null,null,200,null,null,{"$f":"D6*A6","v":0}]
[null,null,null,100,null,null,{"$f":"D7*A7","v":0}]
[null,null,null,50,null,null,0]
[null,null,null,20,null,null,0]
[null,null,null,10,null,null,0]
[null,null,null,5,null,null,0]
[null,null,null,1,null,null,0]
[null,null,null,0.5,null,null,{"$f":"D13*A15","v":0}]
[]
[]
["الاجمالي",null,null,null,null,null,{"$f":"SUM(G6:I14)","v":0}]
["مبيعات يومية","لحم",null,null,null,"كفتة",null,null,null,"فراخ",null,null,null,"كبدة",null,null,null,"سجق",null,null,null,"طرب",null,null,null,"رغيف"]
[null,"كمية","سعر","تاريخ","مرجع","كمية","سعر","تاريخ","مرجع","كمية","سعر","تاريخ","مرجع","كمية","سعر","تاريخ","مرجع","كمية","سعر","تاريخ","مرجع","كمية","سعر","تاريخ","مرجع","كمية","سعر","تاريخ","مرجع"]
["بيانات",2,5,"2020-09-12",1,2,5,"2020-09-12",1,3,5,"2020-09-12",1,4,5,"2020-09-12",1,5,5,"2020-09-12",1,6,5,"2020-09-12",1,7,5,"2020-09-12",1]

{"sheet":"today ","index":1,"n_rows":7,"n_cols":29,"rows_kept":7,"cut":false,"hidden":false,"merged":[[0,25,0,28],[0,1,0,4],[0,5,0,8],[0,9,0,12],[0,13,0,16],[0,17,0,20],[0,21,0,24]]}
[null,"لحم",null,null,null,"كفتة",null,null,null,"فراخ",null,null,null,"كبدة",null,null,null,"سجق",null,null,null,"طرب",null,null,null,"رغيف"]
[null,"كمية","سعر","تاريخ","مرجع","كمية","سعر","تاريخ","مرجع","كمية","سعر","تاريخ","مرجع","كمية","سعر","تاريخ","مرجع","كمية","سعر","تاريخ","مرجع","كمية","سعر","تاريخ","مرجع","كمية","سعر","تاريخ","مرجع"]
["مشتريات"]
["استهلاك يومي"]
["استهلاك شهري"]
["استهلاك كميات متجددة"]
["باقي"]

{"sheet":"casher","index":2,"n_rows":57,"n_cols":14,"rows_kept":57,"cut":false,"hidden":false,"merged":[[0,9,17,9],[2,5,16,5]]}
["المدفوع",null,"الاجمالي",null,null,"الباقي"]
["القسم","الكمية","الصنف","سعر"]
["وجبات",3,"وجبة طرب",{"$f":"IFERROR(VLOOKUP(C3,data!$K$2:$L$45,2,0)*casher!B3,\"\")","v":150},{"$f":"TODAY()","v":"2020-09-12"},{"$f":"B1-D1","v":0},null,null,null,null,"المدفوع",null,"الاجمالي"]
["سندوتش",4,"صاروخ كفتة وسط",{"$f":"IFERROR(VLOOKUP(C4,data!$K$2:$L$44,2,0)*casher!B4,\"\")","v":60},{"$f":"TODAY()","v":"2020-09-12"},null,null,null,null,null,"الباقي",{"$f":"L3-M4","v":-44265},{"$f":"SUM(M6:M17)","v":44265}]
[null,null,null,{"$f":"IFERROR(VLOOKUP(C5,data!$K$2:$L$44,2,0)*casher!B5,\"\")","v":""},"2020-09-12",null,null,null,null,null,6,"صاروخ كفتة كبير",120]
[null,null,null,{"$f":"IFERROR(VLOOKUP(C6,data!$K$2:$L$44,2,0)*casher!B6,\"\")","v":""},"2020-09-12",null,null,null,null,null,2,"وجبة كفتة",90]
[null,null,null,{"$f":"IFERROR(VLOOKUP(C7,data!$K$2:$L$44,2,0)*casher!B7,\"\")","v":""},"2020-09-12",null,null,null,null,null,2,"وجبة كفتة",90]
[null,null,null,{"$f":"IFERROR(VLOOKUP(C8,data!$K$2:$L$44,2,0)*casher!B8,\"\")","v":""},"2020-09-12",null,null,null,null,null,"","","",""]
[null,null,null,{"$f":"IFERROR(VLOOKUP(C9,data!$K$2:$L$44,2,0)*casher!B9,\"\")","v":""},"2020-09-12",null,null,null,null,null,"وجبة كمبلة","وجبة الجنة","وجبة اسبشيل","صاروخ كفتة صغير"]
[null,null,null,{"$f":"IFERROR(VLOOKUP(C10,data!$K$2:$L$44,2,0)*casher!B10,\"\")","v":""},"2020-09-12",null,null,null,null,null,"","","",""]
[null,null,null,{"$f":"IFERROR(VLOOKUP(C11,data!$K$2:$L$44,2,0)*casher!B11,\"\")","v":""},"2020-09-12",null,null,null,null,null,"","","",""]
[null,null,null,{"$f":"IFERROR(VLOOKUP(C12,data!$K$2:$L$44,2,0)*casher!B12,\"\")","v":""},"2020-09-12",null,null,null,null,null,"سندوتش مشكل صغير","سندوتش مشكل كبير","طلب مشكل صغير","طلب مشكل وسط"]
[null,null,null,{"$f":"IFERROR(VLOOKUP(C13,data!$K$2:$L$44,2,0)*casher!B13,\"\")","v":""},"2020-09-12",null,null,null,null,null,"","","",""]
[null,null,null,{"$f":"IFERROR(VLOOKUP(C14,data!$K$2:$L$44,2,0)*casher!B14,\"\")","v":""},"2020-09-12",null,null,null,null,null,"","","",""]
[null,null,null,{"$f":"IFERROR(VLOOKUP(C15,data!$K$2:$L$44,2,0)*casher!B15,\"\")","v":""},"2020-09-12",null,null,null,null,null,"لحم"]
[null,null,null,{"$f":"IFERROR(VLOOKUP(C16,data!$K$2:$L$44,2,0)*casher!B16,\"\")","v":""},"2020-09-12",null,null,null,null,null,"كمية","سعر","تاريخ","مرجع"]
[null,null,null,{"$f":"IFERROR(VLOOKUP(C17,data!$K$2:$L$44,2,0)*casher!B17,\"\")","v":""},"2020-09-12",null,null,null,null,null,2,500,44085,0]
[null,null,null,{"$f":"IFERROR(VLOOKUP(C18,data!$K$2:$L$44,2,0)*casher!B18,\"\")","v":""},"2020-09-12",null,null,null,null,null,"كمية","صنف","سعر","توقيت"]
[null,null,null,null,null,null,null,null,null,null,2,"وجبة مشكل",110,44085]
[null,null,null,null,null,null,null,null,null,null,5,"صاروخ كفتة وسط",75,44085]
[null,null,null,null,null,null,null,null,null,null,2,"كيلو كباب",500,44085]
[null,null,null,null,null,null,null,null,null,null,1,"فرخة شيش",100,44085]
[null,null,null,null,null,null,null,null,null,null,2,"صاروخ كفتة كبير",40,44085]
[null,null,null,null,null,null,null,null,null,null,2,"وجبة كفتة",90,44085]
[]
[null,null,null,null,null,null,null,null,null,null,"المدفوع",10,"الباقي"]
[null,null,null,null,null,null,null,null,null,null,2,"وجبة كباب",140]
[]
[]
[]
[]
[]
[]
[]
[]
[]
[]
[]
[]
[]
{"$rows_left_out":18}
{"sheet":"count","index":3,"n_rows":9,"n_cols":29,"rows_kept":9,"cut":false,"hidden":false,"merged":[[0,5,0,8],[0,1,0,2],[5,25,5,28],[5,1,5,4],[5,5,5,8],[5,9,5,12],[5,13,5,16],[5,17,5,20],[5,21,5,24],[0,9,0,12],[0,13,0,16],[0,17,0,20],[0,21,0,24],[0,25,0,28]]}
[null,"لحم",null,null,null,"كفتة",null,null,null,"فراخ",null,null,null,"كبدة",null,null,null,"سجق",null,null,null,"طرب",null,null,null,"رغيف"]
[null,"كمية","سعر","تاريخ","مرجع","كمية","سعر","تاريخ","مرجع","كمية","سعر","تاريخ","مرجع","كمية","سعر","تاريخ","مرجع","كمية","سعر","تاريخ","مرجع","كمية","سعر","تاريخ","مرجع","كمية","سعر","تاريخ","مرجع"]
[]
[]
[]
[null,"لحم",null,null,null,"كفتة",null,null,null,"فراخ",null,null,null,"كبدة",null,null,null,"سجق",null,null,null,"طرب",null,null,null,"رغيف"]
[null,"كمية","سعر","تاريخ","مرجع","كمية","سعر","تاريخ","مرجع","كمية","سعر","تاريخ","مرجع","كمية","سعر","تاريخ","مرجع","كمية","سعر","تاريخ","مرجع","كمية","سعر","تاريخ","مرجع","كمية","سعر","تاريخ","مرجع"]
[null,null,null,null,null,2,5,"2020-09-12",2,null,null,null,null,null,null,null,null,4,5,"2020-09-12",2,null,null,null,null,6,5,"2020-09-12",2]
[null,null,null,null,null,2,5,"2020-09-12",2,null,null,null,null,null,null,null,null,4,5,"2020-09-12",2,null,null,null,null,6,5,"2020-09-12",2]

{"sheet":"sales","index":4,"n_rows":55,"n_cols":29,"rows_kept":55,"cut":false,"hidden":true,"merged":[[9,21,9,24],[9,25,9,28],[9,1,9,4],[9,5,9,8],[9,9,9,12],[9,13,9,16],[9,17,9,20]]}
["الصنف","كيلو كباب","كيلو ريش","كيلو مشكل","كيلو كفتة","كيلو كبدة ضاني","كيلو طرب","كيلو سجق","كيلو موزة ضاني","وجبة كباب","وجبة مشكل","وجبة كفتة","وجبة طرب","وجبة كومبو","كانز"]
["الكمية",{"$f":"IF(SUMIFS($B13:$B20003,$C13:$C20003,B1,$E13:$E20003,$A$10)=0,\"\",SUMIFS($B13:$B20003,$C13:$C20003,B1,$E13:$E20003,$A$10))","v":""},"","","","","","","","","","","","",""]
["السعر",{"$f":"IF(SUMIFS($D:$D,$C:$C,B1,$E:$E,$A$10)=0,\"\",SUMIFS($D:$D,$C:$C,B1,$E:$E,$A$10))","v":""},"","","","","","","","","","","","",""]
["الصنف","وجبة كمبلة","وجبة الجنة","وجبة اسبشيل","صاروخ كفتة صغير","صاروخ كفتة وسط","صاروخ كفتة كبير","صاروخ طرب","صاروخ سجق","حواوشي صغير ","حواوشي وسط","حواوشي كبير","سندوتش صغير","سندوتش كبير","رز صغير"]
["الكمية",{"$f":"IF(SUMIFS($B13:$B20003,$C13:$C20003,B4,$E13:$E20003,$A$10)=0,\"\",SUMIFS($B13:$B20003,$C13:$C20003,B4,$E13:$E20003,$A$10))","v":""},"","","","","","","","","","","","",""]
["السعر",{"$f":"IF(SUMIFS($D13:$D20003,$C13:$C20003,B4,$E13:$E20003,$A$10)=0,\"\",SUMIFS($D13:$D20003,$C13:$C20003,B4,$E13:$E20003,$A$10))","v":""},"","","","","","","","","","","","",""]
["الصنف","سندوتش مشكل صغير","سندوتش مشكل كبير","طلب مشكل صغير","طلب مشكل وسط","طلب مشكل كبير","ربع فرخة","نصف فرخة","وجبة بانيه","سندوتش بانيه صغير","سندوتش بانيه وسط","سندوتش بانيه كبير","م . ص","لسان عصفور","رز كبير"]
["الكمية",{"$f":"IF(SUMIFS($B:$B,$C:$C,B7,$E:$E,$A$10)=0,\"\",SUMIFS($B:$B,$C:$C,B7,$E:$E,$A$10))","v":""},"","","","","","","","","","","","",""]
["السعر",{"$f":"IF(SUMIFS($D:$D,$C:$C,B7,$E:$E,$A$10)=0,\"\",SUMIFS($D:$D,$C:$C,B7,$E:$E,$A$10))","v":""},"","","","","","","","","","","","",""]
[{"$f":"TODAY()","v":"2020-09-12"},"لحم",null,null,null,"كفتة",null,null,null,"فراخ",null,null,null,"كبدة",null,null,null,"سجق",null,null,null,"طرب",null,null,null,"رغيف"]
["مبيعات يومية","كمية","سعر","تاريخ","مرجع","كمية","سعر","تاريخ","مرجع","كمية","سعر","تاريخ","مرجع","كمية","سعر","تاريخ","مرجع","كمية","سعر","تاريخ","مرجع","كمية","سعر","تاريخ","مرجع","كمية","سعر","تاريخ","مرجع"]
["بيانات",{"$f":"SUMIFS($G$14:$G$20000,$F$14:$F$20000,B10,$E$14:$E$20000,$A$10)","v":0},{"$f":"SUMIFS($D$14:$D$20000,$F$14:$F$20000,B10,$E$14:$E$20000,$A$10)","v":0},{"$f":"TODAY()","v":"2020-09-12"},{"$f":"count!E3","v":0},{"$f":"SUMIFS($G$14:$G$20000,$F$14:$F$20000,F10,$E$14:$E$20000,$A$10)","v":0},{"$f":"SUMIFS($D$14:$D$20000,$F$14:$F$20000,F10,$E$14:$E$20000,$A$10)","v":0},{"$f":"TODAY()","v":"2020-09-12"},{"$f":"count!I3","v":0},{"$f":"SUMIFS($G$14:$G$20000,$F$14:$F$20000,J10,$E$14:$E$20000,$A$10)","v":0},{"$f":"SUMIFS($D$14:$D$20000,$F$14:$F$20000,J10,$E$14:$E$20000,$A$10)","v":0},{"$f":"TODAY()","v":"2020-09-12"},{"$f":"count!M3","v":0},{"$f":"SUMIFS($G$14:$G$20000,$F$14:$F$20000,N10,$E$14:$E$20000,$A$10)","v":0},{"$f":"SUMIFS($D$14:$D$20000,$F$14:$F$20000,N10,$E$14:$E$20000,$A$10)","v":0},{"$f":"TODAY()","v":"2020-09-12"},{"$f":"count!Q3","v":0},{"$f":"SUMIFS($G$14:$G$20000,$F$14:$F$20000,R10,$E$14:$E$20000,$A$10)","v":0},{"$f":"SUMIFS($D$14:$D$20000,$F$14:$F$20000,R10,$E$14:$E$20000,$A$10)","v":0},{"$f":"TODAY()","v":"2020-09-12"},{"$f":"count!U3","v":0},{"$f":"SUMIFS($G$14:$G$20000,$F$14:$F$20000,V10,$E$14:$E$20000,$A$10)","v":0},{"$f":"SUMIFS($D$14:$D$20000,$F$14:$F$20000,V10,$E$14:$E$20000,$A$10)","v":0},{"$f":"TODAY()","v":"2020-09-12"},{"$f":"count!Y3","v":0},{"$f":"SUMIFS($G$14:$G$20000,$F$14:$F$20000,Z10,$E$14:$E$20000,$A$10)","v":0},{"$f":"SUMIFS($D$14:$D$20000,$F$14:$F$20000,Z10,$E$14:$E$20000,$A$10)","v":0},{"$f":"TODAY()","v":"2020-09-12"},{"$f":"count!AC3","v":0}]
["قسم","كمية","صنف","سعر","توقيت",{"$f":"IFERROR(VLOOKUP(C13,data!N:O,2,0),\"\")","v":""},{"$f":"IFERROR(VLOOKUP(C13,data!N:P,3,0)*B13,0)","v":0},null,null,"الصنف","الكمية","السعر"]
["وجبات",3,"وجبة طرب",150,"2020-09-11",{"$f":"IFERROR(VLOOKUP(C14,data!N:O,2,0),\"\")","v":"كفتة"},{"$f":"IFERROR(VLOOKUP(C14,data!N:P,3,0)*B14,0)","v":0.75},null,null,"كيلو كباب",{"$f":"IF(SUMIFS($B13:$B20003,$C13:$C20003,J14,$E13:$E20003,$A$10)=0,\"\",SUMIFS($B13:$B20003,$C13:$C20003,J14,$E13:$E20003,$A$10))","v":""},{"$f":"IF(SUMIFS($J$16:$XFD$16,$J$15:$XFD$15,J14,$J$17:$XFD$17,$A$10)=0,\"\",SUMIFS($J$16:$XFD$16,$J$15:$XFD$15,J14,$J$17:$XFD$17,$A$10))","v":""}]
["سندوتش",4,"صاروخ كفتة وسط",60,"2020-09-11",{"$f":"IFERROR(VLOOKUP(C15,data!N:O,2,0),\"\")","v":"كفتة"},{"$f":"IFERROR(VLOOKUP(C15,data!N:P,3,0)*B15,0)","v":0.4},null,null,"كيلو ريش",{"$f":"IF(SUMIFS($B13:$B20003,$C13:$C20003,J15,$E13:$E20003,$A$10)=0,\"\",SUMIFS($B13:$B20003,$C13:$C20003,J15,$E13:$E20003,$A$10))","v":""},""]
[null,null,null,"","2020-09-11",{"$f":"IFERROR(VLOOKUP(C16,data!N:O,2,0),\"\")","v":""},{"$f":"IFERROR(VLOOKUP(C16,data!N:P,3,0)*B16,0)","v":0},null,null,"كيلو مشكل",{"$f":"IF(SUMIFS($B13:$B20003,$C13:$C20003,J16,$E13:$E20003,$A$10)=0,\"\",SUMIFS($B13:$B20003,$C13:$C20003,J16,$E13:$E20003,$A$10))","v":""},""]
[null,null,null,"","2020-09-11",{"$f":"IFERROR(VLOOKUP(C17,data!N:O,2,0),\"\")","v":""},{"$f":"IFERROR(VLOOKUP(C17,data!N:P,3,0)*B17,0)","v":0},null,null,"كيلو كفتة",{"$f":"IF(SUMIFS($B13:$B20003,$C13:$C20003,J17,$E13:$E20003,$A$10)=0,\"\",SUMIFS($B13:$B20003,$C13:$C20003,J17,$E13:$E20003,$A$10))","v":""},""]
[null,null,null,"","2020-09-11",{"$f":"IFERROR(VLOOKUP(C18,data!N:O,2,0),\"\")","v":""},{"$f":"IFERROR(VLOOKUP(C18,data!N:P,3,0)*B18,0)","v":0},null,null,"كيلو كبدة ضاني",{"$f":"IF(SUMIFS($B13:$B20003,$C13:$C20003,J18,$E13:$E20003,$A$10)=0,\"\",SUMIFS($B13:$B20003,$C13:$C20003,J18,$E13:$E20003,$A$10))","v":""},""]
[null,null,null,"","2020-09-11",{"$f":"IFERROR(VLOOKUP(C19,data!N:O,2,0),\"\")","v":""},{"$f":"IFERROR(VLOOKUP(C19,data!N:P,3,0)*B19,0)","v":0},null,null,"كيلو طرب",{"$f":"IF(SUMIFS($B13:$B20003,$C13:$C20003,J19,$E13:$E20003,$A$10)=0,\"\",SUMIFS($B13:$B20003,$C13:$C20003,J19,$E13:$E20003,$A$10))","v":""},""]
[null,null,null,"",null,null,null,null,null,"كيلو سجق",{"$f":"IF(SUMIFS($B13:$B20003,$C13:$C20003,J20,$E13:$E20003,$A$10)=0,\"\",SUMIFS($B13:$B20003,$C13:$C20003,J20,$E13:$E20003,$A$10))","v":""},""]
[null,null,null,"",null,null,null,null,null,"كيلو موزة ضاني",{"$f":"IF(SUMIFS($B13:$B20003,$C13:$C20003,J21,$E13:$E20003,$A$10)=0,\"\",SUMIFS($B13:$B20003,$C13:$C20003,J21,$E13:$E20003,$A$10))","v":""},""]
[null,null,null,"",null,null,null,null,null,"وجبة كباب",{"$f":"IF(SUMIFS($B13:$B20003,$C13:$C20003,J22,$E13:$E20003,$A$10)=0,\"\",SUMIFS($B13:$B20003,$C13:$C20003,J22,$E13:$E20003,$A$10))","v":""},""]
[null,null,null,"",null,null,null,null,null,"وجبة مشكل",{"$f":"IF(SUMIFS($B13:$B20003,$C13:$C20003,J23,$E13:$E20003,$A$10)=0,\"\",SUMIFS($B13:$B20003,$C13:$C20003,J23,$E13:$E20003,$A$10))","v":""},""]
[null,null,null,"",null,null,null,null,null,"وجبة كفتة",{"$f":"IF(SUMIFS($B13:$B20003,$C13:$C20003,J24,$E13:$E20003,$A$10)=0,\"\",SUMIFS($B13:$B20003,$C13:$C20003,J24,$E13:$E20003,$A$10))","v":""},""]
[null,null,null,"",null,null,null,null,null,"وجبة طرب",{"$f":"IF(SUMIFS($B13:$B20003,$C13:$C20003,J25,$E13:$E20003,$A$10)=0,\"\",SUMIFS($B13:$B20003,$C13:$C20003,J25,$E13:$E20003,$A$10))","v":""},""]
[null,null,null,"",null,null,null,null,null,"وجبة كومبو",{"$f":"IF(SUMIFS($B13:$B20003,$C13:$C20003,J26,$E13:$E20003,$A$10)=0,\"\",SUMIFS($B13:$B20003,$C13:$C20003,J26,$E13:$E20003,$A$10))","v":""},""]
[null,null,null,"",null,null,null,null,null,"كانز",{"$f":"IF(SUMIFS($B13:$B20003,$C13:$C20003,J27,$E13:$E20003,$A$10)=0,\"\",SUMIFS($B13:$B20003,$C13:$C20003,J27,$E13:$E20003,$A$10))","v":""},""]
[null,null,null,"",null,null,null,null,null,"وجبة كمبلة",{"$f":"IF(SUMIFS($B13:$B20003,$C13:$C20003,J28,$E13:$E20003,$A$10)=0,\"\",SUMIFS($B13:$B20003,$C13:$C20003,J28,$E13:$E20003,$A$10))","v":""},{"$f":"IF(SUMIFS($D13:$D20003,$C13:$C20003,J28,$E13:$E20003,$A$10)=0,\"\",SUMIFS($D13:$D20003,$C13:$C20003,J28,$E13:$E20003,$A$10))","v":""}]
[null,null,null,"",null,null,null,null,null,"وجبة الجنة",{"$f":"IF(SUMIFS($B13:$B20003,$C13:$C20003,J29,$E13:$E20003,$A$10)=0,\"\",SUMIFS($B13:$B20003,$C13:$C20003,J29,$E13:$E20003,$A$10))","v":""},{"$f":"IF(SUMIFS($D13:$D20003,$C13:$C20003,J29,$E13:$E20003,$A$10)=0,\"\",SUMIFS($D13:$D20003,$C13:$C20003,J29,$E13:$E20003,$A$10))","v":""}]
[null,null,null,null,null,null,null,null,null,"وجبة اسبشيل",{"$f":"IF(SUMIFS($B13:$B20003,$C13:$C20003,J30,$E13:$E20003,$A$10)=0,\"\",SUMIFS($B13:$B20003,$C13:$C20003,J30,$E13:$E20003,$A$10))","v":""},{"$f":"IF(SUMIFS($D13:$D20003,$C13:$C20003,J30,$E13:$E20003,$A$10)=0,\"\",SUMIFS($D13:$D20003,$C13:$C20003,J30,$E13:$E20003,$A$10))","v":""}]
[null,null,null,null,null,null,null,null,null,"صاروخ كفتة صغير",{"$f":"IF(SUMIFS($B13:$B20003,$C13:$C20003,J31,$E13:$E20003,$A$10)=0,\"\",SUMIFS($B13:$B20003,$C13:$C20003,J31,$E13:$E20003,$A$10))","v":""},{"$f":"IF(SUMIFS($D13:$D20003,$C13:$C20003,J31,$E13:$E20003,$A$10)=0,\"\",SUMIFS($D13:$D20003,$C13:$C20003,J31,$E13:$E20003,$A$10))","v":""}]
[null,null,null,null,null,null,null,null,null,"صاروخ كفتة وسط",{"$f":"IF(SUMIFS($B13:$B20003,$C13:$C20003,J32,$E13:$E20003,$A$10)=0,\"\",SUMIFS($B13:$B20003,$C13:$C20003,J32,$E13:$E20003,$A$10))","v":""},{"$f":"IF(SUMIFS($D13:$D20003,$C13:$C20003,J32,$E13:$E20003,$A$10)=0,\"\",SUMIFS($D13:$D20003,$C13:$C20003,J32,$E13:$E20003,$A$10))","v":""}]
[null,null,null,null,null,null,null,null,null,"صاروخ كفتة كبير",{"$f":"IF(SUMIFS($B13:$B20003,$C13:$C20003,J33,$E13:$E20003,$A$10)=0,\"\",SUMIFS($B13:$B20003,$C13:$C20003,J33,$E13:$E20003,$A$10))","v":""},{"$f":"IF(SUMIFS($D13:$D20003,$C13:$C20003,J33,$E13:$E20003,$A$10)=0,\"\",SUMIFS($D13:$D20003,$C13:$C20003,J33,$E13:$E20003,$A$10))","v":""}]
[null,null,null,null,null,null,null,null,null,"صاروخ طرب",{"$f":"IF(SUMIFS($B13:$B20003,$C13:$C20003,J34,$E13:$E20003,$A$10)=0,\"\",SUMIFS($B13:$B20003,$C13:$C20003,J34,$E13:$E20003,$A$10))","v":""},{"$f":"IF(SUMIFS($D13:$D20003,$C13:$C20003,J34,$E13:$E20003,$A$10)=0,\"\",SUMIFS($D13:$D20003,$C13:$C20003,J34,$E13:$E20003,$A$10))","v":""}]
[null,null,null,null,null,null,null,null,null,"صاروخ سجق",{"$f":"IF(SUMIFS($B13:$B20003,$C13:$C20003,J35,$E13:$E20003,$A$10)=0,\"\",SUMIFS($B13:$B20003,$C13:$C20003,J35,$E13:$E20003,$A$10))","v":""},{"$f":"IF(SUMIFS($D13:$D20003,$C13:$C20003,J35,$E13:$E20003,$A$10)=0,\"\",SUMIFS($D13:$D20003,$C13:$C20003,J35,$E13:$E20003,$A$10))","v":""}]
[null,null,null,null,null,null,null,null,null,"حواوشي صغير ",{"$f":"IF(SUMIFS($B13:$B20003,$C13:$C20003,J36,$E13:$E20003,$A$10)=0,\"\",SUMIFS($B13:$B20003,$C13:$C20003,J36,$E13:$E20003,$A$10))","v":""},{"$f":"IF(SUMIFS($D13:$D20003,$C13:$C20003,J36,$E13:$E20003,$A$10)=0,\"\",SUMIFS($D13:$D20003,$C13:$C20003,J36,$E13:$E20003,$A$10))","v":""}]
[null,null,null,null,null,null,null,null,null,"حواوشي وسط",{"$f":"IF(SUMIFS($B13:$B20003,$C13:$C20003,J37,$E13:$E20003,$A$10)=0,\"\",SUMIFS($B13:$B20003,$C13:$C20003,J37,$E13:$E20003,$A$10))","v":""},{"$f":"IF(SUMIFS($D13:$D20003,$C13:$C20003,J37,$E13:$E20003,$A$10)=0,\"\",SUMIFS($D13:$D20003,$C13:$C20003,J37,$E13:$E20003,$A$10))","v":""}]
[null,null,null,null,null,null,null,null,null,"حواوشي كبير",{"$f":"IF(SUMIFS($B13:$B20003,$C13:$C20003,J38,$E13:$E20003,$A$10)=0,\"\",SUMIFS($B13:$B20003,$C13:$C20003,J38,$E13:$E20003,$A$10))","v":""},{"$f":"IF(SUMIFS($D13:$D20003,$C13:$C20003,J38,$E13:$E20003,$A$10)=0,\"\",SUMIFS($D13:$D20003,$C13:$C20003,J38,$E13:$E20003,$A$10))","v":""}]
[null,null,null,null,null,null,null,null,null,"سندوتش صغير",{"$f":"IF(SUMIFS($B13:$B20003,$C13:$C20003,J39,$E13:$E20003,$A$10)=0,\"\",SUMIFS($B13:$B20003,$C13:$C20003,J39,$E13:$E20003,$A$10))","v":""},{"$f":"IF(SUMIFS($D13:$D20003,$C13:$C20003,J39,$E13:$E20003,$A$10)=0,\"\",SUMIFS($D13:$D20003,$C13:$C20003,J39,$E13:$E20003,$A$10))","v":""}]
[null,null,null,null,null,null,null,null,null,"سندوتش كبير",{"$f":"IF(SUMIFS($B13:$B20003,$C13:$C20003,J40,$E13:$E20003,$A$10)=0,\"\",SUMIFS($B13:$B20003,$C13:$C20003,J40,$E13:$E20003,$A$10))","v":""},{"$f":"IF(SUMIFS($D13:$D20003,$C13:$C20003,J40,$E13:$E20003,$A$10)=0,\"\",SUMIFS($D13:$D20003,$C13:$C20003,J40,$E13:$E20003,$A$10))","v":""}]
{"$rows_left_out":16}
{"sheet":"data","index":5,"n_rows":45,"n_cols":16,"rows_kept":45,"cut":false,"hidden":false,"merged":[]}
["لحوم","وجبات","سندوتش","تيك أوي","فراخ","كمالة",null,"لحوم","كيلو",null,"صنف","سعر",null,"كيلو كباب","لحم",1]
["كيلو كباب","وجبة كباب","صاروخ كفتة صغير","سندوتش صغير","فرخة شيش","م . ص",null,"وجبات","الوجبات",null,"كيلو كباب",250,null,"كيلو ريش","لحم",1]
["كيلو ريش","وجبة مشكل","صاروخ كفتة وسط","سندوتش كبير","ربع فرخة","م . ك",null,"سندوتش","السندوتش",null,"كيلو ريش",280,null,"وجبة كباب","لحم",0.25]
["كيلو مشكل","وجبة كفتة","صاروخ كفتة كبير","سندوتش مشكل صغير","نصف فرخة","كانز",null,"تيك أوي","رغيف",null,"كيلو مشكل",200,null,"كيلو موزة ضاني","لحم",1]
["كيلو كفتة","وجبة طرب","صاروخ طرب","سندوتش مشكل كبير","وجبة بانيه","رز صغير",null,"فراخ","الفراخ",null,"كيلو كفتة",150,null,"كيلو كفتة","كفتة",1]
["كيلو كبدة ضاني","وجبة كومبو","صاروخ سجق","طلب مشكل صغير","سندوتش بانيه صغير","رز كبير",null,"كمالة","الكمالة",null,"كيلو كبدة ضاني",250,null,"كيلو طرب","كفتة",1]
["كيلو طرب","وجبة كمبلة","حواوشي صغير ","طلب مشكل وسط","سندوتش بانيه وسط","لسان عصفور",null,null,null,null,"كيلو طرب",180,null,"وجبة كفتة","كفتة",0.25]
["كيلو سجق","وجبة الجنة","حواوشي وسط","طلب مشكل كبير","سندوتش بانيه كبير","تسوية وسلطات",null,null,null,null,"كيلو سجق",180,null,"وجبة طرب","كفتة",0.25]
["كيلو موزة ضاني","وجبة اسبشيل","حواوشي كبير",null,null,"تسوية",null,null,null,null,"كيلو موزة ضاني",100,null,"صاروخ كفتة صغير","كفتة",7.0000000000000007E-2]
[null,null,null,null,null,null,null,null,null,null,"وجبة كباب",70,null,"صاروخ كفتة وسط","كفتة",0.1]
[null,null,null,null,null,null,null,null,null,null,"وجبة مشكل",55,null,"صاروخ كفتة كبير","كفتة",0.125]
[null,null,null,null,null,null,null,null,null,null,"وجبة كفتة",45,null,"صاروخ طرب","كفتة",7.0000000000000007E-2]
[null,null,null,null,null,null,null,null,null,null,"وجبة طرب",50,null,"حواوشي صغير ","كفتة",0.1]
[null,null,null,null,null,null,null,null,null,null,"وجبة كومبو",75,null,"حواوشي وسط","كفتة",0.1]
[null,null,null,null,null,null,null,null,null,null,"وجبة كمبلة",85,null,"حواوشي كبير","كفتة",0.1]
[null,null,null,null,null,null,null,null,null,null,"وجبة الجنة",120,null,"كيلو كبدة ضاني","كبدة",1]
[null,null,null,null,null,null,null,null,null,null,"وجبة اسبشيل",85,null,"كيلو سجق","سجق",1]
[null,null,null,null,null,null,null,null,null,null,"صاروخ كفتة صغير",10,null,"صاروخ سجق","سجق",0.1]
[null,null,null,null,{"$f":"70/1000","v":7.0000000000000007E-2},null,null,null,null,null,"صاروخ كفتة وسط",15,null,"فرخة شيش","فراخ",1]
[null,null,null,null,null,null,null,null,null,null,"صاروخ كفتة كبير",20,null,"ربع فرخة","فراخ",0.25]
[null,null,null,null,null,null,null,null,null,null,"صاروخ طرب",25,null,"نصف فرخة","فراخ",0.5]
[null,null,null,null,null,null,null,null,null,null,"صاروخ سجق",25,null,"وجبة بانيه","بانيه"]
[null,null,null,null,null,null,null,null,null,null,"حواوشي صغير ",15,null,"سندوتش بانيه صغير","بانيه",1]
[null,null,null,null,null,null,null,null,null,null,"حواوشي وسط",20,null,"سندوتش بانيه وسط","بانيه"]
[null,null,null,null,null,null,null,null,null,null,"حواوشي كبير",25,null,"سندوتش بانيه كبير","بانيه"]
[null,null,null,null,null,null,null,null,null,null,"سندوتش صغير",5,null,"سندوتش صغير","رغيف",1]
[null,null,null,null,null,null,null,null,null,null,"سندوتش كبير",10,null,"سندوتش كبير","رغيف"]
[null,null,null,null,null,null,null,null,null,null,"سندوتش مشكل صغير",10,null,"سندوتش مشكل صغير","رغيف",1]
[null,null,null,null,null,null,null,null,null,null,"سندوتش مشكل كبير",15,null,"سندوتش مشكل كبير","رغيف",2]
[null,null,null,null,null,null,null,null,null,null,"طلب مشكل صغير",25,null,"طلب مشكل صغير","رغيف",4]
[null,null,null,null,null,null,null,null,null,null,"طلب مشكل وسط",30,null,"طلب مشكل وسط","رغيف",5]
[null,null,null,null,null,null,null,null,null,null,"طلب مشكل كبير",35,null,"طلب مشكل كبير","رغيف",7]
[null,null,null,null,null,null,null,null,null,null,"ربع فرخة",25]
[null,null,null,null,null,null,null,null,null,null,"نصف فرخة",50]
[null,null,null,null,null,null,null,null,null,null,"وجبة بانيه"]
[null,null,null,null,null,null,null,null,null,null,"سندوتش بانيه صغير",10]
[null,null,null,null,null,null,null,null,null,null,"سندوتش بانيه وسط",15]
[null,null,null,null,null,null,null,null,null,null,"سندوتش بانيه كبير",20]
[null,null,null,null,null,null,null,null,null,null,"م . ص",5]
[null,null,null,null,null,null,null,null,null,null,"م . ك",7]
{"$rows_left_out":6}
{"sheet":"Sheet1","index":6,"n_rows":0,"n_cols":0,"rows_kept":0,"cut":false,"hidden":false,"merged":[]}

{"sheet":"Sheet2","index":7,"n_rows":1,"n_cols":1,"rows_kept":1,"cut":false,"hidden":true,"merged":[]}
["احمد "]