{"text_format":"1","workbook":"xlsx","n_sheets":3,"sheets":["Mapping","Africa","Europe"],"not_rendered":{"charts":0,"images":0,"macros":0,"external_links":0,"defined_names":0,"comments":0,"pivot_tables":0},"unopened":[],"bounds":{"document_bytes":16777216,"sheet_cells":100000,"rows_first":2000,"rows_last":500,"rows_between":2000,"halvings":0,"cell_chars":16384,"cell_head_chars":4096},"cells_cut":0,"cells_raw":0,"read":"whole","date_system":"1900"}

{"sheet":"Mapping","index":0,"n_rows":191,"n_cols":6,"rows_kept":191,"cut":false,"hidden":false,"merged":[]}
["Country Name","Region","Sales","Rank",null,"Regions"]
["ITALY","EUROPE",4917.9530000000004,1,null,"ASIA"]
["UNITED KINGDOM","EUROPE",3926.9630000000002,2,null,"EUROPE"]
["SPAIN","EUROPE",3326.0070000000001,3,null,"AFRICA"]
["USA","USA",3283.1790000000001,4,null,"NORTH AMERICA"]
["FRANCE","EUROPE",2796.8820000000001,5,null,"LATIN AMERICA"]
["KENYA","AFRICA",2433.06,6,null,"GCC AND LEVANT"]
["TURKEY","TURKEY",2049.31,7,null,"ISC"]
["SYRIA","GCC AND LEVANT",1340.809,8,null,"TURKEY"]
["GERMANY","EUROPE",1254.5730000000001,9,null,"USA"]
["HUNGARY","EUROPE",1232.925,10]
["MOROCCO","AFRICA",1178.2670000000001,11]
["RUSSIA","EUROPE",1020.45,12]
["INDIA","ISC",827.74699999999996,13]
["SAUDI ARABIA","GCC AND LEVANT",816.72199999999998,14]
["SUDAN","AFRICA",809.56600000000003,15]
["ZIMBABWE","AFRICA",504.04399999999998,16]
["UKRAIN","EUROPE",427.96199999999999,17]
["UGANDA","AFRICA",418.08600000000001,18]
["LEBANON","GCC AND LEVANT",412.88900000000001,19]
["BELGIUM","EUROPE",398.65100000000001,20]
["PORTUGAL","EUROPE",390.23399999999998,21]
["POLAND","EUROPE",325.12200000000001,22]
["NETHERLANDS","EUROPE",316.262,23]
["LIBYA","AFRICA",293.77300000000002,24]
["PALESTINE","GCC AND LEVANT",258.42399999999998,25]
["FINLAND","EUROPE",218.45400000000001,26]
["TUNISIA","AFRICA",212.24100000000001,27]
["ALGERIA","AFRICA",208.196,28]
["ETHIOPIA","AFRICA",194.70699999999999,29]
["IRELAND","EUROPE",164.42099999999999,30]
["THAILAND","ASIA",161.62299999999999,31]
["ZAMBIA","AFRICA",157.23400000000001,32]
["GREECE","EUROPE",125.652,33]
["SLOVAKIA","EUROPE",110.748,34]
["ROMANIA","EUROPE",103.872,35]
["CROATIA","EUROPE",88.120999999999995,36]
["NIGERIA","AFRICA",88.028000000000006,37]
["DEMOCRATIC REPUBLIC OF CONGO","AFRICA",84.671000000000006,38]
["COTE D'IVOIRE","AFRICA",83.361999999999995,39]
["BULGARIA","EUROPE",81.384,40]
["MOZAMBIQUE","AFRICA",75.364999999999995,41]
["ESTONIA","EUROPE",70.998000000000005,42]
["LITHUANIA","EUROPE",68.176000000000002,43]
["LUXEMBOURG","EUROPE",61.991,44]
["UAE","GCC AND LEVANT",59.863,45]
["JORDAN","GCC AND LEVANT",58.323,46]
["ARGENTINA","LATIN AMERICA",50.847999999999999,47]
["SOUTH AFRICA","AFRICA",49.793999999999997,48]
["INDONESIA","ASIA",48.033000000000001,49]
["SWEDEN","EUROPE",46.003,50]
["CAMEROON","AFRICA",43.442999999999998,51]
["ERITREA","AFRICA",40.823,52]
["JAMAICA","NORTH AMERICA",38.966000000000001,53]
["GHANA","AFRICA",38.408999999999999,54]
["SENEGAL","AFRICA",36.734999999999999,55]
["ANGOLA","AFRICA",35.841000000000001,56]
["DENMARK","EUROPE",32.302999999999997,57]
["CYPRUS","EUROPE",23.619,58]
["GUINEA","AFRICA",23.483000000000001,59]
["SAN MARINO","EUROPE",23.471,60]
["KAZAKHSTAN","ASIA",22,61]
["KUWAIT","GCC AND LEVANT",21.515999999999998,62]
["AUSTRIA","EUROPE",21.297999999999998,63]
["COSTA RICA","NORTH AMERICA",19,64]
["BAHRAIN","GCC AND LEVANT",17,65]
["MAURITIUS","AFRICA",17,66]
["BENIN","AFRICA",14.115,67]
["TOGO","AFRICA",13.411,68]
["SOMALIA","AFRICA",13,69]
["GEORGIA","EUROPE",12,70]
["ECUADOR","LATIN AMERICA",10.94,71]
["BELARUS","EUROPE",0.68600000000000005,72]
["MALTA","EUROPE",0.06,73]
["SOUTH KOREA","ASIA",0.03,74]
["ALBANIA","EUROPE",0,75]
["ANDORRA","EUROPE",0,76]
["ANGUILLA","NORTH AMERICA",0,77]
["ANTIGUA AND BARBUDA","NORTH AMERICA",0,78]
["ARMENIA","EUROPE",0,79]
["ARUBA","NORTH AMERICA",0,80]
["Australia","ASIA",0,81]
["AZERBAIJAN","EUROPE",0,82]
["BAHAMAS","NORTH AMERICA",0,83]
["BANGLADESH","ISC",0,84]
["BARBADOS","NORTH AMERICA",0,85]
["BELIZE","NORTH AMERICA",0,86]
["BHUTAN","ASIA",0,87]
["BOLIVIA","LATIN AMERICA",0,88]
["BOSNIA AND HERZEGOVINA","EUROPE",0,89]
["BOTSWANA","AFRICA",0,90]
["BRAZIL","LATIN AMERICA",0,91]
["BURKINA FASO","AFRICA",0,92]
["BURUNDI","AFRICA",0,93]
["CABO VERDE","AFRICA",0,94]
["CAMBODIA","ASIA",0,95]
["CANADA","NORTH AMERICA",0,96]
["CENTRAL AFRICAN REPUBLIC","AFRICA",0,97]
["CHAD","AFRICA",0,98]
["CHILE","LATIN AMERICA",0,99]
["CHINA","ASIA",0,100]
["COLOMBIA","LATIN AMERICA",0,101]
["CONGO","AFRICA",0,102]
["CUBA","LATIN AMERICA",0,103]
["CURAÇAO","LATIN AMERICA",0,104]
["CZECH REPUBLIC","EUROPE",0,105]
["DJIBOUTI","AFRICA",0,106]
["DOMINICA","NORTH AMERICA",0,107]
["DOMINICAN REPUBLIC","NORTH AMERICA",0,108]
["EL SALVADOR","LATIN AMERICA",0,109]
["ESWATINI","AFRICA",0,110]
["GABON","AFRICA",0,111]
["GAMBIA","AFRICA",0,112]
["GRENADA","NORTH AMERICA",0,113]
["GUATEMALA","NORTH AMERICA",0,114]
["GUINEA-BISSAU","AFRICA",0,115]
["GUYANA","NORTH AMERICA",0,116]
["HAITI","NORTH AMERICA",0,117]
["HONDURAS","NORTH AMERICA",0,118]
["HONG KONG","ASIA",0,119]
["ICELAND","EUROPE",0,120]
["IRAN","ASIA",0,121]
["IRAQ","GCC AND LEVANT",0,122]
["ISRAEL","EUROPE",0,123]
["JAPAN","ASIA",0,124]
["KYRGYZSTAN","ASIA",0,125]
["LATVIA","EUROPE",0,126]
["LESOTHO","AFRICA",0,127]
["LIBERIA","AFRICA",0,128]
["LIECHTENSTEIN","EUROPE",0,129]
["MACAO","ASIA",0,130]
["MACEDONIA","EUROPE",0,131]
["MADAGASCAR","AFRICA",0,132]
["MALAWI","AFRICA",0,133]
["MALAYSIA","ASIA",0,134]
["MALDIVES","ASIA",0,135]
["MALI","AFRICA",0,136]
["MAURITANIA","AFRICA",0,137]
["MEXICO","LATIN AMERICA",0,138]
["MOLDOVA","EUROPE",0,139]
["MONGOLIA","ISC",0,140]
["MONTENEGRO","EUROPE",0,141]
["MONTSERRAT","NORTH AMERICA",0,142]
["MYANMAR","ASIA",0,143]
["NAMIBIA","AFRICA",0,144]
["NEPAL","ASIA",0,145]
["NEW ZEALAND","ASIA",0,146]
["NICARAGUA","NORTH AMERICA",0,147]
["NIGER","AFRICA",0,148]
["NORTH KOREA","ASIA",0,149]
["NORWAY","EUROPE",0,150]
["OMAN","GCC AND LEVANT",0,151]
["PAKISTAN","ISC",0,152]
["PANAMA","NORTH AMERICA",0,153]
["PARAGUAY","LATIN AMERICA",0,154]
["PERU","LATIN AMERICA",0,155]
["PHILIPPINES","ASIA",0,156]
["PUERTO RICO","NORTH AMERICA",0,157]
["QATAR","GCC AND LEVANT",0,158]
["RWANDA","AFRICA",0,159]
["SERBIA ","EUROPE",0,160]
["SEYCHELLES","AFRICA",0,161]
["SIERRA LEONE","AFRICA",0,162]
["SINGAPORE","ASIA",0,163]
["SLOVENIA","EUROPE",0,164]
["SOUTH SUDAN","AFRICA",0,165]
["SRI LANKA","ASIA",0,166]
["SURINAME","AFRICA",0,167]
["SWITZERLAND","EUROPE",0,168]
["TAIWAN","ASIA",0,169]
["TAJIKISTAN","ASIA",0,170]
["TANZANIA","AFRICA",0,171]
["TRINIDAD AND TOBAGO","LATIN AMERICA",0,172]
["URUGUAY","LATIN AMERICA",0,173]
["UZBEKISTAN","ASIA",0,174]
["VENEZUELA","LATIN AMERICA",0,175]
["VIET NAM","ASIA",0,176]
["YEMEN","GCC AND LEVANT",0,177]
[null,null,null,177]
[]
[]
[null,"Regions"]
[null,"ASIA"]
[null,"EUROPE"]
[null,"AFRICA"]
[null,"NORTH AMERICA"]
[null,"LATIN AMERICA"]
[null,"GCC AND LEVANT"]
[null,"ISC"]
[null,"TURKEY"]
[null,"USA"]

{"sheet":"Africa","index":1,"n_rows":61,"n_cols":8,"rows_kept":61,"cut":false,"hidden":false,"merged":[]}
["May"]
["YTD",null,null,null,null,null,null,{"$f":"IFERROR(INDEX(Mapping!$A$2:$A$178,MATCH(LARGE(IF($A$4=Mapping!$B$2:$B$178,COUNTIF(Mapping!$A$2:$A$178,\"<\"&Mapping!$A$2:$A$178),\"\"),ROW(A1)),IF($A$4=Mapping!$B$2:$B$178,COUNTIF(Mapping!$A$2:$A$178,\"<\"&Mapping!$A$2:$A$178),\"\"),0)),\"\")","v":"ZIMBABWE"}]
[2020]
["AFRICA"]
["Country"]
[{"$f":"IFERROR(INDEX(Mapping!$A$2:$A$178,SMALL(IF(Mapping!$B$2:$B$178=$A$4,ROW(A$2:A$178)-ROW(A$2)+1),ROWS($A$6:A6))),\"\")","v":"KENYA"}]
[{"$f":"IFERROR(INDEX(Mapping!$A$2:$A$178,SMALL(IF(Mapping!$B$2:$B$178=$A$4,ROW(A$2:A$178)-ROW(A$2)+1),ROWS($A$6:A7))),\"\")","v":"MOROCCO"}]
[{"$f":"IFERROR(INDEX(Mapping!$A$2:$A$178,SMALL(IF(Mapping!$B$2:$B$178=$A$4,ROW(A$2:A$178)-ROW(A$2)+1),ROWS($A$6:A8))),\"\")","v":"SUDAN"}]
[{"$f":"IFERROR(INDEX(Mapping!$A$2:$A$178,SMALL(IF(Mapping!$B$2:$B$178=$A$4,ROW(A$2:A$178)-ROW(A$2)+1),ROWS($A$6:A9))),\"\")","v":"ZIMBABWE"}]
[{"$f":"IFERROR(INDEX(Mapping!$A$2:$A$178,SMALL(IF(Mapping!$B$2:$B$178=$A$4,ROW(A$2:A$178)-ROW(A$2)+1),ROWS($A$6:A10))),\"\")","v":"UGANDA"}]
[{"$f":"IFERROR(INDEX(Mapping!$A$2:$A$178,SMALL(IF(Mapping!$B$2:$B$178=$A$4,ROW(A$2:A$178)-ROW(A$2)+1),ROWS($A$6:A11))),\"\")","v":"LIBYA"}]
[{"$f":"IFERROR(INDEX(Mapping!$A$2:$A$178,SMALL(IF(Mapping!$B$2:$B$178=$A$4,ROW(A$2:A$178)-ROW(A$2)+1),ROWS($A$6:A12))),\"\")","v":"TUNISIA"}]
[{"$f":"IFERROR(INDEX(Mapping!$A$2:$A$178,SMALL(IF(Mapping!$B$2:$B$178=$A$4,ROW(A$2:A$178)-ROW(A$2)+1),ROWS($A$6:A13))),\"\")","v":"ALGERIA"}]
[{"$f":"IFERROR(INDEX(Mapping!$A$2:$A$178,SMALL(IF(Mapping!$B$2:$B$178=$A$4,ROW(A$2:A$178)-ROW(A$2)+1),ROWS($A$6:A14))),\"\")","v":"ETHIOPIA"}]
[{"$f":"IFERROR(INDEX(Mapping!$A$2:$A$178,SMALL(IF(Mapping!$B$2:$B$178=$A$4,ROW(A$2:A$178)-ROW(A$2)+1),ROWS($A$6:A15))),\"\")","v":"ZAMBIA"}]
[{"$f":"IFERROR(INDEX(Mapping!$A$2:$A$178,SMALL(IF(Mapping!$B$2:$B$178=$A$4,ROW(A$2:A$178)-ROW(A$2)+1),ROWS($A$6:A16))),\"\")","v":"NIGERIA"}]
[{"$f":"IFERROR(INDEX(Mapping!$A$2:$A$178,SMALL(IF(Mapping!$B$2:$B$178=$A$4,ROW(A$2:A$178)-ROW(A$2)+1),ROWS($A$6:A17))),\"\")","v":"DEMOCRATIC REPUBLIC OF CONGO"}]
[{"$f":"IFERROR(INDEX(Mapping!$A$2:$A$178,SMALL(IF(Mapping!$B$2:$B$178=$A$4,ROW(A$2:A$178)-ROW(A$2)+1),ROWS($A$6:A18))),\"\")","v":"COTE D'IVOIRE"}]
[{"$f":"IFERROR(INDEX(Mapping!$A$2:$A$178,SMALL(IF(Mapping!$B$2:$B$178=$A$4,ROW(A$2:A$178)-ROW(A$2)+1),ROWS($A$6:A19))),\"\")","v":"MOZAMBIQUE"}]
[{"$f":"IFERROR(INDEX(Mapping!$A$2:$A$178,SMALL(IF(Mapping!$B$2:$B$178=$A$4,ROW(A$2:A$178)-ROW(A$2)+1),ROWS($A$6:A20))),\"\")","v":"SOUTH AFRICA"}]
[{"$f":"IFERROR(INDEX(Mapping!$A$2:$A$178,SMALL(IF(Mapping!$B$2:$B$178=$A$4,ROW(A$2:A$178)-ROW(A$2)+1),ROWS($A$6:A21))),\"\")","v":"CAMEROON"}]
[{"$f":"IFERROR(INDEX(Mapping!$A$2:$A$178,SMALL(IF(Mapping!$B$2:$B$178=$A$4,ROW(A$2:A$178)-ROW(A$2)+1),ROWS($A$6:A22))),\"\")","v":"ERITREA"}]
[{"$f":"IFERROR(INDEX(Mapping!$A$2:$A$178,SMALL(IF(Mapping!$B$2:$B$178=$A$4,ROW(A$2:A$178)-ROW(A$2)+1),ROWS($A$6:A23))),\"\")","v":"GHANA"}]
[{"$f":"IFERROR(INDEX(Mapping!$A$2:$A$178,SMALL(IF(Mapping!$B$2:$B$178=$A$4,ROW(A$2:A$178)-ROW(A$2)+1),ROWS($A$6:A24))),\"\")","v":"SENEGAL"}]
[{"$f":"IFERROR(INDEX(Mapping!$A$2:$A$178,SMALL(IF(Mapping!$B$2:$B$178=$A$4,ROW(A$2:A$178)-ROW(A$2)+1),ROWS($A$6:A25))),\"\")","v":"ANGOLA"}]
[{"$f":"IFERROR(INDEX(Mapping!$A$2:$A$178,SMALL(IF(Mapping!$B$2:$B$178=$A$4,ROW(A$2:A$178)-ROW(A$2)+1),ROWS($A$6:A26))),\"\")","v":"GUINEA"}]
[{"$f":"IFERROR(INDEX(Mapping!$A$2:$A$178,SMALL(IF(Mapping!$B$2:$B$178=$A$4,ROW(A$2:A$178)-ROW(A$2)+1),ROWS($A$6:A27))),\"\")","v":"MAURITIUS"}]
[{"$f":"IFERROR(INDEX(Mapping!$A$2:$A$178,SMALL(IF(Mapping!$B$2:$B$178=$A$4,ROW(A$2:A$178)-ROW(A$2)+1),ROWS($A$6:A28))),\"\")","v":"BENIN"}]
[{"$f":"IFERROR(INDEX(Mapping!$A$2:$A$178,SMALL(IF(Mapping!$B$2:$B$178=$A$4,ROW(A$2:A$178)-ROW(A$2)+1),ROWS($A$6:A29))),\"\")","v":"TOGO"}]
[{"$f":"IFERROR(INDEX(Mapping!$A$2:$A$178,SMALL(IF(Mapping!$B$2:$B$178=$A$4,ROW(A$2:A$178)-ROW(A$2)+1),ROWS($A$6:A30))),\"\")","v":"SOMALIA"}]
[{"$f":"IFERROR(INDEX(Mapping!$A$2:$A$178,SMALL(IF(Mapping!$B$2:$B$178=$A$4,ROW(A$2:A$178)-ROW(A$2)+1),ROWS($A$6:A31))),\"\")","v":"BOTSWANA"}]
[{"$f":"IFERROR(INDEX(Mapping!$A$2:$A$178,SMALL(IF(Mapping!$B$2:$B$178=$A$4,ROW(A$2:A$178)-ROW(A$2)+1),ROWS($A$6:A32))),\"\")","v":"BURKINA FASO"}]
[{"$f":"IFERROR(INDEX(Mapping!$A$2:$A$178,SMALL(IF(Mapping!$B$2:$B$178=$A$4,ROW(A$2:A$178)-ROW(A$2)+1),ROWS($A$6:A33))),\"\")","v":"BURUNDI"}]
[{"$f":"IFERROR(INDEX(Mapping!$A$2:$A$178,SMALL(IF(Mapping!$B$2:$B$178=$A$4,ROW(A$2:A$178)-ROW(A$2)+1),ROWS($A$6:A34))),\"\")","v":"CABO VERDE"}]
[{"$f":"IFERROR(INDEX(Mapping!$A$2:$A$178,SMALL(IF(Mapping!$B$2:$B$178=$A$4,ROW(A$2:A$178)-ROW(A$2)+1),ROWS($A$6:A35))),\"\")","v":"CENTRAL AFRICAN REPUBLIC"}]
[{"$f":"IFERROR(INDEX(Mapping!$A$2:$A$178,SMALL(IF(Mapping!$B$2:$B$178=$A$4,ROW(A$2:A$178)-ROW(A$2)+1),ROWS($A$6:A36))),\"\")","v":"CHAD"}]
[{"$f":"IFERROR(INDEX(Mapping!$A$2:$A$178,SMALL(IF(Mapping!$B$2:$B$178=$A$4,ROW(A$2:A$178)-ROW(A$2)+1),ROWS($A$6:A37))),\"\")","v":"CONGO"}]
[{"$f":"IFERROR(INDEX(Mapping!$A$2:$A$178,SMALL(IF(Mapping!$B$2:$B$178=$A$4,ROW(A$2:A$178)-ROW(A$2)+1),ROWS($A$6:A38))),\"\")","v":"DJIBOUTI"}]
[{"$f":"IFERROR(INDEX(Mapping!$A$2:$A$178,SMALL(IF(Mapping!$B$2:$B$178=$A$4,ROW(A$2:A$178)-ROW(A$2)+1),ROWS($A$6:A39))),\"\")","v":"ESWATINI"}]
[{"$f":"IFERROR(INDEX(Mapping!$A$2:$A$178,SMALL(IF(Mapping!$B$2:$B$178=$A$4,ROW(A$2:A$178)-ROW(A$2)+1),ROWS($A$6:A40))),\"\")","v":"GABON"}]
[{"$f":"IFERROR(INDEX(Mapping!$A$2:$A$178,SMALL(IF(Mapping!$B$2:$B$178=$A$4,ROW(A$2:A$178)-ROW(A$2)+1),ROWS($A$6:A41))),\"\")","v":"GAMBIA"}]
[{"$f":"IFERROR(INDEX(Mapping!$A$2:$A$178,SMALL(IF(Mapping!$B$2:$B$178=$A$4,ROW(A$2:A$178)-ROW(A$2)+1),ROWS($A$6:A42))),\"\")","v":"GUINEA-BISSAU"}]
[{"$f":"IFERROR(INDEX(Mapping!$A$2:$A$178,SMALL(IF(Mapping!$B$2:$B$178=$A$4,ROW(A$2:A$178)-ROW(A$2)+1),ROWS($A$6:A43))),\"\")","v":"LESOTHO"}]
[{"$f":"IFERROR(INDEX(Mapping!$A$2:$A$178,SMALL(IF(Mapping!$B$2:$B$178=$A$4,ROW(A$2:A$178)-ROW(A$2)+1),ROWS($A$6:A44))),\"\")","v":"LIBERIA"}]
[{"$f":"IFERROR(INDEX(Mapping!$A$2:$A$178,SMALL(IF(Mapping!$B$2:$B$178=$A$4,ROW(A$2:A$178)-ROW(A$2)+1),ROWS($A$6:A45))),\"\")","v":"MADAGASCAR"}]
[{"$f":"IFERROR(INDEX(Mapping!$A$2:$A$178,SMALL(IF(Mapping!$B$2:$B$178=$A$4,ROW(A$2:A$178)-ROW(A$2)+1),ROWS($A$6:A46))),\"\")","v":"MALAWI"}]
[{"$f":"IFERROR(INDEX(Mapping!$A$2:$A$178,SMALL(IF(Mapping!$B$2:$B$178=$A$4,ROW(A$2:A$178)-ROW(A$2)+1),ROWS($A$6:A47))),\"\")","v":"MALI"}]
[{"$f":"IFERROR(INDEX(Mapping!$A$2:$A$178,SMALL(IF(Mapping!$B$2:$B$178=$A$4,ROW(A$2:A$178)-ROW(A$2)+1),ROWS($A$6:A48))),\"\")","v":"MAURITANIA"}]
[{"$f":"IFERROR(INDEX(Mapping!$A$2:$A$178,SMALL(IF(Mapping!$B$2:$B$178=$A$4,ROW(A$2:A$178)-ROW(A$2)+1),ROWS($A$6:A49))),\"\")","v":"NAMIBIA"}]
[{"$f":"IFERROR(INDEX(Mapping!$A$2:$A$178,SMALL(IF(Mapping!$B$2:$B$178=$A$4,ROW(A$2:A$178)-ROW(A$2)+1),ROWS($A$6:A50))),\"\")","v":"NIGER"}]
[{"$f":"IFERROR(INDEX(Mapping!$A$2:$A$178,SMALL(IF(Mapping!$B$2:$B$178=$A$4,ROW(A$2:A$178)-ROW(A$2)+1),ROWS($A$6:A51))),\"\")","v":"RWANDA"}]
[{"$f":"IFERROR(INDEX(Mapping!$A$2:$A$178,SMALL(IF(Mapping!$B$2:$B$178=$A$4,ROW(A$2:A$178)-ROW(A$2)+1),ROWS($A$6:A52))),\"\")","v":"SEYCHELLES"}]
[{"$f":"IFERROR(INDEX(Mapping!$A$2:$A$178,SMALL(IF(Mapping!$B$2:$B$178=$A$4,ROW(A$2:A$178)-ROW(A$2)+1),ROWS($A$6:A53))),\"\")","v":"SIERRA LEONE"}]
[{"$f":"IFERROR(INDEX(Mapping!$A$2:$A$178,SMALL(IF(Mapping!$B$2:$B$178=$A$4,ROW(A$2:A$178)-ROW(A$2)+1),ROWS($A$6:A54))),\"\")","v":"SOUTH SUDAN"}]
[{"$f":"IFERROR(INDEX(Mapping!$A$2:$A$178,SMALL(IF(Mapping!$B$2:$B$178=$A$4,ROW(A$2:A$178)-ROW(A$2)+1),ROWS($A$6:A55))),\"\")","v":"SURINAME"}]
[{"$f":"IFERROR(INDEX(Mapping!$A$2:$A$178,SMALL(IF(Mapping!$B$2:$B$178=$A$4,ROW(A$2:A$178)-ROW(A$2)+1),ROWS($A$6:A56))),\"\")","v":"TANZANIA"}]
[{"$f":"IFERROR(INDEX(Mapping!$A$2:$A$178,SMALL(IF(Mapping!$B$2:$B$178=$A$4,ROW(A$2:A$178)-ROW(A$2)+1),ROWS($A$6:A57))),\"\")","v":""}]
[{"$f":"IFERROR(INDEX(Mapping!$A$2:$A$178,SMALL(IF(Mapping!$B$2:$B$178=$A$4,ROW(A$2:A$178)-ROW(A$2)+1),ROWS($A$6:A58))),\"\")","v":""}]
[{"$f":"IFERROR(INDEX(Mapping!$A$2:$A$178,SMALL(IF(Mapping!$B$2:$B$178=$A$4,ROW(A$2:A$178)-ROW(A$2)+1),ROWS($A$6:A59))),\"\")","v":""}]
[{"$f":"IFERROR(INDEX(Mapping!$A$2:$A$178,SMALL(IF(Mapping!$B$2:$B$178=$A$4,ROW(A$2:A$178)-ROW(A$2)+1),ROWS($A$6:A60))),\"\")","v":""}]
[{"$f":"IFERROR(INDEX(Mapping!$A$2:$A$178,SMALL(IF(Mapping!$B$2:$B$178=$A$4,ROW(A$2:A$178)-ROW(A$2)+1),ROWS($A$6:A61))),\"\")","v":""}]

{"sheet":"Europe","index":2,"n_rows":59,"n_cols":1,"rows_kept":59,"cut":false,"hidden":false,"merged":[]}
["May"]
["YTD"]
[2020]
["Europe"]
["Country"]
[{"$f":"IFERROR(INDEX(Mapping!$A$2:$A$178,SMALL(IF(Mapping!$B$2:$B$178=$A$4,ROW(A$2:A$178)-ROW(A$2)+1),ROWS($A$6:A6))),\"\")","v":"ITALY"}]
[{"$f":"IFERROR(INDEX(Mapping!$A$2:$A$178,SMALL(IF(Mapping!$B$2:$B$178=$A$4,ROW(A$2:A$178)-ROW(A$2)+1),ROWS($A$6:A7))),\"\")","v":"UNITED KINGDOM"}]
[{"$f":"IFERROR(INDEX(Mapping!$A$2:$A$178,SMALL(IF(Mapping!$B$2:$B$178=$A$4,ROW(A$2:A$178)-ROW(A$2)+1),ROWS($A$6:A8))),\"\")","v":"SPAIN"}]
[{"$f":"IFERROR(INDEX(Mapping!$A$2:$A$178,SMALL(IF(Mapping!$B$2:$B$178=$A$4,ROW(A$2:A$178)-ROW(A$2)+1),ROWS($A$6:A9))),\"\")","v":"FRANCE"}]
[{"$f":"IFERROR(INDEX(Mapping!$A$2:$A$178,SMALL(IF(Mapping!$B$2:$B$178=$A$4,ROW(A$2:A$178)-ROW(A$2)+1),ROWS($A$6:A10))),\"\")","v":"GERMANY"}]
[{"$f":"IFERROR(INDEX(Mapping!$A$2:$A$178,SMALL(IF(Mapping!$B$2:$B$178=$A$4,ROW(A$2:A$178)-ROW(A$2)+1),ROWS($A$6:A11))),\"\")","v":"HUNGARY"}]
[{"$f":"IFERROR(INDEX(Mapping!$A$2:$A$178,SMALL(IF(Mapping!$B$2:$B$178=$A$4,ROW(A$2:A$178)-ROW(A$2)+1),ROWS($A$6:A12))),\"\")","v":"RUSSIA"}]
[{"$f":"IFERROR(INDEX(Mapping!$A$2:$A$178,SMALL(IF(Mapping!$B$2:$B$178=$A$4,ROW(A$2:A$178)-ROW(A$2)+1),ROWS($A$6:A13))),\"\")","v":"UKRAIN"}]
[{"$f":"IFERROR(INDEX(Mapping!$A$2:$A$178,SMALL(IF(Mapping!$B$2:$B$178=$A$4,ROW(A$2:A$178)-ROW(A$2)+1),ROWS($A$6:A14))),\"\")","v":"BELGIUM"}]
[{"$f":"IFERROR(INDEX(Mapping!$A$2:$A$178,SMALL(IF(Mapping!$B$2:$B$178=$A$4,ROW(A$2:A$178)-ROW(A$2)+1),ROWS($A$6:A15))),\"\")","v":"PORTUGAL"}]
[{"$f":"IFERROR(INDEX(Mapping!$A$2:$A$178,SMALL(IF(Mapping!$B$2:$B$178=$A$4,ROW(A$2:A$178)-ROW(A$2)+1),ROWS($A$6:A16))),\"\")","v":"POLAND"}]
[{"$f":"IFERROR(INDEX(Mapping!$A$2:$A$178,SMALL(IF(Mapping!$B$2:$B$178=$A$4,ROW(A$2:A$178)-ROW(A$2)+1),ROWS($A$6:A17))),\"\")","v":"NETHERLANDS"}]
[{"$f":"IFERROR(INDEX(Mapping!$A$2:$A$178,SMALL(IF(Mapping!$B$2:$B$178=$A$4,ROW(A$2:A$178)-ROW(A$2)+1),ROWS($A$6:A18))),\"\")","v":"FINLAND"}]
[{"$f":"IFERROR(INDEX(Mapping!$A$2:$A$178,SMALL(IF(Mapping!$B$2:$B$178=$A$4,ROW(A$2:A$178)-ROW(A$2)+1),ROWS($A$6:A19))),\"\")","v":"IRELAND"}]
[{"$f":"IFERROR(INDEX(Mapping!$A$2:$A$178,SMALL(IF(Mapping!$B$2:$B$178=$A$4,ROW(A$2:A$178)-ROW(A$2)+1),ROWS($A$6:A20))),\"\")","v":"GREECE"}]
[{"$f":"IFERROR(INDEX(Mapping!$A$2:$A$178,SMALL(IF(Mapping!$B$2:$B$178=$A$4,ROW(A$2:A$178)-ROW(A$2)+1),ROWS($A$6:A21))),\"\")","v":"SLOVAKIA"}]
[{"$f":"IFERROR(INDEX(Mapping!$A$2:$A$178,SMALL(IF(Mapping!$B$2:$B$178=$A$4,ROW(A$2:A$178)-ROW(A$2)+1),ROWS($A$6:A22))),\"\")","v":"ROMANIA"}]
[{"$f":"IFERROR(INDEX(Mapping!$A$2:$A$178,SMALL(IF(Mapping!$B$2:$B$178=$A$4,ROW(A$2:A$178)-ROW(A$2)+1),ROWS($A$6:A23))),\"\")","v":"CROATIA"}]
[{"$f":"IFERROR(INDEX(Mapping!$A$2:$A$178,SMALL(IF(Mapping!$B$2:$B$178=$A$4,ROW(A$2:A$178)-ROW(A$2)+1),ROWS($A$6:A24))),\"\")","v":"BULGARIA"}]
[{"$f":"IFERROR(INDEX(Mapping!$A$2:$A$178,SMALL(IF(Mapping!$B$2:$B$178=$A$4,ROW(A$2:A$178)-ROW(A$2)+1),ROWS($A$6:A25))),\"\")","v":"ESTONIA"}]
[{"$f":"IFERROR(INDEX(Mapping!$A$2:$A$178,SMALL(IF(Mapping!$B$2:$B$178=$A$4,ROW(A$2:A$178)-ROW(A$2)+1),ROWS($A$6:A26))),\"\")","v":"LITHUANIA"}]
[{"$f":"IFERROR(INDEX(Mapping!$A$2:$A$178,SMALL(IF(Mapping!$B$2:$B$178=$A$4,ROW(A$2:A$178)-ROW(A$2)+1),ROWS($A$6:A27))),\"\")","v":"LUXEMBOURG"}]
[{"$f":"IFERROR(INDEX(Mapping!$A$2:$A$178,SMALL(IF(Mapping!$B$2:$B$178=$A$4,ROW(A$2:A$178)-ROW(A$2)+1),ROWS($A$6:A28))),\"\")","v":"SWEDEN"}]
[{"$f":"IFERROR(INDEX(Mapping!$A$2:$A$178,SMALL(IF(Mapping!$B$2:$B$178=$A$4,ROW(A$2:A$178)-ROW(A$2)+1),ROWS($A$6:A29))),\"\")","v":"DENMARK"}]
[{"$f":"IFERROR(INDEX(Mapping!$A$2:$A$178,SMALL(IF(Mapping!$B$2:$B$178=$A$4,ROW(A$2:A$178)-ROW(A$2)+1),ROWS($A$6:A30))),\"\")","v":"CYPRUS"}]
[{"$f":"IFERROR(INDEX(Mapping!$A$2:$A$178,SMALL(IF(Mapping!$B$2:$B$178=$A$4,ROW(A$2:A$178)-ROW(A$2)+1),ROWS($A$6:A31))),\"\")","v":"SAN MARINO"}]
[{"$f":"IFERROR(INDEX(Mapping!$A$2:$A$178,SMALL(IF(Mapping!$B$2:$B$178=$A$4,ROW(A$2:A$178)-ROW(A$2)+1),ROWS($A$6:A32))),\"\")","v":"AUSTRIA"}]
[{"$f":"IFERROR(INDEX(Mapping!$A$2:$A$178,SMALL(IF(Mapping!$B$2:$B$178=$A$4,ROW(A$2:A$178)-ROW(A$2)+1),ROWS($A$6:A33))),\"\")","v":"GEORGIA"}]
[{"$f":"IFERROR(INDEX(Mapping!$A$2:$A$178,SMALL(IF(Mapping!$B$2:$B$178=$A$4,ROW(A$2:A$178)-ROW(A$2)+1),ROWS($A$6:A34))),\"\")","v":"BELARUS"}]
[{"$f":"IFERROR(INDEX(Mapping!$A$2:$A$178,SMALL(IF(Mapping!$B$2:$B$178=$A$4,ROW(A$2:A$178)-ROW(A$2)+1),ROWS($A$6:A35))),\"\")","v":"MALTA"}]
[{"$f":"IFERROR(INDEX(Mapping!$A$2:$A$178,SMALL(IF(Mapping!$B$2:$B$178=$A$4,ROW(A$2:A$178)-ROW(A$2)+1),ROWS($A$6:A36))),\"\")","v":"ALBANIA"}]
[{"$f":"IFERROR(INDEX(Mapping!$A$2:$A$178,SMALL(IF(Mapping!$B$2:$B$178=$A$4,ROW(A$2:A$178)-ROW(A$2)+1),ROWS($A$6:A37))),\"\")","v":"ANDORRA"}]
[{"$f":"IFERROR(INDEX(Mapping!$A$2:$A$178,SMALL(IF(Mapping!$B$2:$B$178=$A$4,ROW(A$2:A$178)-ROW(A$2)+1),ROWS($A$6:A38))),\"\")","v":"ARMENIA"}]
[{"$f":"IFERROR(INDEX(Mapping!$A$2:$A$178,SMALL(IF(Mapping!$B$2:$B$178=$A$4,ROW(A$2:A$178)-ROW(A$2)+1),ROWS($A$6:A39))),\"\")","v":"AZERBAIJAN"}]
[{"$f":"IFERROR(INDEX(Mapping!$A$2:$A$178,SMALL(IF(Mapping!$B$2:$B$178=$A$4,ROW(A$2:A$178)-ROW(A$2)+1),ROWS($A$6:A40))),\"\")","v":"BOSNIA AND HERZEGOVINA"}]
[{"$f":"IFERROR(INDEX(Mapping!$A$2:$A$178,SMALL(IF(Mapping!$B$2:$B$178=$A$4,ROW(A$2:A$178)-ROW(A$2)+1),ROWS($A$6:A41))),\"\")","v":"CZECH REPUBLIC"}]
[{"$f":"IFERROR(INDEX(Mapping!$A$2:$A$178,SMALL(IF(Mapping!$B$2:$B$178=$A$4,ROW(A$2:A$178)-ROW(A$2)+1),ROWS($A$6:A42))),\"\")","v":"ICELAND"}]
[{"$f":"IFERROR(INDEX(Mapping!$A$2:$A$178,SMALL(IF(Mapping!$B$2:$B$178=$A$4,ROW(A$2:A$178)-ROW(A$2)+1),ROWS($A$6:A43))),\"\")","v":"ISRAEL"}]
[{"$f":"IFERROR(INDEX(Mapping!$A$2:$A$178,SMALL(IF(Mapping!$B$2:$B$178=$A$4,ROW(A$2:A$178)-ROW(A$2)+1),ROWS($A$6:A44))),\"\")","v":"LATVIA"}]
[{"$f":"IFERROR(INDEX(Mapping!$A$2:$A$178,SMALL(IF(Mapping!$B$2:$B$178=$A$4,ROW(A$2:A$178)-ROW(A$2)+1),ROWS($A$6:A45))),\"\")","v":"LIECHTENSTEIN"}]
[{"$f":"IFERROR(INDEX(Mapping!$A$2:$A$178,SMALL(IF(Mapping!$B$2:$B$178=$A$4,ROW(A$2:A$178)-ROW(A$2)+1),ROWS($A$6:A46))),\"\")","v":"MACEDONIA"}]
[{"$f":"IFERROR(INDEX(Mapping!$A$2:$A$178,SMALL(IF(Mapping!$B$2:$B$178=$A$4,ROW(A$2:A$178)-ROW(A$2)+1),ROWS($A$6:A47))),\"\")","v":"MOLDOVA"}]
[{"$f":"IFERROR(INDEX(Mapping!$A$2:$A$178,SMALL(IF(Mapping!$B$2:$B$178=$A$4,ROW(A$2:A$178)-ROW(A$2)+1),ROWS($A$6:A48))),\"\")","v":"MONTENEGRO"}]
[{"$f":"IFERROR(INDEX(Mapping!$A$2:$A$178,SMALL(IF(Mapping!$B$2:$B$178=$A$4,ROW(A$2:A$178)-ROW(A$2)+1),ROWS($A$6:A49))),\"\")","v":"NORWAY"}]
[{"$f":"IFERROR(INDEX(Mapping!$A$2:$A$178,SMALL(IF(Mapping!$B$2:$B$178=$A$4,ROW(A$2:A$178)-ROW(A$2)+1),ROWS($A$6:A50))),\"\")","v":"SERBIA "}]
[{"$f":"IFERROR(INDEX(Mapping!$A$2:$A$178,SMALL(IF(Mapping!$B$2:$B$178=$A$4,ROW(A$2:A$178)-ROW(A$2)+1),ROWS($A$6:A51))),\"\")","v":"SLOVENIA"}]
[{"$f":"IFERROR(INDEX(Mapping!$A$2:$A$178,SMALL(IF(Mapping!$B$2:$B$178=$A$4,ROW(A$2:A$178)-ROW(A$2)+1),ROWS($A$6:A52))),\"\")","v":"SWITZERLAND"}]
[{"$f":"IFERROR(INDEX(Mapping!$A$2:$A$178,SMALL(IF(Mapping!$B$2:$B$178=$A$4,ROW(A$2:A$178)-ROW(A$2)+1),ROWS($A$6:A53))),\"\")","v":""}]
[{"$f":"IFERROR(INDEX(Mapping!$A$2:$A$178,SMALL(IF(Mapping!$B$2:$B$178=$A$4,ROW(A$2:A$178)-ROW(A$2)+1),ROWS($A$6:A54))),\"\")","v":""}]
[{"$f":"IFERROR(INDEX(Mapping!$A$2:$A$178,SMALL(IF(Mapping!$B$2:$B$178=$A$4,ROW(A$2:A$178)-ROW(A$2)+1),ROWS($A$6:A55))),\"\")","v":""}]
[{"$f":"IFERROR(INDEX(Mapping!$A$2:$A$178,SMALL(IF(Mapping!$B$2:$B$178=$A$4,ROW(A$2:A$178)-ROW(A$2)+1),ROWS($A$6:A56))),\"\")","v":""}]
[{"$f":"IFERROR(INDEX(Mapping!$A$2:$A$178,SMALL(IF(Mapping!$B$2:$B$178=$A$4,ROW(A$2:A$178)-ROW(A$2)+1),ROWS($A$6:A57))),\"\")","v":""}]
[{"$f":"IFERROR(INDEX(Mapping!$A$2:$A$178,SMALL(IF(Mapping!$B$2:$B$178=$A$4,ROW(A$2:A$178)-ROW(A$2)+1),ROWS($A$6:A58))),\"\")","v":""}]
[{"$f":"IFERROR(INDEX(Mapping!$A$2:$A$178,SMALL(IF(Mapping!$B$2:$B$178=$A$4,ROW(A$2:A$178)-ROW(A$2)+1),ROWS($A$6:A59))),\"\")","v":""}]