{"text_format":"1","workbook":"xlsx","n_sheets":19,"sheets":["المواد1","المواد2","المواد3","الاعتماد","Sheet4","Sheet1","Sheet2","Sheet3","الاعتماد1","الاعتماد2","القائمة المطلوبة","الايراد المطلوبة","السحب المطلوب","المعطى المطلوب","المعطى المطلوب (2)","الباقى","المسحوب","المبلغ الصافى","المبلغ الصافى (2)"],"not_rendered":{"charts":0,"images":0,"macros":1,"external_links":0,"defined_names":0,"comments":0,"pivot_tables":0},"unopened":[],"bounds":{"document_bytes":16777216,"sheet_cells":100000,"rows_first":2000,"rows_last":500,"rows_between":2000,"halvings":0,"cell_chars":16384,"cell_head_chars":4096},"cells_cut":0,"cells_raw":0,"read":"whole","date_system":"1900"}

{"sheet":"المواد1","index":0,"n_rows":0,"n_cols":0,"rows_kept":0,"cut":false,"hidden":false,"merged":[]}

{"sheet":"المواد2","index":1,"n_rows":0,"n_cols":0,"rows_kept":0,"cut":false,"hidden":false,"merged":[]}

{"sheet":"المواد3","index":2,"n_rows":0,"n_cols":0,"rows_kept":0,"cut":false,"hidden":false,"merged":[]}

{"sheet":"الاعتماد","index":3,"n_rows":51,"n_cols":17,"rows_kept":51,"cut":false,"hidden":false,"merged":[]}
[null,null,null,null,null,null,"بيع",null,null,"أسماء الشيتات",null,null,null,"بيع","شراء","استقطاع","اختيار"]
[null,null,null,null,null,null,null,null,null,null,null,null,null,"Sheet4","المبلغ الصافى","المعطى المطلوب (2)","الباقى"]
[null,null,null,null,{"$f":"CHOOSE(MATCH($G$1,$N$1:$Q$1,0),\n                  INDEX($N$2:$N$10,MOD(ROWS($A$1:A1)-1,COUNTA($N$2:$N$10))+1),\n                 INDEX($O$2:$O$10,MOD(ROWS($A$1:A1)-1,COUNTA($O$2:$O$10))+1),\n                 INDEX($P$2:$P$10,MOD(ROWS($A$1:A1)-1,COUNTA($P$2:$P$10))+1),\n                 INDEX($Q$2:$Q$10,MOD(ROWS($A$1:A1)-1,COUNTA($Q$2:$Q$10))+1))","v":"Sheet4"},null,null,null,null,"Sheet4",null,null,null,"Sheet1","المبلغ الصافى (2)","الباقى","المسحوب"]
[null,null,null,null,{"$f":"CHOOSE(MATCH($G$1,$N$1:$Q$1,0),\n                  INDEX($N$2:$N$10,MOD(ROWS($A$1:A2)-1,COUNTA($N$2:$N$10))+1),\n                 INDEX($O$2:$O$10,MOD(ROWS($A$1:A2)-1,COUNTA($O$2:$O$10))+1),\n                 INDEX($P$2:$P$10,MOD(ROWS($A$1:A2)-1,COUNTA($P$2:$P$10))+1),\n                 INDEX($Q$2:$Q$10,MOD(ROWS($A$1:A2)-1,COUNTA($Q$2:$Q$10))+1))","v":"Sheet1"},null,null,null,null,"Sheet1",null,null,null,"السحب المطلوب","القائمة المطلوبة","المسحوب","المبلغ الصافى"]
[null,null,null,null,{"$f":"CHOOSE(MATCH($G$1,$N$1:$Q$1,0),\n                  INDEX($N$2:$N$10,MOD(ROWS($A$1:A3)-1,COUNTA($N$2:$N$10))+1),\n                 INDEX($O$2:$O$10,MOD(ROWS($A$1:A3)-1,COUNTA($O$2:$O$10))+1),\n                 INDEX($P$2:$P$10,MOD(ROWS($A$1:A3)-1,COUNTA($P$2:$P$10))+1),\n                 INDEX($Q$2:$Q$10,MOD(ROWS($A$1:A3)-1,COUNTA($Q$2:$Q$10))+1))","v":"السحب المطلوب"},null,null,null,null,"Sheet2",null,null,null,"المعطى المطلوب","الايراد المطلوبة","المبلغ الصافى","Sheet1"]
[null,null,null,null,{"$f":"CHOOSE(MATCH($G$1,$N$1:$Q$1,0),\n                  INDEX($N$2:$N$10,MOD(ROWS($A$1:A4)-1,COUNTA($N$2:$N$10))+1),\n                 INDEX($O$2:$O$10,MOD(ROWS($A$1:A4)-1,COUNTA($O$2:$O$10))+1),\n                 INDEX($P$2:$P$10,MOD(ROWS($A$1:A4)-1,COUNTA($P$2:$P$10))+1),\n                 INDEX($Q$2:$Q$10,MOD(ROWS($A$1:A4)-1,COUNTA($Q$2:$Q$10))+1))","v":"المعطى المطلوب"},null,null,null,null,"Sheet3",null,null,null,"الباقى","السحب المطلوب",null,"Sheet2"]
[null,null,null,null,{"$f":"CHOOSE(MATCH($G$1,$N$1:$Q$1,0),\n                  INDEX($N$2:$N$10,MOD(ROWS($A$1:A5)-1,COUNTA($N$2:$N$10))+1),\n                 INDEX($O$2:$O$10,MOD(ROWS($A$1:A5)-1,COUNTA($O$2:$O$10))+1),\n                 INDEX($P$2:$P$10,MOD(ROWS($A$1:A5)-1,COUNTA($P$2:$P$10))+1),\n                 INDEX($Q$2:$Q$10,MOD(ROWS($A$1:A5)-1,COUNTA($Q$2:$Q$10))+1))","v":"الباقى"},null,null,null,null,"القائمة المطلوبة",null,null,null,"المسحوب","المعطى المطلوب"]
[null,null,null,null,{"$f":"CHOOSE(MATCH($G$1,$N$1:$Q$1,0),\n                  INDEX($N$2:$N$10,MOD(ROWS($A$1:A6)-1,COUNTA($N$2:$N$10))+1),\n                 INDEX($O$2:$O$10,MOD(ROWS($A$1:A6)-1,COUNTA($O$2:$O$10))+1),\n                 INDEX($P$2:$P$10,MOD(ROWS($A$1:A6)-1,COUNTA($P$2:$P$10))+1),\n                 INDEX($Q$2:$Q$10,MOD(ROWS($A$1:A6)-1,COUNTA($Q$2:$Q$10))+1))","v":"المسحوب"},null,null,null,null,"الايراد المطلوبة"]
[null,null,null,null,{"$f":"CHOOSE(MATCH($G$1,$N$1:$Q$1,0),\n                  INDEX($N$2:$N$10,MOD(ROWS($A$1:A7)-1,COUNTA($N$2:$N$10))+1),\n                 INDEX($O$2:$O$10,MOD(ROWS($A$1:A7)-1,COUNTA($O$2:$O$10))+1),\n                 INDEX($P$2:$P$10,MOD(ROWS($A$1:A7)-1,COUNTA($P$2:$P$10))+1),\n                 INDEX($Q$2:$Q$10,MOD(ROWS($A$1:A7)-1,COUNTA($Q$2:$Q$10))+1))","v":"Sheet4"},null,null,null,null,"السحب المطلوب"]
[null,null,null,null,{"$f":"CHOOSE(MATCH($G$1,$N$1:$Q$1,0),\n                  INDEX($N$2:$N$10,MOD(ROWS($A$1:A8)-1,COUNTA($N$2:$N$10))+1),\n                 INDEX($O$2:$O$10,MOD(ROWS($A$1:A8)-1,COUNTA($O$2:$O$10))+1),\n                 INDEX($P$2:$P$10,MOD(ROWS($A$1:A8)-1,COUNTA($P$2:$P$10))+1),\n                 INDEX($Q$2:$Q$10,MOD(ROWS($A$1:A8)-1,COUNTA($Q$2:$Q$10))+1))","v":"Sheet1"},null,null,null,null,"المعطى المطلوب"]
[null,null,null,null,{"$f":"CHOOSE(MATCH($G$1,$N$1:$Q$1,0),\n                  INDEX($N$2:$N$10,MOD(ROWS($A$1:A9)-1,COUNTA($N$2:$N$10))+1),\n                 INDEX($O$2:$O$10,MOD(ROWS($A$1:A9)-1,COUNTA($O$2:$O$10))+1),\n                 INDEX($P$2:$P$10,MOD(ROWS($A$1:A9)-1,COUNTA($P$2:$P$10))+1),\n                 INDEX($Q$2:$Q$10,MOD(ROWS($A$1:A9)-1,COUNTA($Q$2:$Q$10))+1))","v":"السحب المطلوب"},null,null,null,null,"المعطى المطلوب (2)"]
[null,null,null,null,{"$f":"CHOOSE(MATCH($G$1,$N$1:$Q$1,0),\n                  INDEX($N$2:$N$10,MOD(ROWS($A$1:A10)-1,COUNTA($N$2:$N$10))+1),\n                 INDEX($O$2:$O$10,MOD(ROWS($A$1:A10)-1,COUNTA($O$2:$O$10))+1),\n                 INDEX($P$2:$P$10,MOD(ROWS($A$1:A10)-1,COUNTA($P$2:$P$10))+1),\n                 INDEX($Q$2:$Q$10,MOD(ROWS($A$1:A10)-1,COUNTA($Q$2:$Q$10))+1))","v":"المعطى المطلوب"},null,null,null,null,"الباقى"]
[null,null,null,null,{"$f":"CHOOSE(MATCH($G$1,$N$1:$Q$1,0),\n                  INDEX($N$2:$N$10,MOD(ROWS($A$1:A11)-1,COUNTA($N$2:$N$10))+1),\n                 INDEX($O$2:$O$10,MOD(ROWS($A$1:A11)-1,COUNTA($O$2:$O$10))+1),\n                 INDEX($P$2:$P$10,MOD(ROWS($A$1:A11)-1,COUNTA($P$2:$P$10))+1),\n                 INDEX($Q$2:$Q$10,MOD(ROWS($A$1:A11)-1,COUNTA($Q$2:$Q$10))+1))","v":"الباقى"},null,null,null,null,"المسحوب"]
[null,null,null,null,{"$f":"CHOOSE(MATCH($G$1,$N$1:$Q$1,0),\n                  INDEX($N$2:$N$10,MOD(ROWS($A$1:A12)-1,COUNTA($N$2:$N$10))+1),\n                 INDEX($O$2:$O$10,MOD(ROWS($A$1:A12)-1,COUNTA($O$2:$O$10))+1),\n                 INDEX($P$2:$P$10,MOD(ROWS($A$1:A12)-1,COUNTA($P$2:$P$10))+1),\n                 INDEX($Q$2:$Q$10,MOD(ROWS($A$1:A12)-1,COUNTA($Q$2:$Q$10))+1))","v":"المسحوب"},null,null,null,null,"المبلغ الصافى"]
[null,null,null,null,{"$f":"CHOOSE(MATCH($G$1,$N$1:$Q$1,0),\n                  INDEX($N$2:$N$10,MOD(ROWS($A$1:A13)-1,COUNTA($N$2:$N$10))+1),\n                 INDEX($O$2:$O$10,MOD(ROWS($A$1:A13)-1,COUNTA($O$2:$O$10))+1),\n                 INDEX($P$2:$P$10,MOD(ROWS($A$1:A13)-1,COUNTA($P$2:$P$10))+1),\n                 INDEX($Q$2:$Q$10,MOD(ROWS($A$1:A13)-1,COUNTA($Q$2:$Q$10))+1))","v":"Sheet4"},null,null,null,null,"المبلغ الصافى (2)"]
[null,null,null,null,{"$f":"CHOOSE(MATCH($G$1,$N$1:$Q$1,0),\n                  INDEX($N$2:$N$10,MOD(ROWS($A$1:A14)-1,COUNTA($N$2:$N$10))+1),\n                 INDEX($O$2:$O$10,MOD(ROWS($A$1:A14)-1,COUNTA($O$2:$O$10))+1),\n                 INDEX($P$2:$P$10,MOD(ROWS($A$1:A14)-1,COUNTA($P$2:$P$10))+1),\n                 INDEX($Q$2:$Q$10,MOD(ROWS($A$1:A14)-1,COUNTA($Q$2:$Q$10))+1))","v":"Sheet1"}]
[null,null,null,null,{"$f":"CHOOSE(MATCH($G$1,$N$1:$Q$1,0),\n                  INDEX($N$2:$N$10,MOD(ROWS($A$1:A15)-1,COUNTA($N$2:$N$10))+1),\n                 INDEX($O$2:$O$10,MOD(ROWS($A$1:A15)-1,COUNTA($O$2:$O$10))+1),\n                 INDEX($P$2:$P$10,MOD(ROWS($A$1:A15)-1,COUNTA($P$2:$P$10))+1),\n                 INDEX($Q$2:$Q$10,MOD(ROWS($A$1:A15)-1,COUNTA($Q$2:$Q$10))+1))","v":"السحب المطلوب"}]
[null,null,null,null,{"$f":"CHOOSE(MATCH($G$1,$N$1:$Q$1,0),\n                  INDEX($N$2:$N$10,MOD(ROWS($A$1:A16)-1,COUNTA($N$2:$N$10))+1),\n                 INDEX($O$2:$O$10,MOD(ROWS($A$1:A16)-1,COUNTA($O$2:$O$10))+1),\n                 INDEX($P$2:$P$10,MOD(ROWS($A$1:A16)-1,COUNTA($P$2:$P$10))+1),\n                 INDEX($Q$2:$Q$10,MOD(ROWS($A$1:A16)-1,COUNTA($Q$2:$Q$10))+1))","v":"المعطى المطلوب"}]
[null,null,null,null,{"$f":"CHOOSE(MATCH($G$1,$N$1:$Q$1,0),\n                  INDEX($N$2:$N$10,MOD(ROWS($A$1:A17)-1,COUNTA($N$2:$N$10))+1),\n                 INDEX($O$2:$O$10,MOD(ROWS($A$1:A17)-1,COUNTA($O$2:$O$10))+1),\n                 INDEX($P$2:$P$10,MOD(ROWS($A$1:A17)-1,COUNTA($P$2:$P$10))+1),\n                 INDEX($Q$2:$Q$10,MOD(ROWS($A$1:A17)-1,COUNTA($Q$2:$Q$10))+1))","v":"الباقى"}]
[null,null,null,null,{"$f":"CHOOSE(MATCH($G$1,$N$1:$Q$1,0),\n                  INDEX($N$2:$N$10,MOD(ROWS($A$1:A18)-1,COUNTA($N$2:$N$10))+1),\n                 INDEX($O$2:$O$10,MOD(ROWS($A$1:A18)-1,COUNTA($O$2:$O$10))+1),\n                 INDEX($P$2:$P$10,MOD(ROWS($A$1:A18)-1,COUNTA($P$2:$P$10))+1),\n                 INDEX($Q$2:$Q$10,MOD(ROWS($A$1:A18)-1,COUNTA($Q$2:$Q$10))+1))","v":"المسحوب"}]
[null,null,null,null,{"$f":"CHOOSE(MATCH($G$1,$N$1:$Q$1,0),\n                  INDEX($N$2:$N$10,MOD(ROWS($A$1:A19)-1,COUNTA($N$2:$N$10))+1),\n                 INDEX($O$2:$O$10,MOD(ROWS($A$1:A19)-1,COUNTA($O$2:$O$10))+1),\n                 INDEX($P$2:$P$10,MOD(ROWS($A$1:A19)-1,COUNTA($P$2:$P$10))+1),\n                 INDEX($Q$2:$Q$10,MOD(ROWS($A$1:A19)-1,COUNTA($Q$2:$Q$10))+1))","v":"Sheet4"}]
[null,null,null,null,{"$f":"CHOOSE(MATCH($G$1,$N$1:$Q$1,0),\n                  INDEX($N$2:$N$10,MOD(ROWS($A$1:A20)-1,COUNTA($N$2:$N$10))+1),\n                 INDEX($O$2:$O$10,MOD(ROWS($A$1:A20)-1,COUNTA($O$2:$O$10))+1),\n                 INDEX($P$2:$P$10,MOD(ROWS($A$1:A20)-1,COUNTA($P$2:$P$10))+1),\n                 INDEX($Q$2:$Q$10,MOD(ROWS($A$1:A20)-1,COUNTA($Q$2:$Q$10))+1))","v":"Sheet1"}]
[null,null,null,null,{"$f":"CHOOSE(MATCH($G$1,$N$1:$Q$1,0),\n                  INDEX($N$2:$N$10,MOD(ROWS($A$1:A21)-1,COUNTA($N$2:$N$10))+1),\n                 INDEX($O$2:$O$10,MOD(ROWS($A$1:A21)-1,COUNTA($O$2:$O$10))+1),\n                 INDEX($P$2:$P$10,MOD(ROWS($A$1:A21)-1,COUNTA($P$2:$P$10))+1),\n                 INDEX($Q$2:$Q$10,MOD(ROWS($A$1:A21)-1,COUNTA($Q$2:$Q$10))+1))","v":"السحب المطلوب"}]
[null,null,null,null,{"$f":"CHOOSE(MATCH($G$1,$N$1:$Q$1,0),\n                  INDEX($N$2:$N$10,MOD(ROWS($A$1:A22)-1,COUNTA($N$2:$N$10))+1),\n                 INDEX($O$2:$O$10,MOD(ROWS($A$1:A22)-1,COUNTA($O$2:$O$10))+1),\n                 INDEX($P$2:$P$10,MOD(ROWS($A$1:A22)-1,COUNTA($P$2:$P$10))+1),\n                 INDEX($Q$2:$Q$10,MOD(ROWS($A$1:A22)-1,COUNTA($Q$2:$Q$10))+1))","v":"المعطى المطلوب"}]
[null,null,null,null,{"$f":"CHOOSE(MATCH($G$1,$N$1:$Q$1,0),\n                  INDEX($N$2:$N$10,MOD(ROWS($A$1:A23)-1,COUNTA($N$2:$N$10))+1),\n                 INDEX($O$2:$O$10,MOD(ROWS($A$1:A23)-1,COUNTA($O$2:$O$10))+1),\n                 INDEX($P$2:$P$10,MOD(ROWS($A$1:A23)-1,COUNTA($P$2:$P$10))+1),\n                 INDEX($Q$2:$Q$10,MOD(ROWS($A$1:A23)-1,COUNTA($Q$2:$Q$10))+1))","v":"الباقى"}]
[null,null,null,null,{"$f":"CHOOSE(MATCH($G$1,$N$1:$Q$1,0),\n                  INDEX($N$2:$N$10,MOD(ROWS($A$1:A24)-1,COUNTA($N$2:$N$10))+1),\n                 INDEX($O$2:$O$10,MOD(ROWS($A$1:A24)-1,COUNTA($O$2:$O$10))+1),\n                 INDEX($P$2:$P$10,MOD(ROWS($A$1:A24)-1,COUNTA($P$2:$P$10))+1),\n                 INDEX($Q$2:$Q$10,MOD(ROWS($A$1:A24)-1,COUNTA($Q$2:$Q$10))+1))","v":"المسحوب"}]
[null,null,null,null,{"$f":"CHOOSE(MATCH($G$1,$N$1:$Q$1,0),\n                  INDEX($N$2:$N$10,MOD(ROWS($A$1:A25)-1,COUNTA($N$2:$N$10))+1),\n                 INDEX($O$2:$O$10,MOD(ROWS($A$1:A25)-1,COUNTA($O$2:$O$10))+1),\n                 INDEX($P$2:$P$10,MOD(ROWS($A$1:A25)-1,COUNTA($P$2:$P$10))+1),\n                 INDEX($Q$2:$Q$10,MOD(ROWS($A$1:A25)-1,COUNTA($Q$2:$Q$10))+1))","v":"Sheet4"}]
[null,null,null,null,{"$f":"CHOOSE(MATCH($G$1,$N$1:$Q$1,0),\n                  INDEX($N$2:$N$10,MOD(ROWS($A$1:A26)-1,COUNTA($N$2:$N$10))+1),\n                 INDEX($O$2:$O$10,MOD(ROWS($A$1:A26)-1,COUNTA($O$2:$O$10))+1),\n                 INDEX($P$2:$P$10,MOD(ROWS($A$1:A26)-1,COUNTA($P$2:$P$10))+1),\n                 INDEX($Q$2:$Q$10,MOD(ROWS($A$1:A26)-1,COUNTA($Q$2:$Q$10))+1))","v":"Sheet1"}]
[null,null,null,null,{"$f":"CHOOSE(MATCH($G$1,$N$1:$Q$1,0),\n                  INDEX($N$2:$N$10,MOD(ROWS($A$1:A27)-1,COUNTA($N$2:$N$10))+1),\n                 INDEX($O$2:$O$10,MOD(ROWS($A$1:A27)-1,COUNTA($O$2:$O$10))+1),\n                 INDEX($P$2:$P$10,MOD(ROWS($A$1:A27)-1,COUNTA($P$2:$P$10))+1),\n                 INDEX($Q$2:$Q$10,MOD(ROWS($A$1:A27)-1,COUNTA($Q$2:$Q$10))+1))","v":"السحب المطلوب"}]
[null,null,null,null,{"$f":"CHOOSE(MATCH($G$1,$N$1:$Q$1,0),\n                  INDEX($N$2:$N$10,MOD(ROWS($A$1:A28)-1,COUNTA($N$2:$N$10))+1),\n                 INDEX($O$2:$O$10,MOD(ROWS($A$1:A28)-1,COUNTA($O$2:$O$10))+1),\n                 INDEX($P$2:$P$10,MOD(ROWS($A$1:A28)-1,COUNTA($P$2:$P$10))+1),\n                 INDEX($Q$2:$Q$10,MOD(ROWS($A$1:A28)-1,COUNTA($Q$2:$Q$10))+1))","v":"المعطى المطلوب"}]
[null,null,null,null,{"$f":"CHOOSE(MATCH($G$1,$N$1:$Q$1,0),\n                  INDEX($N$2:$N$10,MOD(ROWS($A$1:A29)-1,COUNTA($N$2:$N$10))+1),\n                 INDEX($O$2:$O$10,MOD(ROWS($A$1:A29)-1,COUNTA($O$2:$O$10))+1),\n                 INDEX($P$2:$P$10,MOD(ROWS($A$1:A29)-1,COUNTA($P$2:$P$10))+1),\n                 INDEX($Q$2:$Q$10,MOD(ROWS($A$1:A29)-1,COUNTA($Q$2:$Q$10))+1))","v":"الباقى"}]
[null,null,null,null,{"$f":"CHOOSE(MATCH($G$1,$N$1:$Q$1,0),\n                  INDEX($N$2:$N$10,MOD(ROWS($A$1:A30)-1,COUNTA($N$2:$N$10))+1),\n                 INDEX($O$2:$O$10,MOD(ROWS($A$1:A30)-1,COUNTA($O$2:$O$10))+1),\n                 INDEX($P$2:$P$10,MOD(ROWS($A$1:A30)-1,COUNTA($P$2:$P$10))+1),\n                 INDEX($Q$2:$Q$10,MOD(ROWS($A$1:A30)-1,COUNTA($Q$2:$Q$10))+1))","v":"المسحوب"}]
[null,null,null,null,{"$f":"CHOOSE(MATCH($G$1,$N$1:$Q$1,0),\n                  INDEX($N$2:$N$10,MOD(ROWS($A$1:A31)-1,COUNTA($N$2:$N$10))+1),\n                 INDEX($O$2:$O$10,MOD(ROWS($A$1:A31)-1,COUNTA($O$2:$O$10))+1),\n                 INDEX($P$2:$P$10,MOD(ROWS($A$1:A31)-1,COUNTA($P$2:$P$10))+1),\n                 INDEX($Q$2:$Q$10,MOD(ROWS($A$1:A31)-1,COUNTA($Q$2:$Q$10))+1))","v":"Sheet4"}]
[null,null,null,null,{"$f":"CHOOSE(MATCH($G$1,$N$1:$Q$1,0),\n                  INDEX($N$2:$N$10,MOD(ROWS($A$1:A32)-1,COUNTA($N$2:$N$10))+1),\n                 INDEX($O$2:$O$10,MOD(ROWS($A$1:A32)-1,COUNTA($O$2:$O$10))+1),\n                 INDEX($P$2:$P$10,MOD(ROWS($A$1:A32)-1,COUNTA($P$2:$P$10))+1),\n                 INDEX($Q$2:$Q$10,MOD(ROWS($A$1:A32)-1,COUNTA($Q$2:$Q$10))+1))","v":"Sheet1"}]
[null,null,null,null,{"$f":"CHOOSE(MATCH($G$1,$N$1:$Q$1,0),\n                  INDEX($N$2:$N$10,MOD(ROWS($A$1:A33)-1,COUNTA($N$2:$N$10))+1),\n                 INDEX($O$2:$O$10,MOD(ROWS($A$1:A33)-1,COUNTA($O$2:$O$10))+1),\n                 INDEX($P$2:$P$10,MOD(ROWS($A$1:A33)-1,COUNTA($P$2:$P$10))+1),\n                 INDEX($Q$2:$Q$10,MOD(ROWS($A$1:A33)-1,COUNTA($Q$2:$Q$10))+1))","v":"السحب المطلوب"}]
[null,null,null,null,{"$f":"CHOOSE(MATCH($G$1,$N$1:$Q$1,0),\n                  INDEX($N$2:$N$10,MOD(ROWS($A$1:A34)-1,COUNTA($N$2:$N$10))+1),\n                 INDEX($O$2:$O$10,MOD(ROWS($A$1:A34)-1,COUNTA($O$2:$O$10))+1),\n                 INDEX($P$2:$P$10,MOD(ROWS($A$1:A34)-1,COUNTA($P$2:$P$10))+1),\n                 INDEX($Q$2:$Q$10,MOD(ROWS($A$1:A34)-1,COUNTA($Q$2:$Q$10))+1))","v":"المعطى المطلوب"}]
[null,null,null,null,{"$f":"CHOOSE(MATCH($G$1,$N$1:$Q$1,0),\n                  INDEX($N$2:$N$10,MOD(ROWS($A$1:A35)-1,COUNTA($N$2:$N$10))+1),\n                 INDEX($O$2:$O$10,MOD(ROWS($A$1:A35)-1,COUNTA($O$2:$O$10))+1),\n                 INDEX($P$2:$P$10,MOD(ROWS($A$1:A35)-1,COUNTA($P$2:$P$10))+1),\n                 INDEX($Q$2:$Q$10,MOD(ROWS($A$1:A35)-1,COUNTA($Q$2:$Q$10))+1))","v":"الباقى"}]
[null,null,null,null,{"$f":"CHOOSE(MATCH($G$1,$N$1:$Q$1,0),\n                  INDEX($N$2:$N$10,MOD(ROWS($A$1:A36)-1,COUNTA($N$2:$N$10))+1),\n                 INDEX($O$2:$O$10,MOD(ROWS($A$1:A36)-1,COUNTA($O$2:$O$10))+1),\n                 INDEX($P$2:$P$10,MOD(ROWS($A$1:A36)-1,COUNTA($P$2:$P$10))+1),\n                 INDEX($Q$2:$Q$10,MOD(ROWS($A$1:A36)-1,COUNTA($Q$2:$Q$10))+1))","v":"المسحوب"}]
[null,null,null,null,{"$f":"CHOOSE(MATCH($G$1,$N$1:$Q$1,0),\n                  INDEX($N$2:$N$10,MOD(ROWS($A$1:A37)-1,COUNTA($N$2:$N$10))+1),\n                 INDEX($O$2:$O$10,MOD(ROWS($A$1:A37)-1,COUNTA($O$2:$O$10))+1),\n                 INDEX($P$2:$P$10,MOD(ROWS($A$1:A37)-1,COUNTA($P$2:$P$10))+1),\n                 INDEX($Q$2:$Q$10,MOD(ROWS($A$1:A37)-1,COUNTA($Q$2:$Q$10))+1))","v":"Sheet4"}]
[null,null,null,null,{"$f":"CHOOSE(MATCH($G$1,$N$1:$Q$1,0),\n                  INDEX($N$2:$N$10,MOD(ROWS($A$1:A38)-1,COUNTA($N$2:$N$10))+1),\n                 INDEX($O$2:$O$10,MOD(ROWS($A$1:A38)-1,COUNTA($O$2:$O$10))+1),\n                 INDEX($P$2:$P$10,MOD(ROWS($A$1:A38)-1,COUNTA($P$2:$P$10))+1),\n                 INDEX($Q$2:$Q$10,MOD(ROWS($A$1:A38)-1,COUNTA($Q$2:$Q$10))+1))","v":"Sheet1"}]
[null,null,null,null,{"$f":"CHOOSE(MATCH($G$1,$N$1:$Q$1,0),\n                  INDEX($N$2:$N$10,MOD(ROWS($A$1:A39)-1,COUNTA($N$2:$N$10))+1),\n                 INDEX($O$2:$O$10,MOD(ROWS($A$1:A39)-1,COUNTA($O$2:$O$10))+1),\n                 INDEX($P$2:$P$10,MOD(ROWS($A$1:A39)-1,COUNTA($P$2:$P$10))+1),\n                 INDEX($Q$2:$Q$10,MOD(ROWS($A$1:A39)-1,COUNTA($Q$2:$Q$10))+1))","v":"السحب المطلوب"}]
[null,null,null,null,{"$f":"CHOOSE(MATCH($G$1,$N$1:$Q$1,0),\n                  INDEX($N$2:$N$10,MOD(ROWS($A$1:A40)-1,COUNTA($N$2:$N$10))+1),\n                 INDEX($O$2:$O$10,MOD(ROWS($A$1:A40)-1,COUNTA($O$2:$O$10))+1),\n                 INDEX($P$2:$P$10,MOD(ROWS($A$1:A40)-1,COUNTA($P$2:$P$10))+1),\n                 INDEX($Q$2:$Q$10,MOD(ROWS($A$1:A40)-1,COUNTA($Q$2:$Q$10))+1))","v":"المعطى المطلوب"}]
[null,null,null,null,{"$f":"CHOOSE(MATCH($G$1,$N$1:$Q$1,0),\n                  INDEX($N$2:$N$10,MOD(ROWS($A$1:A41)-1,COUNTA($N$2:$N$10))+1),\n                 INDEX($O$2:$O$10,MOD(ROWS($A$1:A41)-1,COUNTA($O$2:$O$10))+1),\n                 INDEX($P$2:$P$10,MOD(ROWS($A$1:A41)-1,COUNTA($P$2:$P$10))+1),\n                 INDEX($Q$2:$Q$10,MOD(ROWS($A$1:A41)-1,COUNTA($Q$2:$Q$10))+1))","v":"الباقى"}]
[null,null,null,null,{"$f":"CHOOSE(MATCH($G$1,$N$1:$Q$1,0),\n                  INDEX($N$2:$N$10,MOD(ROWS($A$1:A42)-1,COUNTA($N$2:$N$10))+1),\n                 INDEX($O$2:$O$10,MOD(ROWS($A$1:A42)-1,COUNTA($O$2:$O$10))+1),\n                 INDEX($P$2:$P$10,MOD(ROWS($A$1:A42)-1,COUNTA($P$2:$P$10))+1),\n                 INDEX($Q$2:$Q$10,MOD(ROWS($A$1:A42)-1,COUNTA($Q$2:$Q$10))+1))","v":"المسحوب"}]
[null,null,null,null,{"$f":"CHOOSE(MATCH($G$1,$N$1:$Q$1,0),\n                  INDEX($N$2:$N$10,MOD(ROWS($A$1:A43)-1,COUNTA($N$2:$N$10))+1),\n                 INDEX($O$2:$O$10,MOD(ROWS($A$1:A43)-1,COUNTA($O$2:$O$10))+1),\n                 INDEX($P$2:$P$10,MOD(ROWS($A$1:A43)-1,COUNTA($P$2:$P$10))+1),\n                 INDEX($Q$2:$Q$10,MOD(ROWS($A$1:A43)-1,COUNTA($Q$2:$Q$10))+1))","v":"Sheet4"}]
[null,null,null,null,{"$f":"CHOOSE(MATCH($G$1,$N$1:$Q$1,0),\n                  INDEX($N$2:$N$10,MOD(ROWS($A$1:A44)-1,COUNTA($N$2:$N$10))+1),\n                 INDEX($O$2:$O$10,MOD(ROWS($A$1:A44)-1,COUNTA($O$2:$O$10))+1),\n                 INDEX($P$2:$P$10,MOD(ROWS($A$1:A44)-1,COUNTA($P$2:$P$10))+1),\n                 INDEX($Q$2:$Q$10,MOD(ROWS($A$1:A44)-1,COUNTA($Q$2:$Q$10))+1))","v":"Sheet1"}]
[null,null,null,null,{"$f":"CHOOSE(MATCH($G$1,$N$1:$Q$1,0),\n                  INDEX($N$2:$N$10,MOD(ROWS($A$1:A45)-1,COUNTA($N$2:$N$10))+1),\n                 INDEX($O$2:$O$10,MOD(ROWS($A$1:A45)-1,COUNTA($O$2:$O$10))+1),\n                 INDEX($P$2:$P$10,MOD(ROWS($A$1:A45)-1,COUNTA($P$2:$P$10))+1),\n                 INDEX($Q$2:$Q$10,MOD(ROWS($A$1:A45)-1,COUNTA($Q$2:$Q$10))+1))","v":"السحب المطلوب"}]
[null,null,null,null,{"$f":"CHOOSE(MATCH($G$1,$N$1:$Q$1,0),\n                  INDEX($N$2:$N$10,MOD(ROWS($A$1:A46)-1,COUNTA($N$2:$N$10))+1),\n                 INDEX($O$2:$O$10,MOD(ROWS($A$1:A46)-1,COUNTA($O$2:$O$10))+1),\n                 INDEX($P$2:$P$10,MOD(ROWS($A$1:A46)-1,COUNTA($P$2:$P$10))+1),\n                 INDEX($Q$2:$Q$10,MOD(ROWS($A$1:A46)-1,COUNTA($Q$2:$Q$10))+1))","v":"المعطى المطلوب"}]
[null,null,null,null,{"$f":"CHOOSE(MATCH($G$1,$N$1:$Q$1,0),\n                  INDEX($N$2:$N$10,MOD(ROWS($A$1:A47)-1,COUNTA($N$2:$N$10))+1),\n                 INDEX($O$2:$O$10,MOD(ROWS($A$1:A47)-1,COUNTA($O$2:$O$10))+1),\n                 INDEX($P$2:$P$10,MOD(ROWS($A$1:A47)-1,COUNTA($P$2:$P$10))+1),\n                 INDEX($Q$2:$Q$10,MOD(ROWS($A$1:A47)-1,COUNTA($Q$2:$Q$10))+1))","v":"الباقى"}]
[null,null,null,null,{"$f":"CHOOSE(MATCH($G$1,$N$1:$Q$1,0),\n                  INDEX($N$2:$N$10,MOD(ROWS($A$1:A48)-1,COUNTA($N$2:$N$10))+1),\n                 INDEX($O$2:$O$10,MOD(ROWS($A$1:A48)-1,COUNTA($O$2:$O$10))+1),\n                 INDEX($P$2:$P$10,MOD(ROWS($A$1:A48)-1,COUNTA($P$2:$P$10))+1),\n                 INDEX($Q$2:$Q$10,MOD(ROWS($A$1:A48)-1,COUNTA($Q$2:$Q$10))+1))","v":"المسحوب"}]
[null,null,null,null,{"$f":"CHOOSE(MATCH($G$1,$N$1:$Q$1,0),\n                  INDEX($N$2:$N$10,MOD(ROWS($A$1:A49)-1,COUNTA($N$2:$N$10))+1),\n                 INDEX($O$2:$O$10,MOD(ROWS($A$1:A49)-1,COUNTA($O$2:$O$10))+1),\n                 INDEX($P$2:$P$10,MOD(ROWS($A$1:A49)-1,COUNTA($P$2:$P$10))+1),\n                 INDEX($Q$2:$Q$10,MOD(ROWS($A$1:A49)-1,COUNTA($Q$2:$Q$10))+1))","v":"Sheet4"}]

{"sheet":"Sheet4","index":4,"n_rows":0,"n_cols":0,"rows_kept":0,"cut":false,"hidden":false,"merged":[]}

{"sheet":"Sheet1","index":5,"n_rows":0,"n_cols":0,"rows_kept":0,"cut":false,"hidden":false,"merged":[]}

{"sheet":"Sheet2","index":6,"n_rows":0,"n_cols":0,"rows_kept":0,"cut":false,"hidden":false,"merged":[]}

{"sheet":"Sheet3","index":7,"n_rows":0,"n_cols":0,"rows_kept":0,"cut":false,"hidden":false,"merged":[]}

{"sheet":"الاعتماد1","index":8,"n_rows":0,"n_cols":0,"rows_kept":0,"cut":false,"hidden":false,"merged":[]}

{"sheet":"الاعتماد2","index":9,"n_rows":0,"n_cols":0,"rows_kept":0,"cut":false,"hidden":false,"merged":[]}

{"sheet":"القائمة المطلوبة","index":10,"n_rows":0,"n_cols":0,"rows_kept":0,"cut":false,"hidden":false,"merged":[]}

{"sheet":"الايراد المطلوبة","index":11,"n_rows":0,"n_cols":0,"rows_kept":0,"cut":false,"hidden":false,"merged":[]}

{"sheet":"السحب المطلوب","index":12,"n_rows":1,"n_cols":1,"rows_kept":1,"cut":false,"hidden":false,"merged":[]}
["ال"]

{"sheet":"المعطى المطلوب","index":13,"n_rows":0,"n_cols":0,"rows_kept":0,"cut":false,"hidden":false,"merged":[]}

{"sheet":"المعطى المطلوب (2)","index":14,"n_rows":0,"n_cols":0,"rows_kept":0,"cut":false,"hidden":false,"merged":[]}

{"sheet":"الباقى","index":15,"n_rows":0,"n_cols":0,"rows_kept":0,"cut":false,"hidden":false,"merged":[]}

{"sheet":"المسحوب","index":16,"n_rows":0,"n_cols":0,"rows_kept":0,"cut":false,"hidden":false,"merged":[]}

{"sheet":"المبلغ الصافى","index":17,"n_rows":0,"n_cols":0,"rows_kept":0,"cut":false,"hidden":false,"merged":[]}

{"sheet":"المبلغ الصافى (2)","index":18,"n_rows":0,"n_cols":0,"rows_kept":0,"cut":false,"hidden":false,"merged":[]}