{"text_format":"1","workbook":"xlsx","n_sheets":5,"sheets":["الاكواد","INV","SLS","ورقة4","ورقة5"],"not_rendered":{"charts":0,"images":0,"macros":1,"external_links":0,"defined_names":1,"comments":0,"pivot_tables":0},"unopened":[],"bounds":{"document_bytes":16777216,"sheet_cells":100000,"rows_first":2000,"rows_last":500,"rows_between":2000,"halvings":0,"cell_chars":16384,"cell_head_chars":4096},"cells_cut":0,"cells_raw":0,"read":"whole","date_system":"1900"}

{"sheet":"الاكواد","index":0,"n_rows":6,"n_cols":10,"rows_kept":6,"cut":false,"hidden":false,"merged":[]}
[null,"اسم الصنف","الوحدة",null,"رقم العميل","اسم العميل","تصنيف العميل","العنوان","التليفون","اجمالى المديونية"]
[null,"خوخ فلوردا","بالكيلو",null,{"$f":"IF(F2<>\"\",1,\"\")","v":1},"رضا محمد بسيونى الخطيب","A","خربتا","01273263994",100]
[null,"خوخ ديزرت","بالكيلو",null,{"$f":"IF(F3<>\"\",1+E2,\"\")","v":2},"محمد مسموع","AA","وادى","0120000000",200]
[null,"موز بلدى","سباطة"]
[null,"بطيخ","بالحبة"]
[null,"اناناس","بالحبة"]

{"sheet":"INV","index":1,"n_rows":29,"n_cols":10,"rows_kept":29,"cut":false,"hidden":false,"merged":[[0,4,0,9],[1,4,1,5],[2,4,2,5],[6,4,6,5],[1,6,1,9],[2,6,2,7],[2,8,2,9],[6,6,6,9],[10,4,10,5],[8,4,8,5],[7,4,7,5],[7,6,7,9],[23,4,26,7],[10,6,10,9],[8,6,8,9],[9,6,9,9],[9,4,9,5]]}
[null,null,null,null,"فاتورة مبيعات  مــحــــلات الامـــــــــــــــــــــــــــــــــل"]
[null,null,null,null,"العنوان ",null,"وادى النطرون  بوار لفظ الجلالة"]
[null,null,null,null,"تليفون المحل",null,"01090596181",null,"01273263990"]
[]
[null,null,null,null,"رقم الفاتورة ","009",null,null,"التاريخ","2020-10-06"]
[]
[null,null,null,null,"رقــــم  العميل",null,{"$f":"IF(G8=\"\",\"\",INDEX(الاكواد!$E:$E,MATCH($G8,الاكواد!$F:$F,0)))","v":2}]
[null,null,null,null,"اســــم العميل",null,"محمد مسموع"]
[null,null,null,null,"تصنيف العميل",null,{"$f":"IF(G8=\"\",\"\",INDEX(الاكواد!$G:$G,MATCH($G8,الاكواد!$F:$F,0)))","v":"AA"}]
[null,null,null,null,"تليفون العميل",null,{"$f":"IF(G8=\"\",\"\",INDEX(الاكواد!$I:$I,MATCH($G8,الاكواد!$F:$F,0)))","v":"0120000000"}]
[null,null,null,null,"عـنوان العميل",null,{"$f":"IF(G8=\"\",\"\",INDEX(الاكواد!$H:$H,MATCH($G8,الاكواد!$F:$F,0)))","v":"وادى"}]
[]
[{"$f":"+E5","v":"رقم الفاتورة "},{"$f":"+I5","v":"التاريخ"},{"$f":"+E7","v":"رقــــم  العميل"},{"$f":"+E8","v":"اســــم العميل"},"م","الصنف","الوحدة","الكمية","السعر","القيمة"]
[{"$f":"IF(F14<>\"\",$F$5,\"\")","v":""},{"$f":"IF(G14<>\"\",$J$5,\"\")","v":""},{"$f":"IF(H14<>\"\",$G$7,\"\")","v":""},{"$f":"IF(I14<>\"\",$G$8,\"\")","v":""},{"$f":"IF(F14<>\"\",1,\"\")","v":""},null,null,null,null,{"$f":"+H14*I14","v":0}]
[{"$f":"IF(F15<>\"\",$F$5,\"\")","v":""},{"$f":"IF(G15<>\"\",$J$5,\"\")","v":""},{"$f":"IF(H15<>\"\",$G$7,\"\")","v":""},{"$f":"IF(I15<>\"\",$G$8,\"\")","v":""},{"$f":"IF(F15<>\"\",+E14+1,\"\")","v":""},null,null,null,null,{"$f":"+H15*I15","v":0}]
["","","","",{"$f":"IF(F16<>\"\",+E15+1,\"\")","v":""},null,null,null,null,0]
["","","","","",null,null,null,null,0]
["","","","","",null,null,null,null,0]
["","","","","",null,null,null,null,0]
["","","","","",null,null,null,null,0]
["","","","","",null,null,null,null,0]
["","","","","",null,null,null,null,0]
["","","","","",null,null,null,null,0]
[null,null,null,null,"استلمت جميع الاصناف بالفاتورة الموضحة أعلاه واصبحت قيمتها فى ذمتى وأمانتى لحين انتهاء السداد لها ",null,null,null,"اجمالى الفاتورة",{"$f":"SUM(J14:J23)","v":0}]
[null,null,null,null,null,null,null,null,"خصم الفاتورة"]
[null,null,null,null,null,null,null,null,"رهن بالفاتورة"]
[null,null,null,null,null,null,null,null,"صافى الفاتورة ",{"$f":"+J24-J25-J26","v":0}]
[]
[null,null,null,null,null,"المستلم ",null,null,"المحاسب","مدير المحل"]

{"sheet":"SLS","index":2,"n_rows":1634,"n_cols":12,"rows_kept":1634,"cut":false,"hidden":false,"merged":[]}
[]
[]
[]
[]
[null,null,"رقم الفاتورة","تاريخ الفاتورة","رقــــم  العميل","اســــم العميل","مسلسل","الصنف","الوحدة","الكمية","السعر","القيمة"]
[null,null,"005",44108,1,"رضا محمد بسيونى الخطيب",1,"موز بلدى","سباطة",20,45,900]
[null,null,"005",44108,1,"رضا محمد بسيونى الخطيب",2,"موز بلدى","سباطة",10,45,450]
[null,null,"005",44108,1,"رضا محمد بسيونى الخطيب",3,"موز بلدى","سباطة",20,45,900]
[null,null,"005",44108,1,"رضا محمد بسيونى الخطيب",4,"موز بلدى","سباطة",30,45,1350]
[null,null,"005",44108,1,"رضا محمد بسيونى الخطيب",5,"موز بلدى","سباطة",40,45,1800]
[null,null,"005",44108,1,"رضا محمد بسيونى الخطيب",6,"موز بلدى","سباطة",60,45,2700]
[null,null,"005",44108,1,"رضا محمد بسيونى الخطيب",7,"موز بلدى","سباطة",50,45,2250]
[null,null,"005",44108,1,"رضا محمد بسيونى الخطيب",8,"موز بلدى","سباطة",50,45,2250]
[null,null,"005",44108,1,"رضا محمد بسيونى الخطيب",9,"موز بلدى","سباطة",50,45,2250]
[null,null,"005",44108,1,"رضا محمد بسيونى الخطيب",10,"موز بلدى","سباطة",20,45,900]
[null,null,"006",44109,2,"محمد مسموع",1,"اناناس","حبة",100,10,1000]
[null,null,"006",44109,2,"محمد مسموع",2,"اناناس","حبة",90,10,900]
[null,null,"006",44109,2,"محمد مسموع",3,"اناناس","حبة",80,10,800]
[null,null,"006",44109,2,"محمد مسموع",4,"اناناس","حبة",70,10,700]
[null,null,"006",44109,2,"محمد مسموع",5,"اناناس","حبة",60,10,600]
[null,null,"006",44109,2,"محمد مسموع",6,"اناناس","حبة",50,10,500]
[null,null,"006",44109,2,"محمد مسموع",7,"اناناس","حبة",40,10,400]
[null,null,"006",44109,2,"محمد مسموع",8,"اناناس","حبة",30,10,300]
[null,null,"006",44109,2,"محمد مسموع",9,"اناناس","حبة",20,10,200]
[null,null,"006",44109,2,"محمد مسموع",10,"اناناس","حبة",10,10,100]
[null,null,"007",44110,2,"محمد مسموع",1,"خوخ ديزرت","كيلو",1500,5,7500]
[null,null,"007",44110,2,"محمد مسموع",2,"خوخ ديزرت","كيلو",1250,5,6250]
[null,null,"007",44110,2,"محمد مسموع",3,"خوخ ديزرت","كيلو",1000,5,5000]
[null,null,"007",44110,2,"محمد مسموع",4,"خوخ ديزرت","كيلو",750,5,3750]
[null,null,"007",44110,2,"محمد مسموع",5,"خوخ ديزرت","كيلو",500,5,2500]
[null,null,"007",44110,2,"محمد مسموع",6,"خوخ ديزرت","كيلو",250,5,1250]
[null,null,"007",44110,2,"محمد مسموع",7,"خوخ ديزرت","كيلو",100,5,500]
[null,null,"007",44110,2,"محمد مسموع",8,"خوخ ديزرت","كيلو",50,5,250]
[null,null,"007",44110,2,"محمد مسموع",9,"خوخ ديزرت","كيلو",25,5,125]
[null,null,"007",44110,2,"محمد مسموع",10,"خوخ ديزرت","كيلو",100,5,500]
[null,null,"009",44110,2,"محمد مسموع",1,"بطيخ","بالحبة",50,5,250]
[null,null,"009",44110,2,"محمد مسموع",2,"خوخ ديزرت","بالكيلو",20,7,140]
[null,null,"009",44110,2,"محمد مسموع",3,"موز بلدى","سباطة",30,5,150]
[null,{"$f":"IF(E39<>\"\",1+B38,\"\")","v":1},"009",44110,2,"محمد مسموع",4,"اناناس","بالحبة",20,5,100]
[null,2,"009",44110,2,"محمد مسموع",5,"بطيخ","بالحبة",40,5,200]
[null,3,"009",44110,2,"محمد مسموع",6,"خوخ ديزرت","بالكيلو",50,3,150]
[null,4,"009",44110,2,"محمد مسموع",7,"موز بلدى","سباطة",30,2,60]
[null,5,"009",44110,2,"محمد مسموع",8,"اناناس","بالحبة",50,5,250]
[null,6,"009",44110,2,"محمد مسموع",9,"بطيخ","بالحبة",50,2,100]
[null,7,"009",44110,2,"محمد مسموع",10,"خوخ ديزرت","بالكيلو",20,5,100]
[null,8,"009",44110,2,"محمد مسموع",1,"خوخ ديزرت","كيلو",50,5,250]
[null,"","","","","","",null,null,null,null,0]
[null,"","","","","","",null,null,null,null,0]
[null,"","","","","","",null,null,null,null,0]
[null,"","","","","","",null,null,null,null,0]
[null,"","","","","","",null,null,null,null,0]
[null,"","","","","","",null,null,null,null,0]
[null,"","","","","","",null,null,null,null,0]
[null,"","","","","","",null,null,null,null,0]
[null,"","","","","","",null,null,null,null,0]
[null,"",null,null,null,null,"استلمت جميع الاصناف بالفاتورة الموضحة أعلاه واصبحت قيمتها فى ذمتى وأمانتى لحين انتهاء السداد لها ",null,null,null,"اجمالى الفاتورة",250]
[null,"",null,null,null,null,null,null,null,null,"خصم الفاتورة"]
[null,"",null,null,null,null,null,null,null,null,"رهن بالفاتورة"]
[null,"",null,null,null,null,null,null,null,null,"صافى الفاتورة ",250]
[null,""]
[null,"",null,null,null,null,null,"المستلم ",null,null,"المحاسب","مدير المحل"]
[null,""]
[null,""]
[null,""]
[null,""]
[null,""]
[null,""]
[null,""]
[null,""]
[null,""]
[null,""]
[null,{"$f":"IF(E72<>\"\",1+B71,\"\")","v":""}]
[null,""]
[null,""]
[null,""]
[null,""]
[null,""]
[null,""]
[null,""]
[null,""]
[null,""]
[null,""]
[null,""]
[null,""]
[null,""]
[null,""]
[null,""]
[null,""]
[null,""]
[null,""]
[null,""]
[null,""]
[null,""]
[null,""]
[null,""]
[null,""]
[null,""]
[null,""]
[null,""]
[null,""]
[null,""]
[null,""]
[null,""]
[null,""]
[null,""]
[null,""]
[null,""]
[null,""]
[null,""]
[null,""]
[null,""]
[null,""]
[null,""]
[null,""]
[null,""]
[null,""]
[null,""]
[null,""]
[null,""]
[null,""]
[null,""]
[null,""]
[null,""]
[null,""]
[null,""]
[null,""]
[null,""]
[null,""]
[null,""]
[null,""]
[null,""]
[null,""]
[null,""]
[null,""]
[null,""]
[null,{"$f":"IF(E136<>\"\",1+B135,\"\")","v":""}]
[null,""]
[null,""]
[null,""]
[null,""]
[null,""]
[null,""]
[null,""]
[null,""]
[null,""]
[null,""]
[null,""]
[null,""]
[null,""]
[null,""]
[null,""]
[null,""]
[null,""]
[null,""]
[null,""]
[null,""]
[null,""]
[null,""]
[null,""]
[null,""]
[null,""]
[null,""]
[null,""]
[null,""]
[null,""]
[null,""]
[null,""]
[null,""]
[null,""]
[null,""]
[null,""]
[null,""]
[null,""]
[null,""]
[null,""]
[null,""]
[null,""]
[null,""]
[null,""]
[null,""]
[null,""]
[null,""]
[null,""]
[null,""]
[null,""]
[null,""]
[null,""]
[null,""]
[null,""]
[null,""]
[null,""]
[null,""]
[null,""]
[null,""]
[null,""]
[null,""]
[null,""]
[null,""]
[null,""]
[null,{"$f":"IF(E200<>\"\",1+B199,\"\")","v":""}]
[null,""]
[null,""]
[null,""]
[null,""]
[null,""]
[null,""]
[null,""]
[null,""]
[null,""]
[null,""]
[null,""]
[null,""]
[null,""]
[null,""]
[null,""]
[null,""]
[null,""]
[null,""]
[null,""]
[null,""]
[null,""]
[null,""]
[null,""]
[null,""]
[null,""]
[null,""]
[null,""]
[null,""]
[null,""]
[null,""]
[null,""]
[null,""]
[null,""]
[null,""]
[null,""]
[null,""]
[null,""]
[null,""]
[null,""]
[null,""]
[null,""]
[null,""]
[null,""]
[null,""]
[null,""]
[null,""]
[null,""]
[null,""]
[null,""]
[null,""]
[null,""]
[null,""]
[null,""]
[null,""]
[null,""]
[null,""]
[null,""]
[null,""]
[null,""]
[null,""]
[null,""]
[null,""]
[null,""]
[null,{"$f":"IF(E264<>\"\",1+B263,\"\")","v":""}]
[null,""]
[null,""]
[null,""]
[null,""]
[null,""]
[null,""]
[null,""]
[null,""]
[null,""]
[null,""]
[null,""]
[null,""]
[null,""]
[null,""]
[null,""]
[null,""]
[null,""]
[null,""]
[null,""]
[null,""]
[null,""]
[null,""]
[null,""]
[null,""]
[null,""]
[null,""]
[null,""]
[null,""]
[null,""]
[null,""]
[null,""]
[null,""]
[null,""]
[null,""]
[null,""]
[null,""]
[null,""]
[null,""]
[null,""]
[null,""]
[null,""]
[null,""]
[null,""]
[null,""]
[null,""]
[null,""]
[null,""]
[null,""]
[null,""]
[null,""]
[null,""]
[null,""]
[null,""]
[null,""]
[null,""]
[null,""]
[null,""]
[null,""]
[null,""]
[null,""]
[null,""]
[null,""]
[null,""]
[null,{"$f":"IF(E328<>\"\",1+B327,\"\")","v":""}]
[null,""]
[null,""]
[null,""]
[null,""]
[null,""]
[null,""]
[null,""]
[null,""]
[null,""]
[null,""]
[null,""]
[null,""]
[null,""]
[null,""]
[null,""]
[null,""]
[null,""]
[null,""]
[null,""]
[null,""]
[null,""]
[null,""]
[null,""]
[null,""]
[null,""]
[null,""]
[null,""]
[null,""]
[null,""]
[null,""]
[null,""]
[null,""]
[null,""]
[null,""]
[null,""]
[null,""]
[null,""]
[null,""]
[null,""]
[null,""]
[null,""]
[null,""]
[null,""]
[null,""]
[null,""]
[null,""]
[null,""]
[null,""]
[null,""]
[null,""]
[null,""]
[null,""]
[null,""]
[null,""]
[null,""]
[null,""]
[null,""]
[null,""]
[null,""]
[null,""]
[null,""]
[null,""]
[null,""]
[null,{"$f":"IF(E392<>\"\",1+B391,\"\")","v":""}]
[null,""]
[null,""]
[null,""]
[null,""]
[null,""]
[null,""]
[null,""]
[null,""]
{"$rows_left_out":1235}
{"sheet":"ورقة4","index":3,"n_rows":0,"n_cols":0,"rows_kept":0,"cut":false,"hidden":false,"merged":[]}

{"sheet":"ورقة5","index":4,"n_rows":0,"n_cols":0,"rows_kept":0,"cut":false,"hidden":false,"merged":[]}