{"text_format":"1","workbook":"xlsx","n_sheets":3,"sheets":["main","fasl","fasl2"],"not_rendered":{"charts":0,"images":0,"macros":1,"external_links":0,"defined_names":2,"comments":0,"pivot_tables":0},"unopened":[],"bounds":{"document_bytes":16777216,"sheet_cells":100000,"rows_first":2000,"rows_last":500,"rows_between":2000,"halvings":0,"cell_chars":16384,"cell_head_chars":4096},"cells_cut":0,"cells_raw":0,"read":"whole","date_system":"1900"}

{"sheet":"main","index":0,"n_rows":130,"n_cols":20,"rows_kept":130,"cut":false,"hidden":false,"merged":[[3,15,8,15]]}
[null,1]
["م","اسم الطالب","رقم الفصل","الرقم القومى","الفصل","تاريخ الميلاد","النوع","الديانة","حالة القيد",null,null,null,null,null,null,null,"دليل بنين","البنين","دليل البنات","البنات"]
[{"$f":"+IF(B3=\"\",\"\",SUBTOTAL(3,$B$3:B3))","v":1},"محمد 1",1,31111212900596,{"$f":"IF(C3=\"\",\"\",CONCATENATE($B$1,\" / \",C3))","v":"1 / 1"},{"$f":"IFERROR(DATE(LEFT(D3,1)*100+1700+MID(D3,2,2),MID(D3,4,2),MID(D3,6,2)),\"\")","v":"2011-11-21"},{"$f":"IFERROR(IF(MOD(MID(D3,13,1),2),\"ذكر\",\"أنثى\"),\"\")","v":"ذكر"},"مسلم ","مستجد",null,null,null,null,null,null,null,{"$f":"IF(AND(fasl!$K$1=main!E3,main!G3=\"ذكر\"),1,0)","v":1},{"$f":"IF(Q3=0,\"\",SUM($Q$3:Q3))","v":1},{"$f":"IF(AND(fasl!$K$1=main!E3,main!G3=\"أنثى\"),1,0)","v":0},{"$f":"IF(S3=0,\"\",SUM($S$3:S3))","v":""}]
[{"$f":"+IF(B4=\"\",\"\",SUBTOTAL(3,$B$3:B4))","v":2},"محمد 2",1,31201012902259,{"$f":"IF(C4=\"\",\"\",CONCATENATE($B$1,\" / \",C4))","v":"1 / 1"},{"$f":"IFERROR(DATE(LEFT(D4,1)*100+1700+MID(D4,2,2),MID(D4,4,2),MID(D4,6,2)),\"\")","v":"2012-01-01"},{"$f":"IFERROR(IF(MOD(MID(D4,13,1),2),\"ذكر\",\"أنثى\"),\"\")","v":"ذكر"},"مسلم ","مستجد",null,null,"1 / 1",1,"مسلم ","مستجد","استدعاء قوائم الفصول بمعادلة البحث\nindex&match\nفى شيت fasl\nاستدعاء القوائم عن طريق كود فى\nشيت fasl2\nوتوزيع التلاميذ حسب النوع (الذكور فى اليمين والبنات فى اليسار) مع اخفاء الصفوف الفارغة عند الطباعة\n",{"$f":"IF(AND(fasl!$K$1=main!E4,main!G4=\"ذكر\"),1,0)","v":1},{"$f":"IF(Q4=0,\"\",SUM($Q$3:Q4))","v":2},{"$f":"IF(AND(fasl!$K$1=main!E4,main!G4=\"أنثى\"),1,0)","v":0},{"$f":"IF(S4=0,\"\",SUM($S$3:S4))","v":""}]
[{"$f":"+IF(B5=\"\",\"\",SUBTOTAL(3,$B$3:B5))","v":3},"محمد 3",2,31201102900255,"1 / 2","2012-01-10","ذكر","مسلم ","مستجد",null,null,"1 / 2",2,"مسيحى","ناجح ومنقول",null,{"$f":"IF(AND(fasl!$K$1=main!E5,main!G5=\"ذكر\"),1,0)","v":0},{"$f":"IF(Q5=0,\"\",SUM($Q$3:Q5))","v":""},{"$f":"IF(AND(fasl!$K$1=main!E5,main!G5=\"أنثى\"),1,0)","v":0},{"$f":"IF(S5=0,\"\",SUM($S$3:S5))","v":""}]
[{"$f":"+IF(B6=\"\",\"\",SUBTOTAL(3,$B$3:B6))","v":4},"محمد 4",4,31206012900916,"1 / 4","2012-06-01","ذكر","مسلم ","مستجد",null,null,"1 / 3",3,null,"باق",null,{"$f":"IF(AND(fasl!$K$1=main!E6,main!G6=\"ذكر\"),1,0)","v":0},{"$f":"IF(Q6=0,\"\",SUM($Q$3:Q6))","v":""},{"$f":"IF(AND(fasl!$K$1=main!E6,main!G6=\"أنثى\"),1,0)","v":0},{"$f":"IF(S6=0,\"\",SUM($S$3:S6))","v":""}]
[{"$f":"+IF(B7=\"\",\"\",SUBTOTAL(3,$B$3:B7))","v":5},"محمد 5",1,31207152900211,"1 / 1","2012-07-15","ذكر","مسلم ","مستجد",null,null,"1 / 4",4,null,null,null,{"$f":"IF(AND(fasl!$K$1=main!E7,main!G7=\"ذكر\"),1,0)","v":1},{"$f":"IF(Q7=0,\"\",SUM($Q$3:Q7))","v":3},{"$f":"IF(AND(fasl!$K$1=main!E7,main!G7=\"أنثى\"),1,0)","v":0},{"$f":"IF(S7=0,\"\",SUM($S$3:S7))","v":""}]
[{"$f":"+IF(B8=\"\",\"\",SUBTOTAL(3,$B$3:B8))","v":6},"محمد 6",3,31205062900031,"1 / 3","2012-05-06","ذكر","مسلم ","مستجد",null,null,null,5,null,null,null,{"$f":"IF(AND(fasl!$K$1=main!E8,main!G8=\"ذكر\"),1,0)","v":0},{"$f":"IF(Q8=0,\"\",SUM($Q$3:Q8))","v":""},{"$f":"IF(AND(fasl!$K$1=main!E8,main!G8=\"أنثى\"),1,0)","v":0},{"$f":"IF(S8=0,\"\",SUM($S$3:S8))","v":""}]
[{"$f":"+IF(B9=\"\",\"\",SUBTOTAL(3,$B$3:B9))","v":7},"محمد 7",1,31201102900336,"1 / 1","2012-01-10","ذكر","مسلم ","مستجد",null,null,null,6,null,null,null,{"$f":"IF(AND(fasl!$K$1=main!E9,main!G9=\"ذكر\"),1,0)","v":1},{"$f":"IF(Q9=0,\"\",SUM($Q$3:Q9))","v":4},{"$f":"IF(AND(fasl!$K$1=main!E9,main!G9=\"أنثى\"),1,0)","v":0},{"$f":"IF(S9=0,\"\",SUM($S$3:S9))","v":""}]
[{"$f":"+IF(B10=\"\",\"\",SUBTOTAL(3,$B$3:B10))","v":8},"محمد 8",2,31112052901392,"1 / 2","2011-12-05","ذكر","مسلم ","مستجد",null,null,null,null,null,null,null,{"$f":"IF(AND(fasl!$K$1=main!E10,main!G10=\"ذكر\"),1,0)","v":0},{"$f":"IF(Q10=0,\"\",SUM($Q$3:Q10))","v":""},{"$f":"IF(AND(fasl!$K$1=main!E10,main!G10=\"أنثى\"),1,0)","v":0},{"$f":"IF(S10=0,\"\",SUM($S$3:S10))","v":""}]
[{"$f":"+IF(B11=\"\",\"\",SUBTOTAL(3,$B$3:B11))","v":9},"محمد 9",2,31202122900533,"1 / 2","2012-02-12","ذكر","مسلم ","مستجد",null,null,null,null,null,null,null,{"$f":"IF(AND(fasl!$K$1=main!E11,main!G11=\"ذكر\"),1,0)","v":0},{"$f":"IF(Q11=0,\"\",SUM($Q$3:Q11))","v":""},{"$f":"IF(AND(fasl!$K$1=main!E11,main!G11=\"أنثى\"),1,0)","v":0},{"$f":"IF(S11=0,\"\",SUM($S$3:S11))","v":""}]
[{"$f":"+IF(B12=\"\",\"\",SUBTOTAL(3,$B$3:B12))","v":10},"محمد 10",1,31110072900071,"1 / 1","2011-10-07","ذكر","مسلم ","مستجد",null,null,null,null,null,null,null,{"$f":"IF(AND(fasl!$K$1=main!E12,main!G12=\"ذكر\"),1,0)","v":1},{"$f":"IF(Q12=0,\"\",SUM($Q$3:Q12))","v":5},{"$f":"IF(AND(fasl!$K$1=main!E12,main!G12=\"أنثى\"),1,0)","v":0},{"$f":"IF(S12=0,\"\",SUM($S$3:S12))","v":""}]
[{"$f":"+IF(B13=\"\",\"\",SUBTOTAL(3,$B$3:B13))","v":11},"محمد 11",4,31112122900097,"1 / 4","2011-12-12","ذكر","مسلم ","مستجد",null,null,null,null,null,null,null,{"$f":"IF(AND(fasl!$K$1=main!E13,main!G13=\"ذكر\"),1,0)","v":0},{"$f":"IF(Q13=0,\"\",SUM($Q$3:Q13))","v":""},{"$f":"IF(AND(fasl!$K$1=main!E13,main!G13=\"أنثى\"),1,0)","v":0},{"$f":"IF(S13=0,\"\",SUM($S$3:S13))","v":""}]
[{"$f":"+IF(B14=\"\",\"\",SUBTOTAL(3,$B$3:B14))","v":12},"محمد 12",2,31205262900397,"1 / 2","2012-05-26","ذكر","مسلم ","مستجد",null,null,null,null,null,null,null,{"$f":"IF(AND(fasl!$K$1=main!E14,main!G14=\"ذكر\"),1,0)","v":0},{"$f":"IF(Q14=0,\"\",SUM($Q$3:Q14))","v":""},{"$f":"IF(AND(fasl!$K$1=main!E14,main!G14=\"أنثى\"),1,0)","v":0},{"$f":"IF(S14=0,\"\",SUM($S$3:S14))","v":""}]
[{"$f":"+IF(B15=\"\",\"\",SUBTOTAL(3,$B$3:B15))","v":13},"محمد 13",3,31209062900916,"1 / 3","2012-09-06","ذكر","مسلم ","مستجد",null,null,null,null,null,null,null,{"$f":"IF(AND(fasl!$K$1=main!E15,main!G15=\"ذكر\"),1,0)","v":0},{"$f":"IF(Q15=0,\"\",SUM($Q$3:Q15))","v":""},{"$f":"IF(AND(fasl!$K$1=main!E15,main!G15=\"أنثى\"),1,0)","v":0},{"$f":"IF(S15=0,\"\",SUM($S$3:S15))","v":""}]
[{"$f":"+IF(B16=\"\",\"\",SUBTOTAL(3,$B$3:B16))","v":14},"محمد 14",4,31208272900254,"1 / 4","2012-08-27","ذكر","مسلم ","مستجد",null,null,null,null,null,null,null,{"$f":"IF(AND(fasl!$K$1=main!E16,main!G16=\"ذكر\"),1,0)","v":0},{"$f":"IF(Q16=0,\"\",SUM($Q$3:Q16))","v":""},{"$f":"IF(AND(fasl!$K$1=main!E16,main!G16=\"أنثى\"),1,0)","v":0},{"$f":"IF(S16=0,\"\",SUM($S$3:S16))","v":""}]
[{"$f":"+IF(B17=\"\",\"\",SUBTOTAL(3,$B$3:B17))","v":15},"محمد 15",1,31203012900097,"1 / 1","2012-03-01","ذكر","مسلم ","مستجد",null,null,null,null,null,null,null,{"$f":"IF(AND(fasl!$K$1=main!E17,main!G17=\"ذكر\"),1,0)","v":1},{"$f":"IF(Q17=0,\"\",SUM($Q$3:Q17))","v":6},{"$f":"IF(AND(fasl!$K$1=main!E17,main!G17=\"أنثى\"),1,0)","v":0},{"$f":"IF(S17=0,\"\",SUM($S$3:S17))","v":""}]
[{"$f":"+IF(B18=\"\",\"\",SUBTOTAL(3,$B$3:B18))","v":16},"محمد 16",2,31207012900092,"1 / 2","2012-07-01","ذكر","مسلم ","مستجد",null,null,null,null,null,null,null,{"$f":"IF(AND(fasl!$K$1=main!E18,main!G18=\"ذكر\"),1,0)","v":0},{"$f":"IF(Q18=0,\"\",SUM($Q$3:Q18))","v":""},{"$f":"IF(AND(fasl!$K$1=main!E18,main!G18=\"أنثى\"),1,0)","v":0},{"$f":"IF(S18=0,\"\",SUM($S$3:S18))","v":""}]
[{"$f":"+IF(B19=\"\",\"\",SUBTOTAL(3,$B$3:B19))","v":17},"محمد 17",3,31210152900697,"1 / 3","2012-10-15","ذكر","مسلم ","مستجد",null,null,null,null,null,null,null,{"$f":"IF(AND(fasl!$K$1=main!E19,main!G19=\"ذكر\"),1,0)","v":0},{"$f":"IF(Q19=0,\"\",SUM($Q$3:Q19))","v":""},{"$f":"IF(AND(fasl!$K$1=main!E19,main!G19=\"أنثى\"),1,0)","v":0},{"$f":"IF(S19=0,\"\",SUM($S$3:S19))","v":""}]
[{"$f":"+IF(B20=\"\",\"\",SUBTOTAL(3,$B$3:B20))","v":18},"محمد 18",4,31209232900193,"1 / 4","2012-09-23","ذكر","مسلم ","مستجد",null,null,null,null,null,null,null,{"$f":"IF(AND(fasl!$K$1=main!E20,main!G20=\"ذكر\"),1,0)","v":0},{"$f":"IF(Q20=0,\"\",SUM($Q$3:Q20))","v":""},{"$f":"IF(AND(fasl!$K$1=main!E20,main!G20=\"أنثى\"),1,0)","v":0},{"$f":"IF(S20=0,\"\",SUM($S$3:S20))","v":""}]
{"$rows_left_out":111}
{"sheet":"fasl","index":1,"n_rows":51,"n_cols":15,"rows_kept":51,"cut":false,"hidden":false,"merged":[[29,7,29,9],[29,2,29,4],[0,1,0,2],[1,1,1,2],[0,3,0,5],[1,3,1,5],[2,2,2,4],[2,7,2,9]]}
[null,"ادارة",null,"مقيدون",null,null,"بنون",{"$f":"IFERROR(COUNTIF(C5:C29,\"ذكر\"),\"\")","v":10},"مسلم",{"$f":"IFERROR(COUNTIF(D5:D29,\"مسلم\")+COUNTIF(I5:I29,\"مسلم\"),\"\")","v":0},"1 / 1"]
[null,"مدرسة",null,{"$f":"COUNTA(B5:B29)+COUNTA(G5:G29)","v":50},null,null,"بنات",{"$f":"IFERROR(COUNTIF(H5:H29,\"انثى\"),\"\")","v":12},"مسيحى",{"$f":"IFERROR(COUNTIF(D6:D30,\"مسيحى\")+COUNTIF(I6:I30,\"مسيحى\"),\"\")","v":0}]
[null,"قائمة فصل (بنون)",{"$f":"K1","v":"1 / 1"},null,null,null,"قائمة فصل (بنات)",{"$f":"K1","v":"1 / 1"}]
["م","اسم الطالب","النوع","الديانة","حالة القيد","م","اسم الطالب","النوع","الديانة","حالة القيد"]
[{"$f":"+IF(B5=\"\",\"\",SUBTOTAL(3,$B$5:B5))","v":1},{"$f":"IFERROR(INDEX(main!$B$3:$B$84,MATCH(fasl!O5,main!$R$3:$R$130,0)),\"\")","v":"محمد 1"},{"$f":"IFERROR(VLOOKUP($B5,main!$B$3:$I$130,6,0),\"\")","v":"ذكر"},{"$f":"IFERROR(VLOOKUP($B5,main!$B$3:$I$130,7,0),\"\")","v":"مسلم "},{"$f":"IFERROR(VLOOKUP($B5,main!$B$3:$I$130,8,0),\"\")","v":"مستجد"},{"$f":"IF($G5=\"\",\"\",MAX($A$5:$A$29)+1)","v":11},{"$f":"IFERROR(INDEX(main!$B$3:$B$84,MATCH(fasl!O5,main!$T$3:$T$130,0)),\"\")","v":"رقيه "},{"$f":"IFERROR(VLOOKUP($G5,main!$B$3:$I$130,6,0),\"\")","v":"أنثى"},{"$f":"IFERROR(VLOOKUP($G5,main!$B$3:$I$130,7,0),\"\")","v":"مسلم "},{"$f":"IFERROR(VLOOKUP($G5,main!$B$3:$I$130,8,0),\"\")","v":"مستجد"},null,null,null,null,1]
[{"$f":"+IF(B6=\"\",\"\",SUBTOTAL(3,$B$5:B6))","v":2},{"$f":"IFERROR(INDEX(main!$B$3:$B$84,MATCH(fasl!O6,main!$R$3:$R$130,0)),\"\")","v":"محمد 2"},{"$f":"IFERROR(VLOOKUP($B6,main!$B$3:$I$130,6,0),\"\")","v":"ذكر"},{"$f":"IFERROR(VLOOKUP($B6,main!$B$3:$I$130,7,0),\"\")","v":"مسلم "},{"$f":"IFERROR(VLOOKUP($B6,main!$B$3:$I$130,8,0),\"\")","v":"مستجد"},{"$f":"IF($G6=\"\",\"\",F5+1)","v":12},{"$f":"IFERROR(INDEX(main!$B$3:$B$84,MATCH(fasl!O6,main!$T$3:$T$130,0)),\"\")","v":"رؤى "},{"$f":"IFERROR(VLOOKUP($G6,main!$B$3:$I$130,6,0),\"\")","v":"أنثى"},{"$f":"IFERROR(VLOOKUP($G6,main!$B$3:$I$130,7,0),\"\")","v":"مسلم "},{"$f":"IFERROR(VLOOKUP($G6,main!$B$3:$I$130,8,0),\"\")","v":"مستجد"},null,null,null,null,2]
[{"$f":"+IF(B7=\"\",\"\",SUBTOTAL(3,$B$5:B7))","v":3},{"$f":"IFERROR(INDEX(main!$B$3:$B$84,MATCH(fasl!O7,main!$R$3:$R$130,0)),\"\")","v":"محمد 5"},{"$f":"IFERROR(VLOOKUP($B7,main!$B$3:$I$130,6,0),\"\")","v":"ذكر"},{"$f":"IFERROR(VLOOKUP($B7,main!$B$3:$I$130,7,0),\"\")","v":"مسلم "},{"$f":"IFERROR(VLOOKUP($B7,main!$B$3:$I$130,8,0),\"\")","v":"مستجد"},{"$f":"IF($G7=\"\",\"\",F6+1)","v":13},{"$f":"IFERROR(INDEX(main!$B$3:$B$84,MATCH(fasl!O7,main!$T$3:$T$130,0)),\"\")","v":"ريم "},{"$f":"IFERROR(VLOOKUP($G7,main!$B$3:$I$130,6,0),\"\")","v":"أنثى"},{"$f":"IFERROR(VLOOKUP($G7,main!$B$3:$I$130,7,0),\"\")","v":"مسلم "},{"$f":"IFERROR(VLOOKUP($G7,main!$B$3:$I$130,8,0),\"\")","v":"مستجد"},null,null,null,null,3]
[{"$f":"+IF(B8=\"\",\"\",SUBTOTAL(3,$B$5:B8))","v":4},{"$f":"IFERROR(INDEX(main!$B$3:$B$84,MATCH(fasl!O8,main!$R$3:$R$130,0)),\"\")","v":"محمد 7"},{"$f":"IFERROR(VLOOKUP($B8,main!$B$3:$I$130,6,0),\"\")","v":"ذكر"},{"$f":"IFERROR(VLOOKUP($B8,main!$B$3:$I$130,7,0),\"\")","v":"مسلم "},{"$f":"IFERROR(VLOOKUP($B8,main!$B$3:$I$130,8,0),\"\")","v":"مستجد"},14,{"$f":"IFERROR(INDEX(main!$B$3:$B$84,MATCH(fasl!O8,main!$T$3:$T$130,0)),\"\")","v":"ساره "},{"$f":"IFERROR(VLOOKUP($G8,main!$B$3:$I$130,6,0),\"\")","v":"أنثى"},{"$f":"IFERROR(VLOOKUP($G8,main!$B$3:$I$130,7,0),\"\")","v":"مسلم "},{"$f":"IFERROR(VLOOKUP($G8,main!$B$3:$I$130,8,0),\"\")","v":"مستجد"},null,null,null,null,4]
[{"$f":"+IF(B9=\"\",\"\",SUBTOTAL(3,$B$5:B9))","v":5},{"$f":"IFERROR(INDEX(main!$B$3:$B$84,MATCH(fasl!O9,main!$R$3:$R$130,0)),\"\")","v":"محمد 10"},{"$f":"IFERROR(VLOOKUP($B9,main!$B$3:$I$130,6,0),\"\")","v":"ذكر"},{"$f":"IFERROR(VLOOKUP($B9,main!$B$3:$I$130,7,0),\"\")","v":"مسلم "},{"$f":"IFERROR(VLOOKUP($B9,main!$B$3:$I$130,8,0),\"\")","v":"مستجد"},15,{"$f":"IFERROR(INDEX(main!$B$3:$B$84,MATCH(fasl!O9,main!$T$3:$T$130,0)),\"\")","v":"سما "},{"$f":"IFERROR(VLOOKUP($G9,main!$B$3:$I$130,6,0),\"\")","v":"أنثى"},{"$f":"IFERROR(VLOOKUP($G9,main!$B$3:$I$130,7,0),\"\")","v":"مسلم "},{"$f":"IFERROR(VLOOKUP($G9,main!$B$3:$I$130,8,0),\"\")","v":"مستجد"},null,null,null,null,5]
[{"$f":"+IF(B10=\"\",\"\",SUBTOTAL(3,$B$5:B10))","v":6},{"$f":"IFERROR(INDEX(main!$B$3:$B$84,MATCH(fasl!O10,main!$R$3:$R$130,0)),\"\")","v":"محمد 15"},{"$f":"IFERROR(VLOOKUP($B10,main!$B$3:$I$130,6,0),\"\")","v":"ذكر"},{"$f":"IFERROR(VLOOKUP($B10,main!$B$3:$I$130,7,0),\"\")","v":"مسلم "},{"$f":"IFERROR(VLOOKUP($B10,main!$B$3:$I$130,8,0),\"\")","v":"مستجد"},16,{"$f":"IFERROR(INDEX(main!$B$3:$B$84,MATCH(fasl!O10,main!$T$3:$T$130,0)),\"\")","v":"سهام "},{"$f":"IFERROR(VLOOKUP($G10,main!$B$3:$I$130,6,0),\"\")","v":"أنثى"},{"$f":"IFERROR(VLOOKUP($G10,main!$B$3:$I$130,7,0),\"\")","v":"مسلم "},{"$f":"IFERROR(VLOOKUP($G10,main!$B$3:$I$130,8,0),\"\")","v":"مستجد"},null,null,null,null,6]
[{"$f":"+IF(B11=\"\",\"\",SUBTOTAL(3,$B$5:B11))","v":7},{"$f":"IFERROR(INDEX(main!$B$3:$B$84,MATCH(fasl!O11,main!$R$3:$R$130,0)),\"\")","v":"محمد 19"},{"$f":"IFERROR(VLOOKUP($B11,main!$B$3:$I$130,6,0),\"\")","v":"ذكر"},{"$f":"IFERROR(VLOOKUP($B11,main!$B$3:$I$130,7,0),\"\")","v":"مسلم "},{"$f":"IFERROR(VLOOKUP($B11,main!$B$3:$I$130,8,0),\"\")","v":"مستجد"},17,{"$f":"IFERROR(INDEX(main!$B$3:$B$84,MATCH(fasl!O11,main!$T$3:$T$130,0)),\"\")","v":"كوثر "},{"$f":"IFERROR(VLOOKUP($G11,main!$B$3:$I$130,6,0),\"\")","v":"أنثى"},{"$f":"IFERROR(VLOOKUP($G11,main!$B$3:$I$130,7,0),\"\")","v":"مسلم "},{"$f":"IFERROR(VLOOKUP($G11,main!$B$3:$I$130,8,0),\"\")","v":"مستجد"},null,null,null,null,7]
[{"$f":"+IF(B12=\"\",\"\",SUBTOTAL(3,$B$5:B12))","v":8},{"$f":"IFERROR(INDEX(main!$B$3:$B$84,MATCH(fasl!O12,main!$R$3:$R$130,0)),\"\")","v":"محمد 21"},{"$f":"IFERROR(VLOOKUP($B12,main!$B$3:$I$130,6,0),\"\")","v":"ذكر"},{"$f":"IFERROR(VLOOKUP($B12,main!$B$3:$I$130,7,0),\"\")","v":"مسلم "},{"$f":"IFERROR(VLOOKUP($B12,main!$B$3:$I$130,8,0),\"\")","v":"مستجد"},18,{"$f":"IFERROR(INDEX(main!$B$3:$B$84,MATCH(fasl!O12,main!$T$3:$T$130,0)),\"\")","v":"مروه "},{"$f":"IFERROR(VLOOKUP($G12,main!$B$3:$I$130,6,0),\"\")","v":"أنثى"},{"$f":"IFERROR(VLOOKUP($G12,main!$B$3:$I$130,7,0),\"\")","v":"مسلم "},{"$f":"IFERROR(VLOOKUP($G12,main!$B$3:$I$130,8,0),\"\")","v":"مستجد"},null,null,null,null,8]
[{"$f":"+IF(B13=\"\",\"\",SUBTOTAL(3,$B$5:B13))","v":9},{"$f":"IFERROR(INDEX(main!$B$3:$B$84,MATCH(fasl!O13,main!$R$3:$R$130,0)),\"\")","v":"محمد 27"},{"$f":"IFERROR(VLOOKUP($B13,main!$B$3:$I$130,6,0),\"\")","v":"ذكر"},{"$f":"IFERROR(VLOOKUP($B13,main!$B$3:$I$130,7,0),\"\")","v":"مسلم "},{"$f":"IFERROR(VLOOKUP($B13,main!$B$3:$I$130,8,0),\"\")","v":"مستجد"},19,{"$f":"IFERROR(INDEX(main!$B$3:$B$84,MATCH(fasl!O13,main!$T$3:$T$130,0)),\"\")","v":"ملوك "},{"$f":"IFERROR(VLOOKUP($G13,main!$B$3:$I$130,6,0),\"\")","v":"أنثى"},{"$f":"IFERROR(VLOOKUP($G13,main!$B$3:$I$130,7,0),\"\")","v":"مسلم "},{"$f":"IFERROR(VLOOKUP($G13,main!$B$3:$I$130,8,0),\"\")","v":"مستجد"},null,null,null,null,9]
[{"$f":"+IF(B14=\"\",\"\",SUBTOTAL(3,$B$5:B14))","v":10},{"$f":"IFERROR(INDEX(main!$B$3:$B$84,MATCH(fasl!O14,main!$R$3:$R$130,0)),\"\")","v":"محمد 33"},{"$f":"IFERROR(VLOOKUP($B14,main!$B$3:$I$130,6,0),\"\")","v":"ذكر"},{"$f":"IFERROR(VLOOKUP($B14,main!$B$3:$I$130,7,0),\"\")","v":"مسلم "},{"$f":"IFERROR(VLOOKUP($B14,main!$B$3:$I$130,8,0),\"\")","v":"مستجد"},20,{"$f":"IFERROR(INDEX(main!$B$3:$B$84,MATCH(fasl!O14,main!$T$3:$T$130,0)),\"\")","v":"هدى 1"},{"$f":"IFERROR(VLOOKUP($G14,main!$B$3:$I$130,6,0),\"\")","v":"أنثى"},{"$f":"IFERROR(VLOOKUP($G14,main!$B$3:$I$130,7,0),\"\")","v":"مسلم "},{"$f":"IFERROR(VLOOKUP($G14,main!$B$3:$I$130,8,0),\"\")","v":"مستجد"},null,null,null,null,10]
[{"$f":"+IF(B15=\"\",\"\",SUBTOTAL(3,$B$5:B15))","v":""},{"$f":"IFERROR(INDEX(main!$B$3:$B$84,MATCH(fasl!O15,main!$R$3:$R$130,0)),\"\")","v":""},{"$f":"IFERROR(VLOOKUP($B15,main!$B$3:$I$130,6,0),\"\")","v":""},{"$f":"IFERROR(VLOOKUP($B15,main!$B$3:$I$130,7,0),\"\")","v":""},{"$f":"IFERROR(VLOOKUP($B15,main!$B$3:$I$130,8,0),\"\")","v":""},21,{"$f":"IFERROR(INDEX(main!$B$3:$B$84,MATCH(fasl!O15,main!$T$3:$T$130,0)),\"\")","v":"هدى 3"},{"$f":"IFERROR(VLOOKUP($G15,main!$B$3:$I$130,6,0),\"\")","v":"أنثى"},{"$f":"IFERROR(VLOOKUP($G15,main!$B$3:$I$130,7,0),\"\")","v":"مسلم "},{"$f":"IFERROR(VLOOKUP($G15,main!$B$3:$I$130,8,0),\"\")","v":"مستجد"},null,null,null,null,11]
[{"$f":"+IF(B16=\"\",\"\",SUBTOTAL(3,$B$5:B16))","v":""},{"$f":"IFERROR(INDEX(main!$B$3:$B$84,MATCH(fasl!O16,main!$R$3:$R$130,0)),\"\")","v":""},{"$f":"IFERROR(VLOOKUP($B16,main!$B$3:$I$130,6,0),\"\")","v":""},{"$f":"IFERROR(VLOOKUP($B16,main!$B$3:$I$130,7,0),\"\")","v":""},{"$f":"IFERROR(VLOOKUP($B16,main!$B$3:$I$130,8,0),\"\")","v":""},22,{"$f":"IFERROR(INDEX(main!$B$3:$B$84,MATCH(fasl!O16,main!$T$3:$T$130,0)),\"\")","v":"هدى 5"},{"$f":"IFERROR(VLOOKUP($G16,main!$B$3:$I$130,6,0),\"\")","v":"أنثى"},{"$f":"IFERROR(VLOOKUP($G16,main!$B$3:$I$130,7,0),\"\")","v":"مسلم "},{"$f":"IFERROR(VLOOKUP($G16,main!$B$3:$I$130,8,0),\"\")","v":"مستجد"},null,null,null,null,12]
[{"$f":"+IF(B17=\"\",\"\",SUBTOTAL(3,$B$5:B17))","v":""},{"$f":"IFERROR(INDEX(main!$B$3:$B$84,MATCH(fasl!O17,main!$R$3:$R$130,0)),\"\")","v":""},{"$f":"IFERROR(VLOOKUP($B17,main!$B$3:$I$130,6,0),\"\")","v":""},{"$f":"IFERROR(VLOOKUP($B17,main!$B$3:$I$130,7,0),\"\")","v":""},{"$f":"IFERROR(VLOOKUP($B17,main!$B$3:$I$130,8,0),\"\")","v":""},"",{"$f":"IFERROR(INDEX(main!$B$3:$B$84,MATCH(fasl!O17,main!$T$3:$T$130,0)),\"\")","v":""},{"$f":"IFERROR(VLOOKUP($G17,main!$B$3:$I$130,6,0),\"\")","v":""},{"$f":"IFERROR(VLOOKUP($G17,main!$B$3:$I$130,7,0),\"\")","v":""},{"$f":"IFERROR(VLOOKUP($G17,main!$B$3:$I$130,8,0),\"\")","v":""},null,null,null,null,13]
[{"$f":"+IF(B18=\"\",\"\",SUBTOTAL(3,$B$5:B18))","v":""},{"$f":"IFERROR(INDEX(main!$B$3:$B$84,MATCH(fasl!O18,main!$R$3:$R$130,0)),\"\")","v":""},{"$f":"IFERROR(VLOOKUP($B18,main!$B$3:$I$130,6,0),\"\")","v":""},{"$f":"IFERROR(VLOOKUP($B18,main!$B$3:$I$130,7,0),\"\")","v":""},{"$f":"IFERROR(VLOOKUP($B18,main!$B$3:$I$130,8,0),\"\")","v":""},"",{"$f":"IFERROR(INDEX(main!$B$3:$B$84,MATCH(fasl!O18,main!$T$3:$T$130,0)),\"\")","v":""},{"$f":"IFERROR(VLOOKUP($G18,main!$B$3:$I$130,6,0),\"\")","v":""},{"$f":"IFERROR(VLOOKUP($G18,main!$B$3:$I$130,7,0),\"\")","v":""},{"$f":"IFERROR(VLOOKUP($G18,main!$B$3:$I$130,8,0),\"\")","v":""},null,null,null,null,14]
[{"$f":"+IF(B19=\"\",\"\",SUBTOTAL(3,$B$5:B19))","v":""},{"$f":"IFERROR(INDEX(main!$B$3:$B$84,MATCH(fasl!O19,main!$R$3:$R$130,0)),\"\")","v":""},{"$f":"IFERROR(VLOOKUP($B19,main!$B$3:$I$130,6,0),\"\")","v":""},{"$f":"IFERROR(VLOOKUP($B19,main!$B$3:$I$130,7,0),\"\")","v":""},{"$f":"IFERROR(VLOOKUP($B19,main!$B$3:$I$130,8,0),\"\")","v":""},"",{"$f":"IFERROR(INDEX(main!$B$3:$B$84,MATCH(fasl!O19,main!$T$3:$T$130,0)),\"\")","v":""},{"$f":"IFERROR(VLOOKUP($G19,main!$B$3:$I$130,6,0),\"\")","v":""},{"$f":"IFERROR(VLOOKUP($G19,main!$B$3:$I$130,7,0),\"\")","v":""},{"$f":"IFERROR(VLOOKUP($G19,main!$B$3:$I$130,8,0),\"\")","v":""},null,null,null,null,15]
[{"$f":"+IF(B20=\"\",\"\",SUBTOTAL(3,$B$5:B20))","v":""},{"$f":"IFERROR(INDEX(main!$B$3:$B$84,MATCH(fasl!O20,main!$R$3:$R$130,0)),\"\")","v":""},{"$f":"IFERROR(VLOOKUP($B20,main!$B$3:$I$130,6,0),\"\")","v":""},{"$f":"IFERROR(VLOOKUP($B20,main!$B$3:$I$130,7,0),\"\")","v":""},{"$f":"IFERROR(VLOOKUP($B20,main!$B$3:$I$130,8,0),\"\")","v":""},"",{"$f":"IFERROR(INDEX(main!$B$3:$B$84,MATCH(fasl!O20,main!$T$3:$T$130,0)),\"\")","v":""},{"$f":"IFERROR(VLOOKUP($G20,main!$B$3:$I$130,6,0),\"\")","v":""},{"$f":"IFERROR(VLOOKUP($G20,main!$B$3:$I$130,7,0),\"\")","v":""},{"$f":"IFERROR(VLOOKUP($G20,main!$B$3:$I$130,8,0),\"\")","v":""},null,null,null,null,16]
{"$rows_left_out":32}
{"sheet":"fasl2","index":2,"n_rows":14,"n_cols":11,"rows_kept":14,"cut":false,"hidden":false,"merged":[[29,2,29,4],[29,7,29,9],[0,1,0,2],[0,3,0,5],[1,1,1,2],[1,3,1,5],[2,2,2,4],[2,7,2,9]]}
[null,"ادارة",null,"مقيدون",null,null,"بنون",{"$f":"IFERROR(COUNTIF(C5:C29,\"ذكر\"),\"\")","v":9},"مسلم",{"$f":"IFERROR(COUNTIF(D5:D29,\"مسلم\")+COUNTIF(I5:I29,\"مسلم\"),\"\")","v":0},"1 / 3"]
[null,"مدرسة",null,{"$f":"COUNTA(B5:B29)+COUNTA(G5:G29)","v":19},null,null,"بنات",{"$f":"IFERROR(COUNTIF(H5:H29,\"انثى\"),\"\")","v":10},"مسيحى",{"$f":"IFERROR(COUNTIF(D6:D30,\"مسيحى\")+COUNTIF(I6:I30,\"مسيحى\"),\"\")","v":0}]
[null,"قائمة فصل (بنون)",{"$f":"K1","v":"1 / 3"},null,null,null,"قائمة فصل (بنات)",{"$f":"K1","v":"1 / 3"}]
["م","اسم الطالب","النوع","الديانة","حالة القيد","م","اسم الطالب","النوع","الديانة","حالة القيد"]
[1,"محمد 6","ذكر","مسلم ","مستجد",10,"روان ","أنثى","مسلم ","مستجد"]
[2,"محمد 13","ذكر","مسلم ","مستجد",11,"روقيه ","أنثى","مسلم ","مستجد"]
[3,"محمد 17","ذكر","مسلم ","مستجد",12,"ريماس ","أنثى","مسلم ","مستجد"]
[4,"محمد 23","ذكر","مسلم ","مستجد",13,"سجده ","أنثى","مسلم ","مستجد"]
[5,"محمد 25","ذكر","مسلم ","مستجد",14,"شهد ","أنثى","مسلم ","مستجد"]
[6,"محمد 26","ذكر","مسلم ","مستجد",15,"شيماء ","أنثى","مسلم ","مستجد"]
[7,"محمد 31","ذكر","مسلم ","مستجد",16,"لمياء ","أنثى","مسلم ","مستجد"]
[8,"محمد 34","ذكر","مسلم ","مستجد",17,"ملك ","أنثى","مسلم ","مستجد"]
[9,"محمد 38","ذكر","مسلم ","مستجد",18,"مى ","أنثى","مسلم ","مستجد"]
[null,null,null,null,null,19,"هدى 4","أنثى","مسلم ","مستجد"]