{"text_format":"1","workbook":"xlsx","n_sheets":7,"sheets":["الرئيسية","فاتورة","المخزون","وارد","PivotTable","ملخص مبيعات","بحث"],"not_rendered":{"charts":0,"images":2,"macros":1,"external_links":1,"defined_names":6,"comments":0,"pivot_tables":1},"unopened":[],"bounds":{"document_bytes":16777216,"sheet_cells":100000,"rows_first":2000,"rows_last":500,"rows_between":2000,"halvings":0,"cell_chars":16384,"cell_head_chars":4096},"cells_cut":0,"cells_raw":0,"read":"whole","date_system":"1900"}

{"sheet":"الرئيسية","index":0,"n_rows":19,"n_cols":14,"rows_kept":19,"cut":false,"hidden":false,"merged":[[17,13,17,17],[18,13,18,17]]}
[]
[]
[]
[]
[]
[]
[]
[]
[]
[]
[]
[]
[]
[]
[]
[]
[]
[null,null," ",null,null,null,null,null,null,null,null,null,null,"Best Regards"]
[null,null,null,null,null,null,null,null,null,null,null,null,null,"Mr.Emad"]

{"sheet":"فاتورة","index":1,"n_rows":19,"n_cols":20,"rows_kept":19,"cut":false,"hidden":false,"merged":[[12,1,12,5],[13,1,13,5],[16,1,16,6],[3,3,3,6],[2,3,2,6],[4,1,4,2],[4,3,4,6],[1,3,1,6],[3,1,3,2],[0,1,0,6],[1,1,1,2],[2,1,2,2]]}
[null,"Sales Invoice"]
[null,"رقم الفاتورة ",null,{"$f":"MAX('ملخص مبيعات'!$A:$A)+1","v":29},null,null,null,null,null,null,null,null,null,null,null,null,null,null,null,"wesam"]
[null,"التاريخ",null,{"$f":"TODAY()","v":"2020-11-01"},null,null,null,null,null,null,null,null,null,null,null,null,null,null,null,"ahmed"]
[null,"اسم العميل"]
[null,"رقم الموبايل"]
[null,null,null,null,null,"المستخدم:-","wesam"]
[null,"م","اسم الصنف","كود","كميه","السعر","الاجمالى "," الشراء","الربح",null,"رقم الفاتورة ","التاريخ","اسم العميل","رقم الموبايل","اسم الصنف","كود","كميه","السعر","الاجمالى "]
[null,{"$f":"IF(C8=\"\",\"\",1)","v":""},null,{"$f":"IFERROR(VLOOKUP(C8,المخزون!A:B,2,0),\"\")","v":""},null,{"$f":"IFERROR(VLOOKUP(C8,المخزون!A:F,6,0),0)","v":0},{"$f":"PRODUCT(F8,E8)","v":0},{"$f":"IFERROR(VLOOKUP(C8,وارد!A:D,4,0),\"0\")","v":"0"},{"$f":"(F8*E8)-(H8*E8)","v":0},null,{"$f":"$D$2","v":29},{"$f":"$D$3","v":"2020-11-01"},{"$f":"$D$4","v":0},{"$f":"$D$5","v":0},{"$f":"C8","v":0},"",0,0,0]
[null,{"$f":"IF(C9=\"\",\"\",B8+1)","v":""},null,{"$f":"IFERROR(VLOOKUP(C9,المخزون!A:B,2,0),\"\")","v":""},null,{"$f":"IFERROR(VLOOKUP(C9,المخزون!A:F,6,0),0)","v":0},0,{"$f":"IFERROR(VLOOKUP(C9,وارد!A:D,4,0),\"0\")","v":"0"},{"$f":"(F9*E9)-(H9*E9)","v":0},null,{"$f":"$D$2","v":29},{"$f":"$D$3","v":"2020-11-01"},{"$f":"$D$4","v":0},{"$f":"$D$5","v":0},0,"",0,0,0]
[null,{"$f":"IF(C10=\"\",\"\",B9+1)","v":""},null,{"$f":"IFERROR(VLOOKUP(C10,المخزون!A:B,2,0),\"\")","v":""},null,{"$f":"IFERROR(VLOOKUP(C10,المخزون!A:F,6,0),0)","v":0},0,{"$f":"IFERROR(VLOOKUP(C10,وارد!A:D,4,0),\"0\")","v":"0"},0,null,29,"2020-11-01",0,0,0,"",0,0,0]
[null,"",null,{"$f":"IFERROR(VLOOKUP(C11,المخزون!A:B,2,0),\"\")","v":""},null,{"$f":"IFERROR(VLOOKUP(C11,المخزون!A:F,6,0),0)","v":0},0,{"$f":"IFERROR(VLOOKUP(C11,وارد!A:D,4,0),\"0\")","v":"0"},0,null,29,"2020-11-01",0,0,0,"",0,0,0]
[null,"",null,{"$f":"IFERROR(VLOOKUP(C12,المخزون!A:B,2,0),\"\")","v":""},null,{"$f":"IFERROR(VLOOKUP(C12,المخزون!A:F,6,0),0)","v":0},0,{"$f":"IFERROR(VLOOKUP(C12,وارد!A:D,4,0),\"0\")","v":"0"},0,null,29,"2020-11-01",0,0,0,"",0,0,0]
[null,"خصم",null,null,null,null,null,null,{"$f":"SUM(I8:I12)","v":0},null,29,"2020-11-01",0,0,{"$f":"B13","v":"خصم"},{"$f":"D13","v":0},0,0,0]
[null,"إجمالى الفاتورة",null,null,null,null,{"$f":"SUM(G8:G12)-G13","v":0},null,null,null,29,"2020-11-01",0,0,{"$f":"B14","v":"إجمالى الفاتورة"},0,0,0,0]
[null,"الربح",null,null,null,null,{"$f":"I13-G13","v":0},null,null,null,29,"2020-11-01",0,0,{"$f":"B15","v":"الربح"},{"$f":"D15","v":0},{"$f":"E15","v":0},{"$f":"F15","v":0},{"$f":"G15","v":0}]
[]
[null,{"$f":"[1]!tafket(G14,\"جنيه\",\"قرش\")","v":"صفر"}]
[]
[null,null,null,null,null,{"$f":"NOW()","v":44136.653649537038}]

{"sheet":"المخزون","index":2,"n_rows":153,"n_cols":13,"rows_kept":153,"cut":false,"hidden":false,"merged":[]}
[]
[null,null,null,null,null,null,null,null,{"$f":"SUM(I4:I1048576)-'ملخص مبيعات'!M3","v":4410},"الربح بع الخصم"]
["اسم الصنف","كود الصنف","وارد  ","سعر الوارد","منصرف","سعر البيع","رصيد أخر","قيمة رصيد اخر تكلفة","الربح قبل الخصم",null,null,null,{"$f":"SUMIF(A:A,A4,G:G)>=0","v":true}]
[1,1,{"$f":"SUMIF(وارد!A:A,المخزون!A4,وارد!C:C)","v":10},{"$f":"IFERROR(VLOOKUP(A4,وارد!A:D,4,0),\"0\")","v":100},{"$f":"SUMIF('ملخص مبيعات'!E:E,المخزون!A4,'ملخص مبيعات'!G:G)","v":5},{"$f":"IFERROR(VLOOKUP(A4,وارد!A:F,6,0),\"0\")","v":150},{"$f":"C4-E4","v":5},{"$f":"G4*D4","v":500},{"$f":"(E4*F4)-(E4*D4)","v":250}]
[2,2,{"$f":"SUMIF(وارد!A:A,المخزون!A5,وارد!C:C)","v":11},{"$f":"IFERROR(VLOOKUP(A5,وارد!A:D,4,0),\"0\")","v":75},{"$f":"SUMIF('ملخص مبيعات'!E:E,المخزون!A5,'ملخص مبيعات'!G:G)","v":10},{"$f":"IFERROR(VLOOKUP(A5,وارد!A:F,6,0),\"0\")","v":130},{"$f":"C5-E5","v":1},{"$f":"G5*D5","v":75},{"$f":"(E5*F5)-(E5*D5)","v":550}]
[3,3,{"$f":"SUMIF(وارد!A:A,المخزون!A6,وارد!C:C)","v":10},{"$f":"IFERROR(VLOOKUP(A6,وارد!A:D,4,0),\"0\")","v":85},{"$f":"SUMIF('ملخص مبيعات'!E:E,المخزون!A6,'ملخص مبيعات'!G:G)","v":8},{"$f":"IFERROR(VLOOKUP(A6,وارد!A:F,6,0),\"0\")","v":130},2,170,360]
[4,4,{"$f":"SUMIF(وارد!A:A,المخزون!A7,وارد!C:C)","v":10},{"$f":"IFERROR(VLOOKUP(A7,وارد!A:D,4,0),\"0\")","v":100},{"$f":"SUMIF('ملخص مبيعات'!E:E,المخزون!A7,'ملخص مبيعات'!G:G)","v":9},{"$f":"IFERROR(VLOOKUP(A7,وارد!A:F,6,0),\"0\")","v":150},1,100,450]
[5,5,{"$f":"SUMIF(وارد!A:A,المخزون!A8,وارد!C:C)","v":9},{"$f":"IFERROR(VLOOKUP(A8,وارد!A:D,4,0),\"0\")","v":100},{"$f":"SUMIF('ملخص مبيعات'!E:E,المخزون!A8,'ملخص مبيعات'!G:G)","v":9},{"$f":"IFERROR(VLOOKUP(A8,وارد!A:F,6,0),\"0\")","v":150},0,0,450]
[6,6,{"$f":"SUMIF(وارد!A:A,المخزون!A9,وارد!C:C)","v":12},{"$f":"IFERROR(VLOOKUP(A9,وارد!A:D,4,0),\"0\")","v":125},{"$f":"SUMIF('ملخص مبيعات'!E:E,المخزون!A9,'ملخص مبيعات'!G:G)","v":11},{"$f":"IFERROR(VLOOKUP(A9,وارد!A:F,6,0),\"0\")","v":175},1,125,550]
[7,7,{"$f":"SUMIF(وارد!A:A,المخزون!A10,وارد!C:C)","v":10},{"$f":"IFERROR(VLOOKUP(A10,وارد!A:D,4,0),\"0\")","v":150},{"$f":"SUMIF('ملخص مبيعات'!E:E,المخزون!A10,'ملخص مبيعات'!G:G)","v":7},{"$f":"IFERROR(VLOOKUP(A10,وارد!A:F,6,0),\"0\")","v":200},3,450,350]
[8,8,{"$f":"SUMIF(وارد!A:A,المخزون!A11,وارد!C:C)","v":10},{"$f":"IFERROR(VLOOKUP(A11,وارد!A:D,4,0),\"0\")","v":130},{"$f":"SUMIF('ملخص مبيعات'!E:E,المخزون!A11,'ملخص مبيعات'!G:G)","v":7},{"$f":"IFERROR(VLOOKUP(A11,وارد!A:F,6,0),\"0\")","v":200},3,390,490]
[9,9,{"$f":"SUMIF(وارد!A:A,المخزون!A12,وارد!C:C)","v":10},{"$f":"IFERROR(VLOOKUP(A12,وارد!A:D,4,0),\"0\")","v":85},{"$f":"SUMIF('ملخص مبيعات'!E:E,المخزون!A12,'ملخص مبيعات'!G:G)","v":6},{"$f":"IFERROR(VLOOKUP(A12,وارد!A:F,6,0),\"0\")","v":130},4,340,270]
[10,10,{"$f":"SUMIF(وارد!A:A,المخزون!A13,وارد!C:C)","v":10},{"$f":"IFERROR(VLOOKUP(A13,وارد!A:D,4,0),\"0\")","v":85},{"$f":"SUMIF('ملخص مبيعات'!E:E,المخزون!A13,'ملخص مبيعات'!G:G)","v":3},{"$f":"IFERROR(VLOOKUP(A13,وارد!A:F,6,0),\"0\")","v":130},7,595,135]
[11,11,{"$f":"SUMIF(وارد!A:A,المخزون!A14,وارد!C:C)","v":5},{"$f":"IFERROR(VLOOKUP(A14,وارد!A:D,4,0),\"0\")","v":125},{"$f":"SUMIF('ملخص مبيعات'!E:E,المخزون!A14,'ملخص مبيعات'!G:G)","v":1},{"$f":"IFERROR(VLOOKUP(A14,وارد!A:F,6,0),\"0\")","v":200},4,500,75]
[12,12,{"$f":"SUMIF(وارد!A:A,المخزون!A15,وارد!C:C)","v":5},{"$f":"IFERROR(VLOOKUP(A15,وارد!A:D,4,0),\"0\")","v":100},{"$f":"SUMIF('ملخص مبيعات'!E:E,المخزون!A15,'ملخص مبيعات'!G:G)","v":2},{"$f":"IFERROR(VLOOKUP(A15,وارد!A:F,6,0),\"0\")","v":175},3,300,150]
[13,13,{"$f":"SUMIF(وارد!A:A,المخزون!A16,وارد!C:C)","v":5},{"$f":"IFERROR(VLOOKUP(A16,وارد!A:D,4,0),\"0\")","v":75},{"$f":"SUMIF('ملخص مبيعات'!E:E,المخزون!A16,'ملخص مبيعات'!G:G)","v":2},{"$f":"IFERROR(VLOOKUP(A16,وارد!A:F,6,0),\"0\")","v":150},3,225,150]
[14,14,{"$f":"SUMIF(وارد!A:A,المخزون!A17,وارد!C:C)","v":5},{"$f":"IFERROR(VLOOKUP(A17,وارد!A:D,4,0),\"0\")","v":130},{"$f":"SUMIF('ملخص مبيعات'!E:E,المخزون!A17,'ملخص مبيعات'!G:G)","v":1},{"$f":"IFERROR(VLOOKUP(A17,وارد!A:F,6,0),\"0\")","v":220},4,520,90]
[15,15,{"$f":"SUMIF(وارد!A:A,المخزون!A18,وارد!C:C)","v":5},{"$f":"IFERROR(VLOOKUP(A18,وارد!A:D,4,0),\"0\")","v":140},{"$f":"SUMIF('ملخص مبيعات'!E:E,المخزون!A18,'ملخص مبيعات'!G:G)","v":2},{"$f":"IFERROR(VLOOKUP(A18,وارد!A:F,6,0),\"0\")","v":220},3,420,160]
[16,16,{"$f":"SUMIF(وارد!A:A,المخزون!A19,وارد!C:C)","v":5},{"$f":"IFERROR(VLOOKUP(A19,وارد!A:D,4,0),\"0\")","v":100},{"$f":"SUMIF('ملخص مبيعات'!E:E,المخزون!A19,'ملخص مبيعات'!G:G)","v":2},{"$f":"IFERROR(VLOOKUP(A19,وارد!A:F,6,0),\"0\")","v":170},3,300,140]
[17,17,{"$f":"SUMIF(وارد!A:A,المخزون!A20,وارد!C:C)","v":5},{"$f":"IFERROR(VLOOKUP(A20,وارد!A:D,4,0),\"0\")","v":150},{"$f":"SUMIF('ملخص مبيعات'!E:E,المخزون!A20,'ملخص مبيعات'!G:G)","v":2},{"$f":"IFERROR(VLOOKUP(A20,وارد!A:F,6,0),\"0\")","v":210},3,450,120]
[18,18,{"$f":"SUMIF(وارد!A:A,المخزون!A21,وارد!C:C)","v":5},{"$f":"IFERROR(VLOOKUP(A21,وارد!A:D,4,0),\"0\")","v":150},{"$f":"SUMIF('ملخص مبيعات'!E:E,المخزون!A21,'ملخص مبيعات'!G:G)","v":2},{"$f":"IFERROR(VLOOKUP(A21,وارد!A:F,6,0),\"0\")","v":220},3,450,140]
[19,19,{"$f":"SUMIF(وارد!A:A,المخزون!A22,وارد!C:C)","v":5},{"$f":"IFERROR(VLOOKUP(A22,وارد!A:D,4,0),\"0\")","v":150},null,{"$f":"IFERROR(VLOOKUP(A22,وارد!A:F,6,0),\"0\")","v":230},5,750,0]
[20,20,{"$f":"SUMIF(وارد!A:A,المخزون!A23,وارد!C:C)","v":0},{"$f":"IFERROR(VLOOKUP(A23,وارد!A:D,4,0),\"0\")","v":"0"},null,{"$f":"IFERROR(VLOOKUP(A23,وارد!A:F,6,0),\"0\")","v":"0"},0,0,0]
[21,21,{"$f":"SUMIF(وارد!A:A,المخزون!A24,وارد!C:C)","v":0},{"$f":"IFERROR(VLOOKUP(A24,وارد!A:D,4,0),\"0\")","v":"0"},null,{"$f":"IFERROR(VLOOKUP(A24,وارد!A:F,6,0),\"0\")","v":"0"},0,0,0]
[22,22,{"$f":"SUMIF(وارد!A:A,المخزون!A25,وارد!C:C)","v":0},{"$f":"IFERROR(VLOOKUP(A25,وارد!A:D,4,0),\"0\")","v":"0"},null,{"$f":"IFERROR(VLOOKUP(A25,وارد!A:F,6,0),\"0\")","v":"0"},0,0,0]
[23,23,{"$f":"SUMIF(وارد!A:A,المخزون!A26,وارد!C:C)","v":0},{"$f":"IFERROR(VLOOKUP(A26,وارد!A:D,4,0),\"0\")","v":"0"},null,{"$f":"IFERROR(VLOOKUP(A26,وارد!A:F,6,0),\"0\")","v":"0"},0,0,0]
[24,24,{"$f":"SUMIF(وارد!A:A,المخزون!A27,وارد!C:C)","v":0},{"$f":"IFERROR(VLOOKUP(A27,وارد!A:D,4,0),\"0\")","v":"0"},null,{"$f":"IFERROR(VLOOKUP(A27,وارد!A:F,6,0),\"0\")","v":"0"},0,0,0]
[25,25,{"$f":"SUMIF(وارد!A:A,المخزون!A28,وارد!C:C)","v":0},{"$f":"IFERROR(VLOOKUP(A28,وارد!A:D,4,0),\"0\")","v":"0"},null,{"$f":"IFERROR(VLOOKUP(A28,وارد!A:F,6,0),\"0\")","v":"0"},0,0,0]
[26,26,{"$f":"SUMIF(وارد!A:A,المخزون!A29,وارد!C:C)","v":0},{"$f":"IFERROR(VLOOKUP(A29,وارد!A:D,4,0),\"0\")","v":"0"},null,{"$f":"IFERROR(VLOOKUP(A29,وارد!A:F,6,0),\"0\")","v":"0"},0,0,0]
[27,27,{"$f":"SUMIF(وارد!A:A,المخزون!A30,وارد!C:C)","v":0},{"$f":"IFERROR(VLOOKUP(A30,وارد!A:D,4,0),\"0\")","v":"0"},null,{"$f":"IFERROR(VLOOKUP(A30,وارد!A:F,6,0),\"0\")","v":"0"},0,0,0]
[28,28,{"$f":"SUMIF(وارد!A:A,المخزون!A31,وارد!C:C)","v":0},{"$f":"IFERROR(VLOOKUP(A31,وارد!A:D,4,0),\"0\")","v":"0"},null,{"$f":"IFERROR(VLOOKUP(A31,وارد!A:F,6,0),\"0\")","v":"0"},0,0,0]
[29,29,{"$f":"SUMIF(وارد!A:A,المخزون!A32,وارد!C:C)","v":0},{"$f":"IFERROR(VLOOKUP(A32,وارد!A:D,4,0),\"0\")","v":"0"},null,{"$f":"IFERROR(VLOOKUP(A32,وارد!A:F,6,0),\"0\")","v":"0"},0,0,0]
[30,30,{"$f":"SUMIF(وارد!A:A,المخزون!A33,وارد!C:C)","v":0},{"$f":"IFERROR(VLOOKUP(A33,وارد!A:D,4,0),\"0\")","v":"0"},null,{"$f":"IFERROR(VLOOKUP(A33,وارد!A:F,6,0),\"0\")","v":"0"},0,0,0]
[31,31,{"$f":"SUMIF(وارد!A:A,المخزون!A34,وارد!C:C)","v":0},{"$f":"IFERROR(VLOOKUP(A34,وارد!A:D,4,0),\"0\")","v":"0"},null,{"$f":"IFERROR(VLOOKUP(A34,وارد!A:F,6,0),\"0\")","v":"0"},0,0,0]
[32,32,{"$f":"SUMIF(وارد!A:A,المخزون!A35,وارد!C:C)","v":0},{"$f":"IFERROR(VLOOKUP(A35,وارد!A:D,4,0),\"0\")","v":"0"},null,{"$f":"IFERROR(VLOOKUP(A35,وارد!A:F,6,0),\"0\")","v":"0"},0,0,0]
[33,33,{"$f":"SUMIF(وارد!A:A,المخزون!A36,وارد!C:C)","v":0},{"$f":"IFERROR(VLOOKUP(A36,وارد!A:D,4,0),\"0\")","v":"0"},null,{"$f":"IFERROR(VLOOKUP(A36,وارد!A:F,6,0),\"0\")","v":"0"},0,0,0]
[34,34,{"$f":"SUMIF(وارد!A:A,المخزون!A37,وارد!C:C)","v":0},{"$f":"IFERROR(VLOOKUP(A37,وارد!A:D,4,0),\"0\")","v":"0"},null,{"$f":"IFERROR(VLOOKUP(A37,وارد!A:F,6,0),\"0\")","v":"0"},0,0,0]
[35,35,{"$f":"SUMIF(وارد!A:A,المخزون!A38,وارد!C:C)","v":0},{"$f":"IFERROR(VLOOKUP(A38,وارد!A:D,4,0),\"0\")","v":"0"},null,{"$f":"IFERROR(VLOOKUP(A38,وارد!A:F,6,0),\"0\")","v":"0"},0,0,0]
[36,36,{"$f":"SUMIF(وارد!A:A,المخزون!A39,وارد!C:C)","v":0},{"$f":"IFERROR(VLOOKUP(A39,وارد!A:D,4,0),\"0\")","v":"0"},null,{"$f":"IFERROR(VLOOKUP(A39,وارد!A:F,6,0),\"0\")","v":"0"},0,0,0]
[37,37,{"$f":"SUMIF(وارد!A:A,المخزون!A40,وارد!C:C)","v":0},{"$f":"IFERROR(VLOOKUP(A40,وارد!A:D,4,0),\"0\")","v":"0"},null,{"$f":"IFERROR(VLOOKUP(A40,وارد!A:F,6,0),\"0\")","v":"0"},0,0,0]
[38,38,{"$f":"SUMIF(وارد!A:A,المخزون!A41,وارد!C:C)","v":0},{"$f":"IFERROR(VLOOKUP(A41,وارد!A:D,4,0),\"0\")","v":"0"},null,{"$f":"IFERROR(VLOOKUP(A41,وارد!A:F,6,0),\"0\")","v":"0"},0,0,0]
[39,39,{"$f":"SUMIF(وارد!A:A,المخزون!A42,وارد!C:C)","v":0},{"$f":"IFERROR(VLOOKUP(A42,وارد!A:D,4,0),\"0\")","v":"0"},null,{"$f":"IFERROR(VLOOKUP(A42,وارد!A:F,6,0),\"0\")","v":"0"},0,0,0]
[40,40,{"$f":"SUMIF(وارد!A:A,المخزون!A43,وارد!C:C)","v":0},{"$f":"IFERROR(VLOOKUP(A43,وارد!A:D,4,0),\"0\")","v":"0"},null,{"$f":"IFERROR(VLOOKUP(A43,وارد!A:F,6,0),\"0\")","v":"0"},0,0,0]
[41,41,{"$f":"SUMIF(وارد!A:A,المخزون!A44,وارد!C:C)","v":0},{"$f":"IFERROR(VLOOKUP(A44,وارد!A:D,4,0),\"0\")","v":"0"},null,{"$f":"IFERROR(VLOOKUP(A44,وارد!A:F,6,0),\"0\")","v":"0"},0,0,0]
[42,42,{"$f":"SUMIF(وارد!A:A,المخزون!A45,وارد!C:C)","v":0},{"$f":"IFERROR(VLOOKUP(A45,وارد!A:D,4,0),\"0\")","v":"0"},null,{"$f":"IFERROR(VLOOKUP(A45,وارد!A:F,6,0),\"0\")","v":"0"},0,0,0]
[43,43,{"$f":"SUMIF(وارد!A:A,المخزون!A46,وارد!C:C)","v":0},{"$f":"IFERROR(VLOOKUP(A46,وارد!A:D,4,0),\"0\")","v":"0"},null,{"$f":"IFERROR(VLOOKUP(A46,وارد!A:F,6,0),\"0\")","v":"0"},0,0,0]
[44,44,{"$f":"SUMIF(وارد!A:A,المخزون!A47,وارد!C:C)","v":0},{"$f":"IFERROR(VLOOKUP(A47,وارد!A:D,4,0),\"0\")","v":"0"},null,{"$f":"IFERROR(VLOOKUP(A47,وارد!A:F,6,0),\"0\")","v":"0"},0,0,0]
[45,45,{"$f":"SUMIF(وارد!A:A,المخزون!A48,وارد!C:C)","v":0},{"$f":"IFERROR(VLOOKUP(A48,وارد!A:D,4,0),\"0\")","v":"0"},null,{"$f":"IFERROR(VLOOKUP(A48,وارد!A:F,6,0),\"0\")","v":"0"},0,0,0]
[46,46,{"$f":"SUMIF(وارد!A:A,المخزون!A49,وارد!C:C)","v":0},{"$f":"IFERROR(VLOOKUP(A49,وارد!A:D,4,0),\"0\")","v":"0"},null,{"$f":"IFERROR(VLOOKUP(A49,وارد!A:F,6,0),\"0\")","v":"0"},0,0,0]
[47,47,{"$f":"SUMIF(وارد!A:A,المخزون!A50,وارد!C:C)","v":0},{"$f":"IFERROR(VLOOKUP(A50,وارد!A:D,4,0),\"0\")","v":"0"},null,{"$f":"IFERROR(VLOOKUP(A50,وارد!A:F,6,0),\"0\")","v":"0"},0,0,0]
[48,48,{"$f":"SUMIF(وارد!A:A,المخزون!A51,وارد!C:C)","v":0},{"$f":"IFERROR(VLOOKUP(A51,وارد!A:D,4,0),\"0\")","v":"0"},null,{"$f":"IFERROR(VLOOKUP(A51,وارد!A:F,6,0),\"0\")","v":"0"},0,0,0]
[49,49,{"$f":"SUMIF(وارد!A:A,المخزون!A52,وارد!C:C)","v":0},{"$f":"IFERROR(VLOOKUP(A52,وارد!A:D,4,0),\"0\")","v":"0"},null,{"$f":"IFERROR(VLOOKUP(A52,وارد!A:F,6,0),\"0\")","v":"0"},0,0,0]
[50,50,{"$f":"SUMIF(وارد!A:A,المخزون!A53,وارد!C:C)","v":0},{"$f":"IFERROR(VLOOKUP(A53,وارد!A:D,4,0),\"0\")","v":"0"},null,{"$f":"IFERROR(VLOOKUP(A53,وارد!A:F,6,0),\"0\")","v":"0"},0,0,0]
[51,51,{"$f":"SUMIF(وارد!A:A,المخزون!A54,وارد!C:C)","v":0},{"$f":"IFERROR(VLOOKUP(A54,وارد!A:D,4,0),\"0\")","v":"0"},null,{"$f":"IFERROR(VLOOKUP(A54,وارد!A:F,6,0),\"0\")","v":"0"},0,0,0]
[52,52,{"$f":"SUMIF(وارد!A:A,المخزون!A55,وارد!C:C)","v":0},{"$f":"IFERROR(VLOOKUP(A55,وارد!A:D,4,0),\"0\")","v":"0"},null,{"$f":"IFERROR(VLOOKUP(A55,وارد!A:F,6,0),\"0\")","v":"0"},0,0,0]
[53,53,{"$f":"SUMIF(وارد!A:A,المخزون!A56,وارد!C:C)","v":0},{"$f":"IFERROR(VLOOKUP(A56,وارد!A:D,4,0),\"0\")","v":"0"},null,{"$f":"IFERROR(VLOOKUP(A56,وارد!A:F,6,0),\"0\")","v":"0"},0,0,0]
[54,54,{"$f":"SUMIF(وارد!A:A,المخزون!A57,وارد!C:C)","v":0},{"$f":"IFERROR(VLOOKUP(A57,وارد!A:D,4,0),\"0\")","v":"0"},null,{"$f":"IFERROR(VLOOKUP(A57,وارد!A:F,6,0),\"0\")","v":"0"},0,0,0]
[55,55,{"$f":"SUMIF(وارد!A:A,المخزون!A58,وارد!C:C)","v":0},{"$f":"IFERROR(VLOOKUP(A58,وارد!A:D,4,0),\"0\")","v":"0"},null,{"$f":"IFERROR(VLOOKUP(A58,وارد!A:F,6,0),\"0\")","v":"0"},0,0,0]
[56,56,{"$f":"SUMIF(وارد!A:A,المخزون!A59,وارد!C:C)","v":0},{"$f":"IFERROR(VLOOKUP(A59,وارد!A:D,4,0),\"0\")","v":"0"},null,{"$f":"IFERROR(VLOOKUP(A59,وارد!A:F,6,0),\"0\")","v":"0"},0,0,0]
[57,57,{"$f":"SUMIF(وارد!A:A,المخزون!A60,وارد!C:C)","v":0},{"$f":"IFERROR(VLOOKUP(A60,وارد!A:D,4,0),\"0\")","v":"0"},null,{"$f":"IFERROR(VLOOKUP(A60,وارد!A:F,6,0),\"0\")","v":"0"},0,0,0]
{"$rows_left_out":94}
{"sheet":"وارد","index":3,"n_rows":154,"n_cols":6,"rows_kept":154,"cut":false,"hidden":false,"merged":[]}
[]
[]
[null,null,null,null,{"$f":"SUM(E5:E1048576)","v":16200}]
["اسم الصنف","كود الصنف","كمية ","سعر ","قيمة","سعر البيع"]
[1,1,10,100,{"$f":"C5*D5","v":1000},150]
[2,2,10,75,{"$f":"C6*D6","v":750},130]
[3,3,10,85,850,130]
[4,4,10,100,1000,150]
[5,5,10,100,1000,150]
[6,6,10,125,1250,175]
[7,7,10,150,1500,200]
[8,8,10,130,1300,200]
[9,9,10,85,850,130]
[10,10,10,85,850,130]
[11,11,5,125,625,200]
[12,12,5,100,500,175]
[13,13,5,75,375,150]
[14,14,5,130,650,220]
[15,15,5,140,700,220]
[16,16,5,100,500,170]
[17,17,5,150,750,210]
[18,18,5,150,750,220]
[19,19,5,150,750,230]
[6,{"$f":"A24","v":6},1,125,125,175]
[2,{"$f":"A25","v":2},1,75,75,130]
[6,6,1,150,150,200]
[5,5,-1,100,-100,150]
[null,0,null,null,0]
[null,0,null,null,0]
[null,0,null,null,0]
[null,0,null,null,0]
[null,0,null,null,0]
[null,0,null,null,0]
[null,0,null,null,0]
[null,0,null,null,0]
[null,0,null,null,0]
[null,0,null,null,0]
[null,0,null,null,0]
[null,0,null,null,0]
[null,0,null,null,0]
[null,0,null,null,0]
[null,0,null,null,0]
[null,0,null,null,0]
[null,0,null,null,0]
[null,0,null,null,0]
[null,0,null,null,0]
[null,0,null,null,0]
[null,0,null,null,0]
[null,0,null,null,0]
[null,0,null,null,0]
[null,0,null,null,0]
[null,0,null,null,0]
[null,0,null,null,0]
[null,0,null,null,0]
[null,0,null,null,0]
[null,0,null,null,0]
[null,0,null,null,0]
[null,0,null,null,0]
[null,0,null,null,0]
[null,0,null,null,0]
{"$rows_left_out":95}
{"sheet":"PivotTable","index":4,"n_rows":17,"n_cols":3,"rows_kept":17,"cut":false,"hidden":false,"merged":[]}
["التاريخ","(Multiple Items)"]
[]
["الصنف","Sum of الاجمالى ","Sum of كميه"]
[1,300,2]
[2,390,3]
[3,390,3]
[4,300,2]
[5,300,2]
[6,350,2]
[8,400,2]
["إجمالى الفاتورة",2950,0]
["خصم",70,0]
[9,260,2]
[10,130,1]
[7,200,1]
["الربح",955,0]
["Grand Total",6995,20]

{"sheet":"ملخص مبيعات","index":5,"n_rows":358,"n_cols":13,"rows_kept":358,"cut":false,"hidden":false,"merged":[]}
[]
[null,null,null,null,null,null,null,null,null,null,null,"إجمالى الفاتورة",{"$f":"SUMIF(E:E,L2,I:I)","v":14385}]
[null,null,null,null,null,null,null,null,null,null,null,"خصم",{"$f":"SUMIF(E:E,L3,I:I)","v":470}]
["رقم الفاتورة ","التاريخ","اسم العميل","رقم الموبايل","اسم الصنف","كود","كميه","السعر","الاجمالى ",null,null,"الربح",{"$f":"SUMIF(E:E,L4,I:I)","v":4490}]
["رقم الفاتورة ","التاريخ","اسم العميل","رقم الموبايل","اسم الصنف","كود","كميه","السعر","الاجمالى "]
[28,"2020-09-03","سليم ","6655989899",12,12,1,175,175]
[28,"2020-09-03","سليم ","6655989899",13,13,1,150,150]
[28,"2020-09-03","سليم ","6655989899",0,"",0,0,0]
[28,"2020-09-03","سليم ","6655989899",0,"",0,0,0,null,null,{"$f":"M4-4410","v":80}]
[28,"2020-09-03","سليم ","6655989899",0,"",0,0,0]
[28,"2020-09-03","سليم ","6655989899","خصم",0,0,0,0]
[28,"2020-09-03","سليم ","6655989899","إجمالى الفاتورة",0,0,0,325]
[28,"2020-09-03","سليم ","6655989899","الربح",0,0,0,150]
[27,"2020-09-03","فهيم","01265565565",7,7,1,200,200]
[27,"2020-09-03","فهيم","01265565565",8,8,1,200,200]
[27,"2020-09-03","فهيم","01265565565",9,9,1,130,130]
[27,"2020-09-03","فهيم","01265565565",0,"",0,0,0]
[27,"2020-09-03","فهيم","01265565565",0,"",0,0,0]
[27,"2020-09-03","فهيم","01265565565","خصم",0,0,0,30]
[27,"2020-09-03","فهيم","01265565565","إجمالى الفاتورة",0,0,0,500]
[27,"2020-09-03","فهيم","01265565565","الربح",0,0,0,135]
[26,"2020-09-03","yamen ","01006321458",5,5,1,150,150]
[26,"2020-09-03","yamen ","01006321458",6,6,1,175,175]
[26,"2020-09-03","yamen ","01006321458",7,7,1,200,200]
[26,"2020-09-03","yamen ","01006321458",8,8,1,200,200]
[26,"2020-09-03","yamen ","01006321458",9,9,1,130,130]
[26,"2020-09-03","yamen ","01006321458","خصم",0,0,0,5]
[26,"2020-09-03","yamen ","01006321458","إجمالى الفاتورة",0,0,0,850]
[26,"2020-09-03","yamen ","01006321458","الربح",0,0,0,260]
[25,"2020-09-03","hady ","01126589241",1,1,1,150,150]
[25,"2020-09-03","hady ","01126589241",2,2,1,130,130]
[25,"2020-09-03","hady ","01126589241",3,3,1,130,130]
[25,"2020-09-03","hady ","01126589241",4,4,1,150,150]
[25,"2020-09-03","hady ","01126589241",5,5,1,150,150]
[25,"2020-09-03","hady ","01126589241","خصم",0,0,0,0]
[25,"2020-09-03","hady ","01126589241","إجمالى الفاتورة",0,0,0,710]
[25,"2020-09-03","hady ","01126589241","الربح",0,0,0,250]
[24,"2020-09-03","مرتجع",0,4,4,-1,150,-150]
[24,"2020-09-03","مرتجع",0,0,"",0,0,0]
[24,"2020-09-03","مرتجع",0,0,"",0,0,0]
[24,"2020-09-03","مرتجع",0,0,"",0,0,0]
[24,"2020-09-03","مرتجع",0,0,"",0,0,0]
[24,"2020-09-03","مرتجع",0,"خصم",0,0,0,0]
[24,"2020-09-03","مرتجع",0,"إجمالى الفاتورة",0,0,0,-150]
[24,"2020-09-03","مرتجع",0,"الربح",0,0,0,-50]
[23,"2020-09-03","مرتجع","0232555454",5,5,-1,150,-150]
[23,"2020-09-03","مرتجع","0232555454",0,"",0,0,0]
[23,"2020-09-03","مرتجع","0232555454",0,"",0,0,0]
[23,"2020-09-03","مرتجع","0232555454",0,"",0,0,0]
[23,"2020-09-03","مرتجع","0232555454",0,"",0,0,0]
[23,"2020-09-03","مرتجع","0232555454","خصم",0,0,0,0]
[23,"2020-09-03","مرتجع","0232555454","إجمالى الفاتورة",0,0,0,-150]
[23,"2020-09-03","مرتجع","0232555454","الربح",0,0,0,-50]
[22,"2020-09-02","مرتجع للتجربة ","656488787",2,2,-1,130,-130]
[22,"2020-09-02","مرتجع للتجربة ","656488787",0,"",0,0,0]
[22,"2020-09-02","مرتجع للتجربة ","656488787",0,"",0,0,0]
[22,"2020-09-02","مرتجع للتجربة ","656488787",0,"",0,0,0]
[22,"2020-09-02","مرتجع للتجربة ","656488787",0,"",0,0,0]
[22,"2020-09-02","مرتجع للتجربة ","656488787","خصم",0,0,0,0]
[22,"2020-09-02","مرتجع للتجربة ","656488787","إجمالى الفاتورة",0,0,0,-130]
{"$rows_left_out":299}
{"sheet":"بحث","index":6,"n_rows":12,"n_cols":11,"rows_kept":12,"cut":false,"hidden":false,"merged":[]}
[]
[]
[null,null,"رقم الفاتورة ","التاريخ","اسم العميل","رقم الموبايل","اسم الصنف","كود","كميه","السعر","الاجمالى "]
[null,null,null,"2020-08-26",null,null,"الربح"]
[]
[]
[]
[]
[]
[]
[null,null,"رقم الفاتورة ","التاريخ","اسم العميل","رقم الموبايل","اسم الصنف","كود","كميه","السعر","الاجمالى "]
[null,null,2,"2020-08-26","على","6656556","الربح",0,0,0,240]