{"text_format":"1","workbook":"xlsx","n_sheets":3,"sheets":["Source","Target","Combo_Sheet"],"not_rendered":{"charts":0,"images":4,"macros":1,"external_links":0,"defined_names":3,"comments":0,"pivot_tables":0},"unopened":[],"bounds":{"document_bytes":16777216,"sheet_cells":100000,"rows_first":2000,"rows_last":500,"rows_between":2000,"halvings":0,"cell_chars":16384,"cell_head_chars":4096},"cells_cut":0,"cells_raw":0,"read":"whole","date_system":"1900"}

{"sheet":"Source","index":0,"n_rows":46,"n_cols":24,"rows_kept":46,"cut":false,"hidden":false,"merged":[]}
[]
[null,"الاسم الرباعي/ اللقب","اللقب العلمي","تاريخ الحصول عليه","الجهة المانحة له","الشهادة الحاصل عليها","الجهة المانحة لها","التخصص العام","التخصص الدقيق","سنة التخرج","الايميل","العنوان/ نقطة دالة","رقم الجنسية/ البطاقة","دائرة الأحوال المدنية","السجل/ الصحيفة","تاريخ الولادة","محل الولادة","اسم الأم الثلاثي","عدد افراد الأسرة","رقم الهاتف",null,null,"الاسم ","رقم الصف"]
[null,"نعيم بالع كرشو","A1","B1","C1","D1","E1","F1","G1","H1","I1","J1","K1","L1","M1","N1","O1","P1","Q1","R1"]
[null,"سامر محي الدّين زارع باذنجاني","A2","B2","C2","D2","E2","F2","G2","H2","I2","J2","K2","L2","M2","N2","O2","P2","Q2","R2",null,null,"Name2",{"$f":"MATCH(W4,B:B,0)","v":{"$error":"#N/A"}}]
[null," عبد السّلام محمد نص لسان ","A3","B3","C3","D3","E3","F3","G3","H3","I3","J3","K3","L3","M3","N3","O3","P3","Q3","R3"]
[null,"تامر عبد الجّليل سامع صوتو","A4","B4","C4","D4","E4","F4","G4","H4","I4","J4","K4","L4","M4","N4","O4","P4","Q4","R4"]
[null,"محمود ضايع اسمو","A5","B5","C5","D5","E5","F5","G5","H5","I5","J5","K5","L5","M5","N5","O5","P5","Q1","R5"]
[null,"نعيم بالع كرشو","A6","B6","C6","D6","E6","F6","G6","H6","I6","J6","K6","L6","M6","N6","O6","P6","Q2","R6"]
[null,"عمّار مخّرب بيتو","A7","B7","C7","D7","E7","F7","G7","H7","I7","J7","K7","L7","M7","N7","O7","P7","Q3","R7"]
[null,"ربيع ليش مطنّش","A8","B8","C8","D8","E8","F8","G8","H8","I8","J8","K8","L8","M8","N8","O8","P8","Q4","R8"]
[null,"عبد الشافي قابضها جد","A9","B9","C9","D9","E9","F9","G9","H9","I9","J9","K9","L9","M9","N9","O9","P9","Q1","R9"]
[null,"سمير كاسر ايدو","A10","B10","C10","D10","E10","F10","G10","H10","I10","J10","K10","L10","M10","N10","O10","P10","Q2","R10"]
[null,"عبد الكريم فركش حالو","A11","B11","C11","D11","E11","F11","G11","H11","I11","J11","K11","L11","M11","N11","O11","P11","Q3","R11"]
[null,"عبد الشافي قابضها جد","A12","B12","C12","D12","E12","F12","G12","H12","I12","J12","K12","L12","M12","N12","O12","P12","Q4","R12"]
[null,"كميل خازق كيسو","A13","B13","C13","D13","E13","F13","G13","H13","I13","J13","K13","L13","M13","N13","O13","P13","Q1","R13"]
[null,"علي شالح صبّاطو","A14","B14","C14","D14","E14","F14","G14","H14","I14","J14","K14","L14","M14","N14","O14","P14","Q2","R14"]
[null,"شادي فارك كفّو أبو دلعة","A15","B15","C15","D15","E15","F15","G15","H15","I15","J15","K15","L15","M15","N15","O15","P15","Q3","R15"]
[null,"طالع نازل من بيتو","A16","B16","C16","D16","E16","F16","G16","H16","I16","J16","K16","L16","M16","N16","O16","P16","Q4","R16"]
[null,"رفيق دربك عاطول","A17","B17","C17","D17","E17","F17","G17","H17","I17","J17","K17","L17","M17","N17","O17","P17","Q1","R17"]
[null,"طارق مقلب مضبوط","A18","B18","C18","D18","E18","F18","G18","H18","I18","J18","K18","L18","M18","N18","O18","P18","Q2","R18"]
[null,"شاكر ناسي حالو","A19","B19","C19","D19","E19","F19","G19","H19","I19","J19","K19","L19","M19","N19","O19","P19","Q3","R19"]
[null,"كريم بس بالمي","A20","B20","C20","D20","E20","F20","G20","H20","I20","J20","K20","L20","M20","N20","O20","P20","Q4","R20"]
[null,"أقرع نتّف شعراتو","A21","B21","C21","D21","E21","F21","G21","H21","I21","J21","K21","L21","M21","N21","O21","P21","Q1","R21"]
[null,"جميل أبشع خلق الله","A22","B22","C22","D22","E22","F22","G22","H22","I22","J22","K22","L22","M22","N22","O22","P22","Q2","R22"]
[null,"كامل ناقص مش عارف","A23","B23","C23","D23","E23","F23","G23","H23","I23","J23","K23","L23","M23","N23","O23","P23","Q3","R23"]
[null,"شبعان جايع بالحارة","A24","B24","C24","D24","E24","F24","G24","H24","I24","J24","K24","L24","M24","N24","O24","P24","Q4","R24"]
[null,"معروف عنّو حركاتو","A25","B25","C25","D25","E25","F25","G25","H25","I25","J25","K25","L25","M25","N25","O25","P25","Q1","R25"]
[null,"صابر مش عارف قديش","A26","B26","C26","D26","E26","F26","G26","H26","I26","J26","K26","L26","M26","N26","O26","P26","Q2","R26"]
[null,"قادر يضبط أعصابو","A27","B27","C27","D27","E27","F27","G27","H27","I27","J27","K27","L27","M27","N27","O27","P27","Q3","R27"]
[null,"فاكك زرّو الفوقاني","A28","B28","C28","D28","E28","F28","G28","H28","I28","J28","K28","L28","M28","N28","O28","P28","Q4","R28"]
[null,"أطرش سامع همسة","A29","B29","C29","D29","E29","F29","G29","H29","I29","J29","K29","L29","M29","N29","O29","P29","Q1","R29"]
[null,"أعمى شايف برغوث","A30","B30","C30","D30","E30","F30","G30","H30","I30","J30","K30","L30","M30","N30","O30","P30","Q2","R30"]
[null,"راكض أعرج  قدّامي","A31","B31","C31","D31","E31","F31","G31","H31","I31","J31","K31","L31","M31","N31","O31","P31","Q3","R31"]
[null,"ناقر مدّي بخيالو","A32","B32","C32","D32","E32","F32","G32","H32","I32","J32","K32","L32","M32","N32","O32","P32","Q4","R32"]
[null,"طفران زهقان العيشي","A33","B33","C33","D33","E33","F33","G33","H33","I33","J33","K33","L33","M33","N33","O33","P33","Q1","R33"]
[null,"عارف كوعو من بوعو","A34","B34","C34","D34","E34","F34","G34","H34","I34","J34","K34","L34","M34","N34","O34","P34","Q2","R34"]
[null,"ماشي حافي ليل نهار","A35","B35","C35","D35","E35","F35","G35","H35","I35","J35","K35","L35","M35","N35","O35","P35","Q3","R35"]
[null,"داعس نملة ختيارة","A36","B36","C36","D36","E36","F36","G36","H36","I36","J36","K36","L36","M36","N36","O36","P36","Q4","R36"]
[null,"خربوش ستيلو ناشف","A37","B37","C37","D37","E37","F37","G37","H37","I37","J37","K37","L37","M37","N37","O37","P37","Q1","R37"]
[null,"عاجن أطيب منقوشي","A38","B38","C38","D38","E38","F38","G38","H38","I38","J38","K38","L38","M38","N38","O38","P38","Q2","R38"]
[null,"كريم بس بالمي","A39","B39","C39","D39","E39","F39","G39","H39","I39","J39","K39","L39","M39","N39","O39","P39","Q3","R39"]
[null,"واحد فول محرحر","A40","B40","C40","D40","E40","F40","G40","H40","I40","J40","K40","L40","M40","N40","O40","P40","Q4","R40"]
[null,"دافش مرتو عالوادي","A41","B41","C41","D41","E41","F41","G41","H41","I41","J41","K41","L41","M41","N41","O41","P41","Q1","R41"]
[null,"شامل شايل شحّاطة","A42","B42","C42","D42","E42","F42","G42","H42","I42","J42","K42","L42","M42","N42","O42","P42","Q2","R42"]
[null,"سّكر بابو بالمفتاح","A43","B43","C43","D43","E43","F43","G43","H43","I43","J43","K43","L43","M43","N43","O43","P43","Q3","R43"]
[null,"نازل واحد بالجورة","A44","B44","C44","D44","E44","F44","G44","H44","I44","J44","K44","L44","M44","N44","O44","P44","Q4","R44"]

{"sheet":"Target","index":1,"n_rows":8,"n_cols":23,"rows_kept":8,"cut":false,"hidden":true,"merged":[]}
[]
[]
[]
[null,null,null,null,{"$f":"Source!B2","v":"الاسم الرباعي/ اللقب"},{"$f":"Source!C2","v":"اللقب العلمي"},{"$f":"Source!D2","v":"تاريخ الحصول عليه"},{"$f":"Source!E2","v":"الجهة المانحة له"},{"$f":"Source!F2","v":"الشهادة الحاصل عليها"},{"$f":"Source!G2","v":"الجهة المانحة لها"},{"$f":"Source!H2","v":"التخصص العام"},{"$f":"Source!I2","v":"التخصص الدقيق"},{"$f":"Source!J2","v":"سنة التخرج"},{"$f":"Source!K2","v":"الايميل"},{"$f":"Source!L2","v":"العنوان/ نقطة دالة"},{"$f":"Source!M2","v":"رقم الجنسية/ البطاقة"},{"$f":"Source!N2","v":"دائرة الأحوال المدنية"},{"$f":"Source!O2","v":"السجل/ الصحيفة"},{"$f":"Source!P2","v":"تاريخ الولادة"},{"$f":"Source!Q2","v":"محل الولادة"},{"$f":"Source!R2","v":"اسم الأم الثلاثي"},{"$f":"Source!S2","v":"عدد افراد الأسرة"},{"$f":"Source!T2","v":"رقم الهاتف"}]
[null,null,null,1,"كميل خازق كيسو","A13","B13","C13","D13","E13","F13","G13","H13","I13","J13","K13","L13","M13","N13","O13","P13","Q1","R13"]
[null,null,null,2,"كريم بس بالمي","A20","B20","C20","D20","E20","F20","G20","H20","I20","J20","K20","L20","M20","N20","O20","P20","Q4","R20"]
[null,null,null,3,"كامل ناقص مش عارف","A23","B23","C23","D23","E23","F23","G23","H23","I23","J23","K23","L23","M23","N23","O23","P23","Q3","R23"]
[null,null,null,4,"كريم بس بالمي","A39","B39","C39","D39","E39","F39","G39","H39","I39","J39","K39","L39","M39","N39","O39","P39","Q3","R39"]

{"sheet":"Combo_Sheet","index":2,"n_rows":17,"n_cols":52,"rows_kept":17,"cut":false,"hidden":false,"merged":[]}
[null,null,null,null,null,null,null,null,null,null,null,null,null,null,null,null,null,null,null,null,null,null,null,null,null,null,null,null,null,null,null,null,null,null,null,null,null,null,null,null,null,null,null,null,null,null,null,null,null,null,null,"محمود ضايع اسمو"]
[]
[]
[]
[]
[]
[]
[null,null,"الاسم الرباعي/ اللقب",null,{"$f":"IF($AZ$1=\"\",\"\",INDEX(OFFSET(Source!$B$3:$B$500,,ROWS($A$1:A1)-1),MATCH($AZ$1,Source!$B$3:$B$500,0)))","v":"محمود ضايع اسمو"},null,"العنوان/ نقطة دالة",{"$f":"IF($AZ$1=\"\",\"\",INDEX(OFFSET(Source!$B$3:$B$500,,9+ROWS($A$1:A1)),MATCH($AZ$1,Source!$B$3:$B$500,0)))","v":"J5"},null,"رقم الصف لإجراء التعديل"]
[null,null,"اللقب العلمي",null,{"$f":"IF($AZ$1=\"\",\"\",INDEX(OFFSET(Source!$B$3:$B$500,,ROWS($A$1:A2)-1),MATCH($AZ$1,Source!$B$3:$B$500,0)))","v":"A5"},null,"رقم الجنسية/ البطاقة",{"$f":"IF($AZ$1=\"\",\"\",INDEX(OFFSET(Source!$B$3:$B$500,,9+ROWS($A$1:A2)),MATCH($AZ$1,Source!$B$3:$B$500,0)))","v":"K5"},null,{"$f":"MATCH(AZ1,Source!$B$3:$B$50,0)+2","v":7}]
[null,null,"تاريخ الحصول عليه",null,{"$f":"IF($AZ$1=\"\",\"\",INDEX(OFFSET(Source!$B$3:$B$500,,ROWS($A$1:A3)-1),MATCH($AZ$1,Source!$B$3:$B$500,0)))","v":"B5"},null,"دائرة الأحوال المدنية",{"$f":"IF($AZ$1=\"\",\"\",INDEX(OFFSET(Source!$B$3:$B$500,,9+ROWS($A$1:A3)),MATCH($AZ$1,Source!$B$3:$B$500,0)))","v":"L5"}]
[null,null,"الجهة المانحة له",null,{"$f":"IF($AZ$1=\"\",\"\",INDEX(OFFSET(Source!$B$3:$B$500,,ROWS($A$1:A4)-1),MATCH($AZ$1,Source!$B$3:$B$500,0)))","v":"C5"},null,"السجل/ الصحيفة",{"$f":"IF($AZ$1=\"\",\"\",INDEX(OFFSET(Source!$B$3:$B$500,,9+ROWS($A$1:A4)),MATCH($AZ$1,Source!$B$3:$B$500,0)))","v":"M5"}]
[null,null,"الشهادة الحاصل عليها",null,{"$f":"IF($AZ$1=\"\",\"\",INDEX(OFFSET(Source!$B$3:$B$500,,ROWS($A$1:A5)-1),MATCH($AZ$1,Source!$B$3:$B$500,0)))","v":"D5"},null,"تاريخ الولادة",{"$f":"IF($AZ$1=\"\",\"\",INDEX(OFFSET(Source!$B$3:$B$500,,9+ROWS($A$1:A5)),MATCH($AZ$1,Source!$B$3:$B$500,0)))","v":"N5"}]
[null,null,"الجهة المانحة لها",null,{"$f":"IF($AZ$1=\"\",\"\",INDEX(OFFSET(Source!$B$3:$B$500,,ROWS($A$1:A6)-1),MATCH($AZ$1,Source!$B$3:$B$500,0)))","v":"E5"},null,"محل الولادة",{"$f":"IF($AZ$1=\"\",\"\",INDEX(OFFSET(Source!$B$3:$B$500,,9+ROWS($A$1:A6)),MATCH($AZ$1,Source!$B$3:$B$500,0)))","v":"O5"}]
[null,null,"التخصص العام",null,{"$f":"IF($AZ$1=\"\",\"\",INDEX(OFFSET(Source!$B$3:$B$500,,ROWS($A$1:A7)-1),MATCH($AZ$1,Source!$B$3:$B$500,0)))","v":"F5"},null,"اسم الأم الثلاثي",{"$f":"IF($AZ$1=\"\",\"\",INDEX(OFFSET(Source!$B$3:$B$500,,9+ROWS($A$1:A7)),MATCH($AZ$1,Source!$B$3:$B$500,0)))","v":"P5"}]
[null,null,"التخصص الدقيق",null,{"$f":"IF($AZ$1=\"\",\"\",INDEX(OFFSET(Source!$B$3:$B$500,,ROWS($A$1:A8)-1),MATCH($AZ$1,Source!$B$3:$B$500,0)))","v":"G5"},null,"عدد افراد الأسرة",{"$f":"IF($AZ$1=\"\",\"\",INDEX(OFFSET(Source!$B$3:$B$500,,9+ROWS($A$1:A8)),MATCH($AZ$1,Source!$B$3:$B$500,0)))","v":"Q1"}]
[null,null,"سنة التخرج",null,{"$f":"IF($AZ$1=\"\",\"\",INDEX(OFFSET(Source!$B$3:$B$500,,ROWS($A$1:A9)-1),MATCH($AZ$1,Source!$B$3:$B$500,0)))","v":"H5"},null,"رقم الهاتف",{"$f":"IF($AZ$1=\"\",\"\",INDEX(OFFSET(Source!$B$3:$B$500,,9+ROWS($A$1:A9)),MATCH($AZ$1,Source!$B$3:$B$500,0)))","v":"R5"}]
[null,null,"الايميل",null,{"$f":"IF($AZ$1=\"\",\"\",INDEX(OFFSET(Source!$B$3:$B$500,,ROWS($A$1:A10)-1),MATCH($AZ$1,Source!$B$3:$B$500,0)))","v":"I5"}]