{"text_format":"1","workbook":"xlsx","n_sheets":3,"sheets":["Source","Target","Max_3"],"not_rendered":{"charts":2,"images":0,"macros":1,"external_links":0,"defined_names":1,"comments":0,"pivot_tables":0},"unopened":[],"bounds":{"document_bytes":16777216,"sheet_cells":100000,"rows_first":2000,"rows_last":500,"rows_between":2000,"halvings":0,"cell_chars":16384,"cell_head_chars":4096},"cells_cut":0,"cells_raw":0,"read":"whole","date_system":"1900"}

{"sheet":"Source","index":0,"n_rows":172,"n_cols":10,"rows_kept":172,"cut":false,"hidden":false,"merged":[[61,1,61,2]]}
[]
["الاسم والكنية ","اسم الأب","اسم الأم","المواليد","الجنس","تاريخ فتح الحساب","رقم الحساب","الرصيد","نوع آخر عملية للعميل","تاريخ آخر عملية"]
["إبراهيم سالوخة","صفوان","نهى","2001-06-14","ذكر","2018-09-06",3453553673,5325987,"سحب ","2018-03-02"]
["قاهر الدناوي","بشار","ديمة","1961-05-23","ذكر","1990-09-09",2342342,2425252,"سحب ","2018-09-02"]
["محمود سعيد","علاء","سوسن","1975-08-03","ذكر","2007-09-05",2342345,22342400,"إيداع","2017-08-05"]
["صديقة طاطروس","مفيد","سوزان","1965-10-07","انثى","1999-09-04",3353455,23423400,"تحويل ","2016-05-04"]
["بانة الرحال","أسعد","سوزي","1982-05-03","انثى","2007-09-04",34575675,2342322546,"سحب ","2019-06-03"]
["سالم الجردي","عارف","سونا","1987-11-03","ذكر","2009-08-06",53535355,53200000,"إيداع","2019-06-04"]
["شاديا حماد","فراس","نسرين","1974-06-05","انثى","1999-04-05",3453456,23400000,"تحويل ","2019-06-05"]
["سمير جاموس","وسيم","سيرين","1980-06-06","ذكر","2010-09-06",63453453,2340000,"تحويل ","2019-06-06"]
["بدر حبيب","بسام","روزانا","1990-09-04","ذكر","2018-10-05",2345345345,2340000,"تحويل ","2019-06-07"]
["جورجيت سليط","وائل","ليندا","1973-08-05","انثى","2001-05-05",34535345,95436,"سحب ","2019-06-08"]
["محمود سعيد","علي ","لين","1978-07-05","ذكر","1999-08-09",3453525,2353000,"تحويل ","2019-06-09"]
["علا نبهان","غديل","مايا","1967-09-04","انثى","1997-08-07",3453234,23420000,"إيداع","2019-06-10"]
["محمد عبد اللطيف","حمزة","نايا","1987-03-02","ذكر","2009-04-06",3453453,1300000,"إيداع","2019-06-11"]
{"$rows_left_out":158}
{"sheet":"Target","index":1,"n_rows":17,"n_cols":11,"rows_kept":17,"cut":false,"hidden":false,"merged":[]}
[]
["#","الاسم والكنية ","اسم الأب","اسم الأم","المواليد","الجنس","تاريخ فتح الحساب","رقم الحساب","الرصيد","نوع آخر عملية للعميل","تاريخ آخر عملية"]
[1,"إبراهيم سالوخة","صفوان","نهى","2001-06-14","ذكر","2018-09-06",3453553673,5325987,"سحب ","2018-03-02"]
[2,"قاهر الدناوي","بشار","ديمة","1961-05-23","ذكر","1990-09-09",2342342,2425252,"سحب ","2018-09-02"]
[3,"بانة الرحال","أسعد","سوزي","1982-05-03","انثى","2007-09-04",34575675,2342322546,"سحب ","2019-06-03"]
[4,"جورجيت سليط","وائل","ليندا","1973-08-05","انثى","2001-05-05",34535345,95436,"سحب ","2019-06-08"]
[5,"ميشيل ديب","غياث","جولي","1950-06-05","ذكر","2004-09-08",8658856,340000,"سحب ","2019-06-13"]
[6,"أحلام جعفر","فارس","نبيلة","1959-08-05","انثى","1997-09-08",5678567,42340000,"سحب ","2019-06-17"]
[7,"عمر عمري","برهان","منى","1998-09-05","ذكر","2018-11-09",9456745745,23400000,"سحب ","2019-06-18"]
[8,"سمير خطاب","سليمان","فاتن","1950-06-04","ذكر","1983-09-05",456745,44234000,"سحب ","2019-06-19"]
[9,"يوسف حنوف","علاء","منى ","1998-07-05","ذكر","2017-01-04",5677567775,4300000,"سحب ","2019-06-26"]
[10,"عواطف سلامة","محمد ","ملك","1964-04-23","انثى","1988-09-08",8567454,488320000,"سحب ","2019-06-30"]
[11,"نبيه يوسف","حمزة","داليا","1984-09-08","انثى","2014-07-08",5456754,54000000,"سحب ","2019-07-02"]
[12,"مريم خوري","ماهر","سوسن","1960-08-04","انثى","1980-09-05",8456848484,5200000,"سحب ","2019-07-04"]
[13,"نور نجاري","أيهم","أمل","1964-08-05","ذكر","1983-08-09",3454363,54500000,"سحب ","2019-07-07"]
{"$rows_left_out":3}
{"sheet":"Max_3","index":2,"n_rows":173,"n_cols":11,"rows_kept":173,"cut":false,"hidden":false,"merged":[]}
[null,null,null,null,3,"How_Many",null,"إيداع"]
[]
[null,"الاسم والكنية ","اسم الأب","اسم الأم","المواليد","الجنس","تاريخ فتح الحساب","رقم الحساب","الرصيد","نوع آخر عملية للعميل","تاريخ آخر عملية"]
[null,{"$f":"IF(ROWS($A$2:A2)>$E$1,\"\",INDEX(Source!A$3:A$100,LARGE(IF(Source!$I$3:$I$100<>\"\",IF(Source!$I$3:$I$100=\"إيداع\",ROW($I$4:$I$101)-ROW($I$4)+1)),ROWS($A$2:A2))))","v":"قاهر الدناوي"},{"$f":"IF(ROWS($A$2:B2)>$E$1,\"\",INDEX(Source!B$3:B$100,LARGE(IF(Source!$I$3:$I$100<>\"\",IF(Source!$I$3:$I$100=\"إيداع\",ROW($I$4:$I$101)-ROW($I$4)+1)),ROWS($A$2:B2))))","v":"أحمد"},{"$f":"IF(ROWS($A$2:C2)>$E$1,\"\",INDEX(Source!C$3:C$100,LARGE(IF(Source!$I$3:$I$100<>\"\",IF(Source!$I$3:$I$100=\"إيداع\",ROW($I$4:$I$101)-ROW($I$4)+1)),ROWS($A$2:C2))))","v":"ديمة"},{"$f":"IF(ROWS($A$2:D2)>$E$1,\"\",INDEX(Source!D$3:D$100,LARGE(IF(Source!$I$3:$I$100<>\"\",IF(Source!$I$3:$I$100=\"إيداع\",ROW($I$4:$I$101)-ROW($I$4)+1)),ROWS($A$2:D2))))","v":32235},{"$f":"IF(ROWS($A$2:E2)>$E$1,\"\",INDEX(Source!E$3:E$100,LARGE(IF(Source!$I$3:$I$100<>\"\",IF(Source!$I$3:$I$100=\"إيداع\",ROW($I$4:$I$101)-ROW($I$4)+1)),ROWS($A$2:E2))))","v":"ذكر"},{"$f":"IF(ROWS($A$2:F2)>$E$1,\"\",INDEX(Source!F$3:F$100,LARGE(IF(Source!$I$3:$I$100<>\"\",IF(Source!$I$3:$I$100=\"إيداع\",ROW($I$4:$I$101)-ROW($I$4)+1)),ROWS($A$2:F2))))","v":"2018-08-04"},{"$f":"IF(ROWS($A$2:G2)>$E$1,\"\",INDEX(Source!G$3:G$100,LARGE(IF(Source!$I$3:$I$100<>\"\",IF(Source!$I$3:$I$100=\"إيداع\",ROW($I$4:$I$101)-ROW($I$4)+1)),ROWS($A$2:G2))))","v":2345252},{"$f":"IF(ROWS($A$2:H2)>$E$1,\"\",INDEX(Source!H$3:H$100,LARGE(IF(Source!$I$3:$I$100<>\"\",IF(Source!$I$3:$I$100=\"إيداع\",ROW($I$4:$I$101)-ROW($I$4)+1)),ROWS($A$2:H2))))","v":20000000},{"$f":"IF(ROWS($A$2:I2)>$E$1,\"\",INDEX(Source!I$3:I$100,LARGE(IF(Source!$I$3:$I$100<>\"\",IF(Source!$I$3:$I$100=\"إيداع\",ROW($I$4:$I$101)-ROW($I$4)+1)),ROWS($A$2:I2))))","v":"إيداع"},{"$f":"IF(ROWS($A$2:J2)>$E$1,\"\",INDEX(Source!J$3:J$100,LARGE(IF(Source!$I$3:$I$100<>\"\",IF(Source!$I$3:$I$100=\"إيداع\",ROW($I$4:$I$101)-ROW($I$4)+1)),ROWS($A$2:J2))))","v":"2019-07-17"}]
[null,{"$f":"IF(ROWS($A$2:A3)>$E$1,\"\",INDEX(Source!A$3:A$100,LARGE(IF(Source!$I$3:$I$100<>\"\",IF(Source!$I$3:$I$100=\"إيداع\",ROW($I$4:$I$101)-ROW($I$4)+1)),ROWS($A$2:A3))))","v":"سعاد فتاحي"},{"$f":"IF(ROWS($A$2:B3)>$E$1,\"\",INDEX(Source!B$3:B$100,LARGE(IF(Source!$I$3:$I$100<>\"\",IF(Source!$I$3:$I$100=\"إيداع\",ROW($I$4:$I$101)-ROW($I$4)+1)),ROWS($A$2:B3))))","v":"أحمد"},{"$f":"IF(ROWS($A$2:C3)>$E$1,\"\",INDEX(Source!C$3:C$100,LARGE(IF(Source!$I$3:$I$100<>\"\",IF(Source!$I$3:$I$100=\"إيداع\",ROW($I$4:$I$101)-ROW($I$4)+1)),ROWS($A$2:C3))))","v":"منى"},{"$f":"IF(ROWS($A$2:D3)>$E$1,\"\",INDEX(Source!D$3:D$100,LARGE(IF(Source!$I$3:$I$100<>\"\",IF(Source!$I$3:$I$100=\"إيداع\",ROW($I$4:$I$101)-ROW($I$4)+1)),ROWS($A$2:D3))))","v":32024},{"$f":"IF(ROWS($A$2:E3)>$E$1,\"\",INDEX(Source!E$3:E$100,LARGE(IF(Source!$I$3:$I$100<>\"\",IF(Source!$I$3:$I$100=\"إيداع\",ROW($I$4:$I$101)-ROW($I$4)+1)),ROWS($A$2:E3))))","v":"انثى"},{"$f":"IF(ROWS($A$2:F3)>$E$1,\"\",INDEX(Source!F$3:F$100,LARGE(IF(Source!$I$3:$I$100<>\"\",IF(Source!$I$3:$I$100=\"إيداع\",ROW($I$4:$I$101)-ROW($I$4)+1)),ROWS($A$2:F3))))","v":"2012-09-08"},{"$f":"IF(ROWS($A$2:G3)>$E$1,\"\",INDEX(Source!G$3:G$100,LARGE(IF(Source!$I$3:$I$100<>\"\",IF(Source!$I$3:$I$100=\"إيداع\",ROW($I$4:$I$101)-ROW($I$4)+1)),ROWS($A$2:G3))))","v":2352345235},{"$f":"IF(ROWS($A$2:H3)>$E$1,\"\",INDEX(Source!H$3:H$100,LARGE(IF(Source!$I$3:$I$100<>\"\",IF(Source!$I$3:$I$100=\"إيداع\",ROW($I$4:$I$101)-ROW($I$4)+1)),ROWS($A$2:H3))))","v":5200000},{"$f":"IF(ROWS($A$2:I3)>$E$1,\"\",INDEX(Source!I$3:I$100,LARGE(IF(Source!$I$3:$I$100<>\"\",IF(Source!$I$3:$I$100=\"إيداع\",ROW($I$4:$I$101)-ROW($I$4)+1)),ROWS($A$2:I3))))","v":"إيداع"},{"$f":"IF(ROWS($A$2:J3)>$E$1,\"\",INDEX(Source!J$3:J$100,LARGE(IF(Source!$I$3:$I$100<>\"\",IF(Source!$I$3:$I$100=\"إيداع\",ROW($I$4:$I$101)-ROW($I$4)+1)),ROWS($A$2:J3))))","v":"2019-07-16"}]
[null,{"$f":"IF(ROWS($A$2:A4)>$E$1,\"\",INDEX(Source!A$3:A$100,LARGE(IF(Source!$I$3:$I$100<>\"\",IF(Source!$I$3:$I$100=\"إيداع\",ROW($I$4:$I$101)-ROW($I$4)+1)),ROWS($A$2:A4))))","v":"سميع مخلوف"},{"$f":"IF(ROWS($A$2:B4)>$E$1,\"\",INDEX(Source!B$3:B$100,LARGE(IF(Source!$I$3:$I$100<>\"\",IF(Source!$I$3:$I$100=\"إيداع\",ROW($I$4:$I$101)-ROW($I$4)+1)),ROWS($A$2:B4))))","v":"فؤاد"},{"$f":"IF(ROWS($A$2:C4)>$E$1,\"\",INDEX(Source!C$3:C$100,LARGE(IF(Source!$I$3:$I$100<>\"\",IF(Source!$I$3:$I$100=\"إيداع\",ROW($I$4:$I$101)-ROW($I$4)+1)),ROWS($A$2:C4))))","v":"نوال"},{"$f":"IF(ROWS($A$2:D4)>$E$1,\"\",INDEX(Source!D$3:D$100,LARGE(IF(Source!$I$3:$I$100<>\"\",IF(Source!$I$3:$I$100=\"إيداع\",ROW($I$4:$I$101)-ROW($I$4)+1)),ROWS($A$2:D4))))","v":31299},{"$f":"IF(ROWS($A$2:E4)>$E$1,\"\",INDEX(Source!E$3:E$100,LARGE(IF(Source!$I$3:$I$100<>\"\",IF(Source!$I$3:$I$100=\"إيداع\",ROW($I$4:$I$101)-ROW($I$4)+1)),ROWS($A$2:E4))))","v":"ذكر"},{"$f":"IF(ROWS($A$2:F4)>$E$1,\"\",INDEX(Source!F$3:F$100,LARGE(IF(Source!$I$3:$I$100<>\"\",IF(Source!$I$3:$I$100=\"إيداع\",ROW($I$4:$I$101)-ROW($I$4)+1)),ROWS($A$2:F4))))","v":"2011-10-09"},{"$f":"IF(ROWS($A$2:G4)>$E$1,\"\",INDEX(Source!G$3:G$100,LARGE(IF(Source!$I$3:$I$100<>\"\",IF(Source!$I$3:$I$100=\"إيداع\",ROW($I$4:$I$101)-ROW($I$4)+1)),ROWS($A$2:G4))))","v":235234525},{"$f":"IF(ROWS($A$2:H4)>$E$1,\"\",INDEX(Source!H$3:H$100,LARGE(IF(Source!$I$3:$I$100<>\"\",IF(Source!$I$3:$I$100=\"إيداع\",ROW($I$4:$I$101)-ROW($I$4)+1)),ROWS($A$2:H4))))","v":234002340},{"$f":"IF(ROWS($A$2:I4)>$E$1,\"\",INDEX(Source!I$3:I$100,LARGE(IF(Source!$I$3:$I$100<>\"\",IF(Source!$I$3:$I$100=\"إيداع\",ROW($I$4:$I$101)-ROW($I$4)+1)),ROWS($A$2:I4))))","v":"إيداع"},{"$f":"IF(ROWS($A$2:J4)>$E$1,\"\",INDEX(Source!J$3:J$100,LARGE(IF(Source!$I$3:$I$100<>\"\",IF(Source!$I$3:$I$100=\"إيداع\",ROW($I$4:$I$101)-ROW($I$4)+1)),ROWS($A$2:J4))))","v":"2019-07-15"}]
[null,{"$f":"IF(ROWS($A$2:A5)>$E$1,\"\",INDEX(Source!A$3:A$100,LARGE(IF(Source!$I$3:$I$100<>\"\",IF(Source!$I$3:$I$100=\"إيداع\",ROW($I$4:$I$101)-ROW($I$4)+1)),ROWS($A$2:A5))))","v":""},{"$f":"IF(ROWS($A$2:B5)>$E$1,\"\",INDEX(Source!B$3:B$100,LARGE(IF(Source!$I$3:$I$100<>\"\",IF(Source!$I$3:$I$100=\"إيداع\",ROW($I$4:$I$101)-ROW($I$4)+1)),ROWS($A$2:B5))))","v":""},{"$f":"IF(ROWS($A$2:C5)>$E$1,\"\",INDEX(Source!C$3:C$100,LARGE(IF(Source!$I$3:$I$100<>\"\",IF(Source!$I$3:$I$100=\"إيداع\",ROW($I$4:$I$101)-ROW($I$4)+1)),ROWS($A$2:C5))))","v":""},{"$f":"IF(ROWS($A$2:D5)>$E$1,\"\",INDEX(Source!D$3:D$100,LARGE(IF(Source!$I$3:$I$100<>\"\",IF(Source!$I$3:$I$100=\"إيداع\",ROW($I$4:$I$101)-ROW($I$4)+1)),ROWS($A$2:D5))))","v":""},{"$f":"IF(ROWS($A$2:E5)>$E$1,\"\",INDEX(Source!E$3:E$100,LARGE(IF(Source!$I$3:$I$100<>\"\",IF(Source!$I$3:$I$100=\"إيداع\",ROW($I$4:$I$101)-ROW($I$4)+1)),ROWS($A$2:E5))))","v":""},{"$f":"IF(ROWS($A$2:F5)>$E$1,\"\",INDEX(Source!F$3:F$100,LARGE(IF(Source!$I$3:$I$100<>\"\",IF(Source!$I$3:$I$100=\"إيداع\",ROW($I$4:$I$101)-ROW($I$4)+1)),ROWS($A$2:F5))))","v":""},{"$f":"IF(ROWS($A$2:G5)>$E$1,\"\",INDEX(Source!G$3:G$100,LARGE(IF(Source!$I$3:$I$100<>\"\",IF(Source!$I$3:$I$100=\"إيداع\",ROW($I$4:$I$101)-ROW($I$4)+1)),ROWS($A$2:G5))))","v":""},{"$f":"IF(ROWS($A$2:H5)>$E$1,\"\",INDEX(Source!H$3:H$100,LARGE(IF(Source!$I$3:$I$100<>\"\",IF(Source!$I$3:$I$100=\"إيداع\",ROW($I$4:$I$101)-ROW($I$4)+1)),ROWS($A$2:H5))))","v":""},{"$f":"IF(ROWS($A$2:I5)>$E$1,\"\",INDEX(Source!I$3:I$100,LARGE(IF(Source!$I$3:$I$100<>\"\",IF(Source!$I$3:$I$100=\"إيداع\",ROW($I$4:$I$101)-ROW($I$4)+1)),ROWS($A$2:I5))))","v":""},{"$f":"IF(ROWS($A$2:J5)>$E$1,\"\",INDEX(Source!J$3:J$100,LARGE(IF(Source!$I$3:$I$100<>\"\",IF(Source!$I$3:$I$100=\"إيداع\",ROW($I$4:$I$101)-ROW($I$4)+1)),ROWS($A$2:J5))))","v":""}]
[null,{"$f":"IF(ROWS($A$2:A6)>$E$1,\"\",INDEX(Source!A$3:A$100,LARGE(IF(Source!$I$3:$I$100<>\"\",IF(Source!$I$3:$I$100=\"إيداع\",ROW($I$4:$I$101)-ROW($I$4)+1)),ROWS($A$2:A6))))","v":""},{"$f":"IF(ROWS($A$2:B6)>$E$1,\"\",INDEX(Source!B$3:B$100,LARGE(IF(Source!$I$3:$I$100<>\"\",IF(Source!$I$3:$I$100=\"إيداع\",ROW($I$4:$I$101)-ROW($I$4)+1)),ROWS($A$2:B6))))","v":""},{"$f":"IF(ROWS($A$2:C6)>$E$1,\"\",INDEX(Source!C$3:C$100,LARGE(IF(Source!$I$3:$I$100<>\"\",IF(Source!$I$3:$I$100=\"إيداع\",ROW($I$4:$I$101)-ROW($I$4)+1)),ROWS($A$2:C6))))","v":""},{"$f":"IF(ROWS($A$2:D6)>$E$1,\"\",INDEX(Source!D$3:D$100,LARGE(IF(Source!$I$3:$I$100<>\"\",IF(Source!$I$3:$I$100=\"إيداع\",ROW($I$4:$I$101)-ROW($I$4)+1)),ROWS($A$2:D6))))","v":""},{"$f":"IF(ROWS($A$2:E6)>$E$1,\"\",INDEX(Source!E$3:E$100,LARGE(IF(Source!$I$3:$I$100<>\"\",IF(Source!$I$3:$I$100=\"إيداع\",ROW($I$4:$I$101)-ROW($I$4)+1)),ROWS($A$2:E6))))","v":""},{"$f":"IF(ROWS($A$2:F6)>$E$1,\"\",INDEX(Source!F$3:F$100,LARGE(IF(Source!$I$3:$I$100<>\"\",IF(Source!$I$3:$I$100=\"إيداع\",ROW($I$4:$I$101)-ROW($I$4)+1)),ROWS($A$2:F6))))","v":""},{"$f":"IF(ROWS($A$2:G6)>$E$1,\"\",INDEX(Source!G$3:G$100,LARGE(IF(Source!$I$3:$I$100<>\"\",IF(Source!$I$3:$I$100=\"إيداع\",ROW($I$4:$I$101)-ROW($I$4)+1)),ROWS($A$2:G6))))","v":""},{"$f":"IF(ROWS($A$2:H6)>$E$1,\"\",INDEX(Source!H$3:H$100,LARGE(IF(Source!$I$3:$I$100<>\"\",IF(Source!$I$3:$I$100=\"إيداع\",ROW($I$4:$I$101)-ROW($I$4)+1)),ROWS($A$2:H6))))","v":""},{"$f":"IF(ROWS($A$2:I6)>$E$1,\"\",INDEX(Source!I$3:I$100,LARGE(IF(Source!$I$3:$I$100<>\"\",IF(Source!$I$3:$I$100=\"إيداع\",ROW($I$4:$I$101)-ROW($I$4)+1)),ROWS($A$2:I6))))","v":""},{"$f":"IF(ROWS($A$2:J6)>$E$1,\"\",INDEX(Source!J$3:J$100,LARGE(IF(Source!$I$3:$I$100<>\"\",IF(Source!$I$3:$I$100=\"إيداع\",ROW($I$4:$I$101)-ROW($I$4)+1)),ROWS($A$2:J6))))","v":""}]
[null,{"$f":"IF(ROWS($A$2:A7)>$E$1,\"\",INDEX(Source!A$3:A$100,LARGE(IF(Source!$I$3:$I$100<>\"\",IF(Source!$I$3:$I$100=\"إيداع\",ROW($I$4:$I$101)-ROW($I$4)+1)),ROWS($A$2:A7))))","v":""},{"$f":"IF(ROWS($A$2:B7)>$E$1,\"\",INDEX(Source!B$3:B$100,LARGE(IF(Source!$I$3:$I$100<>\"\",IF(Source!$I$3:$I$100=\"إيداع\",ROW($I$4:$I$101)-ROW($I$4)+1)),ROWS($A$2:B7))))","v":""},{"$f":"IF(ROWS($A$2:C7)>$E$1,\"\",INDEX(Source!C$3:C$100,LARGE(IF(Source!$I$3:$I$100<>\"\",IF(Source!$I$3:$I$100=\"إيداع\",ROW($I$4:$I$101)-ROW($I$4)+1)),ROWS($A$2:C7))))","v":""},{"$f":"IF(ROWS($A$2:D7)>$E$1,\"\",INDEX(Source!D$3:D$100,LARGE(IF(Source!$I$3:$I$100<>\"\",IF(Source!$I$3:$I$100=\"إيداع\",ROW($I$4:$I$101)-ROW($I$4)+1)),ROWS($A$2:D7))))","v":""},{"$f":"IF(ROWS($A$2:E7)>$E$1,\"\",INDEX(Source!E$3:E$100,LARGE(IF(Source!$I$3:$I$100<>\"\",IF(Source!$I$3:$I$100=\"إيداع\",ROW($I$4:$I$101)-ROW($I$4)+1)),ROWS($A$2:E7))))","v":""},{"$f":"IF(ROWS($A$2:F7)>$E$1,\"\",INDEX(Source!F$3:F$100,LARGE(IF(Source!$I$3:$I$100<>\"\",IF(Source!$I$3:$I$100=\"إيداع\",ROW($I$4:$I$101)-ROW($I$4)+1)),ROWS($A$2:F7))))","v":""},{"$f":"IF(ROWS($A$2:G7)>$E$1,\"\",INDEX(Source!G$3:G$100,LARGE(IF(Source!$I$3:$I$100<>\"\",IF(Source!$I$3:$I$100=\"إيداع\",ROW($I$4:$I$101)-ROW($I$4)+1)),ROWS($A$2:G7))))","v":""},{"$f":"IF(ROWS($A$2:H7)>$E$1,\"\",INDEX(Source!H$3:H$100,LARGE(IF(Source!$I$3:$I$100<>\"\",IF(Source!$I$3:$I$100=\"إيداع\",ROW($I$4:$I$101)-ROW($I$4)+1)),ROWS($A$2:H7))))","v":""},{"$f":"IF(ROWS($A$2:I7)>$E$1,\"\",INDEX(Source!I$3:I$100,LARGE(IF(Source!$I$3:$I$100<>\"\",IF(Source!$I$3:$I$100=\"إيداع\",ROW($I$4:$I$101)-ROW($I$4)+1)),ROWS($A$2:I7))))","v":""},{"$f":"IF(ROWS($A$2:J7)>$E$1,\"\",INDEX(Source!J$3:J$100,LARGE(IF(Source!$I$3:$I$100<>\"\",IF(Source!$I$3:$I$100=\"إيداع\",ROW($I$4:$I$101)-ROW($I$4)+1)),ROWS($A$2:J7))))","v":""}]
[null,{"$f":"IF(ROWS($A$2:A8)>$E$1,\"\",INDEX(Source!A$3:A$100,LARGE(IF(Source!$I$3:$I$100<>\"\",IF(Source!$I$3:$I$100=\"إيداع\",ROW($I$4:$I$101)-ROW($I$4)+1)),ROWS($A$2:A8))))","v":""},{"$f":"IF(ROWS($A$2:B8)>$E$1,\"\",INDEX(Source!B$3:B$100,LARGE(IF(Source!$I$3:$I$100<>\"\",IF(Source!$I$3:$I$100=\"إيداع\",ROW($I$4:$I$101)-ROW($I$4)+1)),ROWS($A$2:B8))))","v":""},{"$f":"IF(ROWS($A$2:C8)>$E$1,\"\",INDEX(Source!C$3:C$100,LARGE(IF(Source!$I$3:$I$100<>\"\",IF(Source!$I$3:$I$100=\"إيداع\",ROW($I$4:$I$101)-ROW($I$4)+1)),ROWS($A$2:C8))))","v":""},{"$f":"IF(ROWS($A$2:D8)>$E$1,\"\",INDEX(Source!D$3:D$100,LARGE(IF(Source!$I$3:$I$100<>\"\",IF(Source!$I$3:$I$100=\"إيداع\",ROW($I$4:$I$101)-ROW($I$4)+1)),ROWS($A$2:D8))))","v":""},{"$f":"IF(ROWS($A$2:E8)>$E$1,\"\",INDEX(Source!E$3:E$100,LARGE(IF(Source!$I$3:$I$100<>\"\",IF(Source!$I$3:$I$100=\"إيداع\",ROW($I$4:$I$101)-ROW($I$4)+1)),ROWS($A$2:E8))))","v":""},{"$f":"IF(ROWS($A$2:F8)>$E$1,\"\",INDEX(Source!F$3:F$100,LARGE(IF(Source!$I$3:$I$100<>\"\",IF(Source!$I$3:$I$100=\"إيداع\",ROW($I$4:$I$101)-ROW($I$4)+1)),ROWS($A$2:F8))))","v":""},{"$f":"IF(ROWS($A$2:G8)>$E$1,\"\",INDEX(Source!G$3:G$100,LARGE(IF(Source!$I$3:$I$100<>\"\",IF(Source!$I$3:$I$100=\"إيداع\",ROW($I$4:$I$101)-ROW($I$4)+1)),ROWS($A$2:G8))))","v":""},{"$f":"IF(ROWS($A$2:H8)>$E$1,\"\",INDEX(Source!H$3:H$100,LARGE(IF(Source!$I$3:$I$100<>\"\",IF(Source!$I$3:$I$100=\"إيداع\",ROW($I$4:$I$101)-ROW($I$4)+1)),ROWS($A$2:H8))))","v":""},{"$f":"IF(ROWS($A$2:I8)>$E$1,\"\",INDEX(Source!I$3:I$100,LARGE(IF(Source!$I$3:$I$100<>\"\",IF(Source!$I$3:$I$100=\"إيداع\",ROW($I$4:$I$101)-ROW($I$4)+1)),ROWS($A$2:I8))))","v":""},{"$f":"IF(ROWS($A$2:J8)>$E$1,\"\",INDEX(Source!J$3:J$100,LARGE(IF(Source!$I$3:$I$100<>\"\",IF(Source!$I$3:$I$100=\"إيداع\",ROW($I$4:$I$101)-ROW($I$4)+1)),ROWS($A$2:J8))))","v":""}]
[null,{"$f":"IF(ROWS($A$2:A9)>$E$1,\"\",INDEX(Source!A$3:A$100,LARGE(IF(Source!$I$3:$I$100<>\"\",IF(Source!$I$3:$I$100=\"إيداع\",ROW($I$4:$I$101)-ROW($I$4)+1)),ROWS($A$2:A9))))","v":""},{"$f":"IF(ROWS($A$2:B9)>$E$1,\"\",INDEX(Source!B$3:B$100,LARGE(IF(Source!$I$3:$I$100<>\"\",IF(Source!$I$3:$I$100=\"إيداع\",ROW($I$4:$I$101)-ROW($I$4)+1)),ROWS($A$2:B9))))","v":""},{"$f":"IF(ROWS($A$2:C9)>$E$1,\"\",INDEX(Source!C$3:C$100,LARGE(IF(Source!$I$3:$I$100<>\"\",IF(Source!$I$3:$I$100=\"إيداع\",ROW($I$4:$I$101)-ROW($I$4)+1)),ROWS($A$2:C9))))","v":""},{"$f":"IF(ROWS($A$2:D9)>$E$1,\"\",INDEX(Source!D$3:D$100,LARGE(IF(Source!$I$3:$I$100<>\"\",IF(Source!$I$3:$I$100=\"إيداع\",ROW($I$4:$I$101)-ROW($I$4)+1)),ROWS($A$2:D9))))","v":""},{"$f":"IF(ROWS($A$2:E9)>$E$1,\"\",INDEX(Source!E$3:E$100,LARGE(IF(Source!$I$3:$I$100<>\"\",IF(Source!$I$3:$I$100=\"إيداع\",ROW($I$4:$I$101)-ROW($I$4)+1)),ROWS($A$2:E9))))","v":""},{"$f":"IF(ROWS($A$2:F9)>$E$1,\"\",INDEX(Source!F$3:F$100,LARGE(IF(Source!$I$3:$I$100<>\"\",IF(Source!$I$3:$I$100=\"إيداع\",ROW($I$4:$I$101)-ROW($I$4)+1)),ROWS($A$2:F9))))","v":""},{"$f":"IF(ROWS($A$2:G9)>$E$1,\"\",INDEX(Source!G$3:G$100,LARGE(IF(Source!$I$3:$I$100<>\"\",IF(Source!$I$3:$I$100=\"إيداع\",ROW($I$4:$I$101)-ROW($I$4)+1)),ROWS($A$2:G9))))","v":""},{"$f":"IF(ROWS($A$2:H9)>$E$1,\"\",INDEX(Source!H$3:H$100,LARGE(IF(Source!$I$3:$I$100<>\"\",IF(Source!$I$3:$I$100=\"إيداع\",ROW($I$4:$I$101)-ROW($I$4)+1)),ROWS($A$2:H9))))","v":""},{"$f":"IF(ROWS($A$2:I9)>$E$1,\"\",INDEX(Source!I$3:I$100,LARGE(IF(Source!$I$3:$I$100<>\"\",IF(Source!$I$3:$I$100=\"إيداع\",ROW($I$4:$I$101)-ROW($I$4)+1)),ROWS($A$2:I9))))","v":""},{"$f":"IF(ROWS($A$2:J9)>$E$1,\"\",INDEX(Source!J$3:J$100,LARGE(IF(Source!$I$3:$I$100<>\"\",IF(Source!$I$3:$I$100=\"إيداع\",ROW($I$4:$I$101)-ROW($I$4)+1)),ROWS($A$2:J9))))","v":""}]
[null,{"$f":"IF(ROWS($A$2:A10)>$E$1,\"\",INDEX(Source!A$3:A$100,LARGE(IF(Source!$I$3:$I$100<>\"\",IF(Source!$I$3:$I$100=\"إيداع\",ROW($I$4:$I$101)-ROW($I$4)+1)),ROWS($A$2:A10))))","v":""},{"$f":"IF(ROWS($A$2:B10)>$E$1,\"\",INDEX(Source!B$3:B$100,LARGE(IF(Source!$I$3:$I$100<>\"\",IF(Source!$I$3:$I$100=\"إيداع\",ROW($I$4:$I$101)-ROW($I$4)+1)),ROWS($A$2:B10))))","v":""},{"$f":"IF(ROWS($A$2:C10)>$E$1,\"\",INDEX(Source!C$3:C$100,LARGE(IF(Source!$I$3:$I$100<>\"\",IF(Source!$I$3:$I$100=\"إيداع\",ROW($I$4:$I$101)-ROW($I$4)+1)),ROWS($A$2:C10))))","v":""},{"$f":"IF(ROWS($A$2:D10)>$E$1,\"\",INDEX(Source!D$3:D$100,LARGE(IF(Source!$I$3:$I$100<>\"\",IF(Source!$I$3:$I$100=\"إيداع\",ROW($I$4:$I$101)-ROW($I$4)+1)),ROWS($A$2:D10))))","v":""},{"$f":"IF(ROWS($A$2:E10)>$E$1,\"\",INDEX(Source!E$3:E$100,LARGE(IF(Source!$I$3:$I$100<>\"\",IF(Source!$I$3:$I$100=\"إيداع\",ROW($I$4:$I$101)-ROW($I$4)+1)),ROWS($A$2:E10))))","v":""},{"$f":"IF(ROWS($A$2:F10)>$E$1,\"\",INDEX(Source!F$3:F$100,LARGE(IF(Source!$I$3:$I$100<>\"\",IF(Source!$I$3:$I$100=\"إيداع\",ROW($I$4:$I$101)-ROW($I$4)+1)),ROWS($A$2:F10))))","v":""},{"$f":"IF(ROWS($A$2:G10)>$E$1,\"\",INDEX(Source!G$3:G$100,LARGE(IF(Source!$I$3:$I$100<>\"\",IF(Source!$I$3:$I$100=\"إيداع\",ROW($I$4:$I$101)-ROW($I$4)+1)),ROWS($A$2:G10))))","v":""},{"$f":"IF(ROWS($A$2:H10)>$E$1,\"\",INDEX(Source!H$3:H$100,LARGE(IF(Source!$I$3:$I$100<>\"\",IF(Source!$I$3:$I$100=\"إيداع\",ROW($I$4:$I$101)-ROW($I$4)+1)),ROWS($A$2:H10))))","v":""},{"$f":"IF(ROWS($A$2:I10)>$E$1,\"\",INDEX(Source!I$3:I$100,LARGE(IF(Source!$I$3:$I$100<>\"\",IF(Source!$I$3:$I$100=\"إيداع\",ROW($I$4:$I$101)-ROW($I$4)+1)),ROWS($A$2:I10))))","v":""},{"$f":"IF(ROWS($A$2:J10)>$E$1,\"\",INDEX(Source!J$3:J$100,LARGE(IF(Source!$I$3:$I$100<>\"\",IF(Source!$I$3:$I$100=\"إيداع\",ROW($I$4:$I$101)-ROW($I$4)+1)),ROWS($A$2:J10))))","v":""}]
[null,{"$f":"IF(ROWS($A$2:A11)>$E$1,\"\",INDEX(Source!A$3:A$100,LARGE(IF(Source!$I$3:$I$100<>\"\",IF(Source!$I$3:$I$100=\"إيداع\",ROW($I$4:$I$101)-ROW($I$4)+1)),ROWS($A$2:A11))))","v":""},{"$f":"IF(ROWS($A$2:B11)>$E$1,\"\",INDEX(Source!B$3:B$100,LARGE(IF(Source!$I$3:$I$100<>\"\",IF(Source!$I$3:$I$100=\"إيداع\",ROW($I$4:$I$101)-ROW($I$4)+1)),ROWS($A$2:B11))))","v":""},{"$f":"IF(ROWS($A$2:C11)>$E$1,\"\",INDEX(Source!C$3:C$100,LARGE(IF(Source!$I$3:$I$100<>\"\",IF(Source!$I$3:$I$100=\"إيداع\",ROW($I$4:$I$101)-ROW($I$4)+1)),ROWS($A$2:C11))))","v":""},{"$f":"IF(ROWS($A$2:D11)>$E$1,\"\",INDEX(Source!D$3:D$100,LARGE(IF(Source!$I$3:$I$100<>\"\",IF(Source!$I$3:$I$100=\"إيداع\",ROW($I$4:$I$101)-ROW($I$4)+1)),ROWS($A$2:D11))))","v":""},{"$f":"IF(ROWS($A$2:E11)>$E$1,\"\",INDEX(Source!E$3:E$100,LARGE(IF(Source!$I$3:$I$100<>\"\",IF(Source!$I$3:$I$100=\"إيداع\",ROW($I$4:$I$101)-ROW($I$4)+1)),ROWS($A$2:E11))))","v":""},{"$f":"IF(ROWS($A$2:F11)>$E$1,\"\",INDEX(Source!F$3:F$100,LARGE(IF(Source!$I$3:$I$100<>\"\",IF(Source!$I$3:$I$100=\"إيداع\",ROW($I$4:$I$101)-ROW($I$4)+1)),ROWS($A$2:F11))))","v":""},{"$f":"IF(ROWS($A$2:G11)>$E$1,\"\",INDEX(Source!G$3:G$100,LARGE(IF(Source!$I$3:$I$100<>\"\",IF(Source!$I$3:$I$100=\"إيداع\",ROW($I$4:$I$101)-ROW($I$4)+1)),ROWS($A$2:G11))))","v":""},{"$f":"IF(ROWS($A$2:H11)>$E$1,\"\",INDEX(Source!H$3:H$100,LARGE(IF(Source!$I$3:$I$100<>\"\",IF(Source!$I$3:$I$100=\"إيداع\",ROW($I$4:$I$101)-ROW($I$4)+1)),ROWS($A$2:H11))))","v":""},{"$f":"IF(ROWS($A$2:I11)>$E$1,\"\",INDEX(Source!I$3:I$100,LARGE(IF(Source!$I$3:$I$100<>\"\",IF(Source!$I$3:$I$100=\"إيداع\",ROW($I$4:$I$101)-ROW($I$4)+1)),ROWS($A$2:I11))))","v":""},{"$f":"IF(ROWS($A$2:J11)>$E$1,\"\",INDEX(Source!J$3:J$100,LARGE(IF(Source!$I$3:$I$100<>\"\",IF(Source!$I$3:$I$100=\"إيداع\",ROW($I$4:$I$101)-ROW($I$4)+1)),ROWS($A$2:J11))))","v":""}]
[null,{"$f":"IF(ROWS($A$2:A12)>$E$1,\"\",INDEX(Source!A$3:A$100,LARGE(IF(Source!$I$3:$I$100<>\"\",IF(Source!$I$3:$I$100=\"إيداع\",ROW($I$4:$I$101)-ROW($I$4)+1)),ROWS($A$2:A12))))","v":""},{"$f":"IF(ROWS($A$2:B12)>$E$1,\"\",INDEX(Source!B$3:B$100,LARGE(IF(Source!$I$3:$I$100<>\"\",IF(Source!$I$3:$I$100=\"إيداع\",ROW($I$4:$I$101)-ROW($I$4)+1)),ROWS($A$2:B12))))","v":""},{"$f":"IF(ROWS($A$2:C12)>$E$1,\"\",INDEX(Source!C$3:C$100,LARGE(IF(Source!$I$3:$I$100<>\"\",IF(Source!$I$3:$I$100=\"إيداع\",ROW($I$4:$I$101)-ROW($I$4)+1)),ROWS($A$2:C12))))","v":""},{"$f":"IF(ROWS($A$2:D12)>$E$1,\"\",INDEX(Source!D$3:D$100,LARGE(IF(Source!$I$3:$I$100<>\"\",IF(Source!$I$3:$I$100=\"إيداع\",ROW($I$4:$I$101)-ROW($I$4)+1)),ROWS($A$2:D12))))","v":""},{"$f":"IF(ROWS($A$2:E12)>$E$1,\"\",INDEX(Source!E$3:E$100,LARGE(IF(Source!$I$3:$I$100<>\"\",IF(Source!$I$3:$I$100=\"إيداع\",ROW($I$4:$I$101)-ROW($I$4)+1)),ROWS($A$2:E12))))","v":""},{"$f":"IF(ROWS($A$2:F12)>$E$1,\"\",INDEX(Source!F$3:F$100,LARGE(IF(Source!$I$3:$I$100<>\"\",IF(Source!$I$3:$I$100=\"إيداع\",ROW($I$4:$I$101)-ROW($I$4)+1)),ROWS($A$2:F12))))","v":""},{"$f":"IF(ROWS($A$2:G12)>$E$1,\"\",INDEX(Source!G$3:G$100,LARGE(IF(Source!$I$3:$I$100<>\"\",IF(Source!$I$3:$I$100=\"إيداع\",ROW($I$4:$I$101)-ROW($I$4)+1)),ROWS($A$2:G12))))","v":""},{"$f":"IF(ROWS($A$2:H12)>$E$1,\"\",INDEX(Source!H$3:H$100,LARGE(IF(Source!$I$3:$I$100<>\"\",IF(Source!$I$3:$I$100=\"إيداع\",ROW($I$4:$I$101)-ROW($I$4)+1)),ROWS($A$2:H12))))","v":""},{"$f":"IF(ROWS($A$2:I12)>$E$1,\"\",INDEX(Source!I$3:I$100,LARGE(IF(Source!$I$3:$I$100<>\"\",IF(Source!$I$3:$I$100=\"إيداع\",ROW($I$4:$I$101)-ROW($I$4)+1)),ROWS($A$2:I12))))","v":""},{"$f":"IF(ROWS($A$2:J12)>$E$1,\"\",INDEX(Source!J$3:J$100,LARGE(IF(Source!$I$3:$I$100<>\"\",IF(Source!$I$3:$I$100=\"إيداع\",ROW($I$4:$I$101)-ROW($I$4)+1)),ROWS($A$2:J12))))","v":""}]
[null,{"$f":"IF(ROWS($A$2:A13)>$E$1,\"\",INDEX(Source!A$3:A$100,LARGE(IF(Source!$I$3:$I$100<>\"\",IF(Source!$I$3:$I$100=\"إيداع\",ROW($I$4:$I$101)-ROW($I$4)+1)),ROWS($A$2:A13))))","v":""},{"$f":"IF(ROWS($A$2:B13)>$E$1,\"\",INDEX(Source!B$3:B$100,LARGE(IF(Source!$I$3:$I$100<>\"\",IF(Source!$I$3:$I$100=\"إيداع\",ROW($I$4:$I$101)-ROW($I$4)+1)),ROWS($A$2:B13))))","v":""},{"$f":"IF(ROWS($A$2:C13)>$E$1,\"\",INDEX(Source!C$3:C$100,LARGE(IF(Source!$I$3:$I$100<>\"\",IF(Source!$I$3:$I$100=\"إيداع\",ROW($I$4:$I$101)-ROW($I$4)+1)),ROWS($A$2:C13))))","v":""},{"$f":"IF(ROWS($A$2:D13)>$E$1,\"\",INDEX(Source!D$3:D$100,LARGE(IF(Source!$I$3:$I$100<>\"\",IF(Source!$I$3:$I$100=\"إيداع\",ROW($I$4:$I$101)-ROW($I$4)+1)),ROWS($A$2:D13))))","v":""},{"$f":"IF(ROWS($A$2:E13)>$E$1,\"\",INDEX(Source!E$3:E$100,LARGE(IF(Source!$I$3:$I$100<>\"\",IF(Source!$I$3:$I$100=\"إيداع\",ROW($I$4:$I$101)-ROW($I$4)+1)),ROWS($A$2:E13))))","v":""},{"$f":"IF(ROWS($A$2:F13)>$E$1,\"\",INDEX(Source!F$3:F$100,LARGE(IF(Source!$I$3:$I$100<>\"\",IF(Source!$I$3:$I$100=\"إيداع\",ROW($I$4:$I$101)-ROW($I$4)+1)),ROWS($A$2:F13))))","v":""},{"$f":"IF(ROWS($A$2:G13)>$E$1,\"\",INDEX(Source!G$3:G$100,LARGE(IF(Source!$I$3:$I$100<>\"\",IF(Source!$I$3:$I$100=\"إيداع\",ROW($I$4:$I$101)-ROW($I$4)+1)),ROWS($A$2:G13))))","v":""},{"$f":"IF(ROWS($A$2:H13)>$E$1,\"\",INDEX(Source!H$3:H$100,LARGE(IF(Source!$I$3:$I$100<>\"\",IF(Source!$I$3:$I$100=\"إيداع\",ROW($I$4:$I$101)-ROW($I$4)+1)),ROWS($A$2:H13))))","v":""},{"$f":"IF(ROWS($A$2:I13)>$E$1,\"\",INDEX(Source!I$3:I$100,LARGE(IF(Source!$I$3:$I$100<>\"\",IF(Source!$I$3:$I$100=\"إيداع\",ROW($I$4:$I$101)-ROW($I$4)+1)),ROWS($A$2:I13))))","v":""},{"$f":"IF(ROWS($A$2:J13)>$E$1,\"\",INDEX(Source!J$3:J$100,LARGE(IF(Source!$I$3:$I$100<>\"\",IF(Source!$I$3:$I$100=\"إيداع\",ROW($I$4:$I$101)-ROW($I$4)+1)),ROWS($A$2:J13))))","v":""}]
{"$rows_left_out":158}