{"text_format":"1","workbook":"xlsx","n_sheets":3,"sheets":["Source","Target","Max_3"],"not_rendered":{"charts":2,"images":0,"macros":1,"external_links":0,"defined_names":1,"comments":0,"pivot_tables":0},"unopened":[],"bounds":{"document_bytes":16777216,"sheet_cells":100000,"rows_first":2000,"rows_last":500,"rows_between":2000,"halvings":0,"cell_chars":16384,"cell_head_chars":4096},"cells_cut":0,"cells_raw":0,"read":"whole","date_system":"1900"}

{"sheet":"Source","index":0,"n_rows":172,"n_cols":13,"rows_kept":172,"cut":false,"hidden":false,"merged":[[61,1,61,2]]}
[]
["الاسم والكنية ","اسم الأب","اسم الأم","المواليد","الجنس","تاريخ فتح الحساب","رقم الحساب","الرصيد","نوع آخر عملية للعميل","تاريخ آخر عملية"]
["إبراهيم سالوخة","صفوان","نهى","2001-06-14","ذكر","2018-09-06",3453553673,488320000,"سحب ","2018-03-02",null,null,{"$f":"LARGE(H3:H46,1)","v":2342322546}]
["قاهر الدناوي","بشار","ديمة","1961-05-23","ذكر","1990-09-09",2342342,2425252,"سحب ","2018-09-02"]
["محمود سعيد","علاء","سوسن","1975-08-03","ذكر","2007-09-05",2342345,22342400,"إيداع","2017-08-05"]
["صديقة طاطروس","مفيد","سوزان","1965-10-07","انثى","1999-09-04",3353455,23423400,"تحويل ","2016-05-04"]
["بانة الرحال","أسعد","سوزي","1982-05-03","انثى","2007-09-04",34575675,2342322546,"سحب ","2019-06-03"]
["سالم الجردي","عارف","سونا","1987-11-03","ذكر","2009-08-06",53535355,53200000,"إيداع","2019-06-04"]
["شاديا حماد","فراس","نسرين","1974-06-05","انثى","1999-04-05",3453456,2342322546,"تحويل ","2019-06-05"]
["سمير جاموس","وسيم","سيرين","1980-06-06","ذكر","2010-09-06",63453453,2340000,"تحويل ","2019-06-06"]
["بدر حبيب","بسام","روزانا","1990-09-04","ذكر","2018-10-05",2345345345,2340000,"تحويل ","2019-06-07"]
["جورجيت سليط","وائل","ليندا","1973-08-05","انثى","2001-05-05",34535345,95436,"سحب ","2019-06-08"]
["محمود سعيد","علي ","لين","1978-07-05","ذكر","1999-08-09",3453525,2353000,"تحويل ","2019-06-09"]
["علا نبهان","غديل","مايا","1967-09-04","انثى","1997-08-07",3453234,23420000,"إيداع","2019-06-10"]
["محمد عبد اللطيف","حمزة","نايا","1987-03-02","ذكر","2009-04-06",3453453,1300000,"إيداع","2019-06-11"]
{"$rows_left_out":158}
{"sheet":"Target","index":1,"n_rows":17,"n_cols":11,"rows_kept":17,"cut":false,"hidden":false,"merged":[]}
[]
["#","الاسم والكنية ","اسم الأب","اسم الأم","المواليد","الجنس","تاريخ فتح الحساب","رقم الحساب","الرصيد","نوع آخر عملية للعميل","تاريخ آخر عملية"]
[1,"إبراهيم سالوخة","صفوان","نهى","2001-06-14","ذكر","2018-09-06",3453553673,5325987,"سحب ","2018-03-02"]
[2,"قاهر الدناوي","بشار","ديمة","1961-05-23","ذكر","1990-09-09",2342342,2425252,"سحب ","2018-09-02"]
[3,"بانة الرحال","أسعد","سوزي","1982-05-03","انثى","2007-09-04",34575675,2342322546,"سحب ","2019-06-03"]
[4,"جورجيت سليط","وائل","ليندا","1973-08-05","انثى","2001-05-05",34535345,95436,"سحب ","2019-06-08"]
[5,"ميشيل ديب","غياث","جولي","1950-06-05","ذكر","2004-09-08",8658856,340000,"سحب ","2019-06-13"]
[6,"أحلام جعفر","فارس","نبيلة","1959-08-05","انثى","1997-09-08",5678567,42340000,"سحب ","2019-06-17"]
[7,"عمر عمري","برهان","منى","1998-09-05","ذكر","2018-11-09",9456745745,23400000,"سحب ","2019-06-18"]
[8,"سمير خطاب","سليمان","فاتن","1950-06-04","ذكر","1983-09-05",456745,44234000,"سحب ","2019-06-19"]
[9,"يوسف حنوف","علاء","منى ","1998-07-05","ذكر","2017-01-04",5677567775,4300000,"سحب ","2019-06-26"]
[10,"عواطف سلامة","محمد ","ملك","1964-04-23","انثى","1988-09-08",8567454,488320000,"سحب ","2019-06-30"]
[11,"نبيه يوسف","حمزة","داليا","1984-09-08","انثى","2014-07-08",5456754,54000000,"سحب ","2019-07-02"]
[12,"مريم خوري","ماهر","سوسن","1960-08-04","انثى","1980-09-05",8456848484,5200000,"سحب ","2019-07-04"]
[13,"نور نجاري","أيهم","أمل","1964-08-05","ذكر","1983-08-09",3454363,54500000,"سحب ","2019-07-07"]
{"$rows_left_out":3}
{"sheet":"Max_3","index":2,"n_rows":173,"n_cols":11,"rows_kept":173,"cut":false,"hidden":false,"merged":[]}
[null,"عدد الاشخاص",{"$f":"COUNTIF(Source!$H$3:$H$100,\">=\"&LARGE(Source!$H$3:$H$100,$E$1))","v":5},null,4,"أعلى رصيد",null,"الرصيد"]
[]
[null,"الاسم والكنية ","اسم الأب","اسم الأم","المواليد","الجنس","تاريخ فتح الحساب","رقم الحساب","الرصيد","نوع آخر عملية للعميل","تاريخ آخر عملية"]
[null,{"$f":"IF(ROWS($A$1:A1)>$C$1,\"\",INDEX(Source!A$3:A$100,LARGE(IF(Source!$H$3:$H$100>=LARGE(Source!$H$3:$H$100,$E$1),ROW($H$3:$H$100)-ROW($H$3)+1),ROWS($A$1:A1))))","v":"إيمان يوسف"},{"$f":"IF(ROWS($A$1:B1)>$C$1,\"\",INDEX(Source!B$3:B$100,LARGE(IF(Source!$H$3:$H$100>=LARGE(Source!$H$3:$H$100,$E$1),ROW($H$3:$H$100)-ROW($H$3)+1),ROWS($A$1:B1))))","v":"علي "},{"$f":"IF(ROWS($A$1:C1)>$C$1,\"\",INDEX(Source!C$3:C$100,LARGE(IF(Source!$H$3:$H$100>=LARGE(Source!$H$3:$H$100,$E$1),ROW($H$3:$H$100)-ROW($H$3)+1),ROWS($A$1:C1))))","v":"منى "},{"$f":"IF(ROWS($A$1:D1)>$C$1,\"\",INDEX(Source!D$3:D$100,LARGE(IF(Source!$H$3:$H$100>=LARGE(Source!$H$3:$H$100,$E$1),ROW($H$3:$H$100)-ROW($H$3)+1),ROWS($A$1:D1))))","v":"1986-08-06"},{"$f":"IF(ROWS($A$1:E1)>$C$1,\"\",INDEX(Source!E$3:E$100,LARGE(IF(Source!$H$3:$H$100>=LARGE(Source!$H$3:$H$100,$E$1),ROW($H$3:$H$100)-ROW($H$3)+1),ROWS($A$1:E1))))","v":"انثى"},{"$f":"IF(ROWS($A$1:F1)>$C$1,\"\",INDEX(Source!F$3:F$100,LARGE(IF(Source!$H$3:$H$100>=LARGE(Source!$H$3:$H$100,$E$1),ROW($H$3:$H$100)-ROW($H$3)+1),ROWS($A$1:F1))))","v":"2009-09-08"},{"$f":"IF(ROWS($A$1:G1)>$C$1,\"\",INDEX(Source!G$3:G$100,LARGE(IF(Source!$H$3:$H$100>=LARGE(Source!$H$3:$H$100,$E$1),ROW($H$3:$H$100)-ROW($H$3)+1),ROWS($A$1:G1))))","v":456478564},{"$f":"IF(ROWS($A$1:H1)>$C$1,\"\",INDEX(Source!H$3:H$100,LARGE(IF(Source!$H$3:$H$100>=LARGE(Source!$H$3:$H$100,$E$1),ROW($H$3:$H$100)-ROW($H$3)+1),ROWS($A$1:H1))))","v":543000000},{"$f":"IF(ROWS($A$1:I1)>$C$1,\"\",INDEX(Source!I$3:I$100,LARGE(IF(Source!$H$3:$H$100>=LARGE(Source!$H$3:$H$100,$E$1),ROW($H$3:$H$100)-ROW($H$3)+1),ROWS($A$1:I1))))","v":"تحويل "},{"$f":"IF(ROWS($A$1:J1)>$C$1,\"\",INDEX(Source!J$3:J$100,LARGE(IF(Source!$H$3:$H$100>=LARGE(Source!$H$3:$H$100,$E$1),ROW($H$3:$H$100)-ROW($H$3)+1),ROWS($A$1:J1))))","v":"2019-07-09"}]
[null,{"$f":"IF(ROWS($A$1:A2)>$C$1,\"\",INDEX(Source!A$3:A$100,LARGE(IF(Source!$H$3:$H$100>=LARGE(Source!$H$3:$H$100,$E$1),ROW($H$3:$H$100)-ROW($H$3)+1),ROWS($A$1:A2))))","v":"عواطف سلامة"},{"$f":"IF(ROWS($A$1:B2)>$C$1,\"\",INDEX(Source!B$3:B$100,LARGE(IF(Source!$H$3:$H$100>=LARGE(Source!$H$3:$H$100,$E$1),ROW($H$3:$H$100)-ROW($H$3)+1),ROWS($A$1:B2))))","v":"محمد "},{"$f":"IF(ROWS($A$1:C2)>$C$1,\"\",INDEX(Source!C$3:C$100,LARGE(IF(Source!$H$3:$H$100>=LARGE(Source!$H$3:$H$100,$E$1),ROW($H$3:$H$100)-ROW($H$3)+1),ROWS($A$1:C2))))","v":"ملك"},{"$f":"IF(ROWS($A$1:D2)>$C$1,\"\",INDEX(Source!D$3:D$100,LARGE(IF(Source!$H$3:$H$100>=LARGE(Source!$H$3:$H$100,$E$1),ROW($H$3:$H$100)-ROW($H$3)+1),ROWS($A$1:D2))))","v":"1964-04-23"},{"$f":"IF(ROWS($A$1:E2)>$C$1,\"\",INDEX(Source!E$3:E$100,LARGE(IF(Source!$H$3:$H$100>=LARGE(Source!$H$3:$H$100,$E$1),ROW($H$3:$H$100)-ROW($H$3)+1),ROWS($A$1:E2))))","v":"انثى"},{"$f":"IF(ROWS($A$1:F2)>$C$1,\"\",INDEX(Source!F$3:F$100,LARGE(IF(Source!$H$3:$H$100>=LARGE(Source!$H$3:$H$100,$E$1),ROW($H$3:$H$100)-ROW($H$3)+1),ROWS($A$1:F2))))","v":"1988-09-08"},{"$f":"IF(ROWS($A$1:G2)>$C$1,\"\",INDEX(Source!G$3:G$100,LARGE(IF(Source!$H$3:$H$100>=LARGE(Source!$H$3:$H$100,$E$1),ROW($H$3:$H$100)-ROW($H$3)+1),ROWS($A$1:G2))))","v":8567454},{"$f":"IF(ROWS($A$1:H2)>$C$1,\"\",INDEX(Source!H$3:H$100,LARGE(IF(Source!$H$3:$H$100>=LARGE(Source!$H$3:$H$100,$E$1),ROW($H$3:$H$100)-ROW($H$3)+1),ROWS($A$1:H2))))","v":488320000},{"$f":"IF(ROWS($A$1:I2)>$C$1,\"\",INDEX(Source!I$3:I$100,LARGE(IF(Source!$H$3:$H$100>=LARGE(Source!$H$3:$H$100,$E$1),ROW($H$3:$H$100)-ROW($H$3)+1),ROWS($A$1:I2))))","v":"سحب "},{"$f":"IF(ROWS($A$1:J2)>$C$1,\"\",INDEX(Source!J$3:J$100,LARGE(IF(Source!$H$3:$H$100>=LARGE(Source!$H$3:$H$100,$E$1),ROW($H$3:$H$100)-ROW($H$3)+1),ROWS($A$1:J2))))","v":"2019-06-30"}]
[null,{"$f":"IF(ROWS($A$1:A3)>$C$1,\"\",INDEX(Source!A$3:A$100,LARGE(IF(Source!$H$3:$H$100>=LARGE(Source!$H$3:$H$100,$E$1),ROW($H$3:$H$100)-ROW($H$3)+1),ROWS($A$1:A3))))","v":"شاديا حماد"},{"$f":"IF(ROWS($A$1:B3)>$C$1,\"\",INDEX(Source!B$3:B$100,LARGE(IF(Source!$H$3:$H$100>=LARGE(Source!$H$3:$H$100,$E$1),ROW($H$3:$H$100)-ROW($H$3)+1),ROWS($A$1:B3))))","v":"فراس"},{"$f":"IF(ROWS($A$1:C3)>$C$1,\"\",INDEX(Source!C$3:C$100,LARGE(IF(Source!$H$3:$H$100>=LARGE(Source!$H$3:$H$100,$E$1),ROW($H$3:$H$100)-ROW($H$3)+1),ROWS($A$1:C3))))","v":"نسرين"},{"$f":"IF(ROWS($A$1:D3)>$C$1,\"\",INDEX(Source!D$3:D$100,LARGE(IF(Source!$H$3:$H$100>=LARGE(Source!$H$3:$H$100,$E$1),ROW($H$3:$H$100)-ROW($H$3)+1),ROWS($A$1:D3))))","v":"1974-06-05"},{"$f":"IF(ROWS($A$1:E3)>$C$1,\"\",INDEX(Source!E$3:E$100,LARGE(IF(Source!$H$3:$H$100>=LARGE(Source!$H$3:$H$100,$E$1),ROW($H$3:$H$100)-ROW($H$3)+1),ROWS($A$1:E3))))","v":"انثى"},{"$f":"IF(ROWS($A$1:F3)>$C$1,\"\",INDEX(Source!F$3:F$100,LARGE(IF(Source!$H$3:$H$100>=LARGE(Source!$H$3:$H$100,$E$1),ROW($H$3:$H$100)-ROW($H$3)+1),ROWS($A$1:F3))))","v":"1999-04-05"},{"$f":"IF(ROWS($A$1:G3)>$C$1,\"\",INDEX(Source!G$3:G$100,LARGE(IF(Source!$H$3:$H$100>=LARGE(Source!$H$3:$H$100,$E$1),ROW($H$3:$H$100)-ROW($H$3)+1),ROWS($A$1:G3))))","v":3453456},{"$f":"IF(ROWS($A$1:H3)>$C$1,\"\",INDEX(Source!H$3:H$100,LARGE(IF(Source!$H$3:$H$100>=LARGE(Source!$H$3:$H$100,$E$1),ROW($H$3:$H$100)-ROW($H$3)+1),ROWS($A$1:H3))))","v":2342322546},{"$f":"IF(ROWS($A$1:I3)>$C$1,\"\",INDEX(Source!I$3:I$100,LARGE(IF(Source!$H$3:$H$100>=LARGE(Source!$H$3:$H$100,$E$1),ROW($H$3:$H$100)-ROW($H$3)+1),ROWS($A$1:I3))))","v":"تحويل "},{"$f":"IF(ROWS($A$1:J3)>$C$1,\"\",INDEX(Source!J$3:J$100,LARGE(IF(Source!$H$3:$H$100>=LARGE(Source!$H$3:$H$100,$E$1),ROW($H$3:$H$100)-ROW($H$3)+1),ROWS($A$1:J3))))","v":"2019-06-05"}]
[null,{"$f":"IF(ROWS($A$1:A4)>$C$1,\"\",INDEX(Source!A$3:A$100,LARGE(IF(Source!$H$3:$H$100>=LARGE(Source!$H$3:$H$100,$E$1),ROW($H$3:$H$100)-ROW($H$3)+1),ROWS($A$1:A4))))","v":"بانة الرحال"},{"$f":"IF(ROWS($A$1:B4)>$C$1,\"\",INDEX(Source!B$3:B$100,LARGE(IF(Source!$H$3:$H$100>=LARGE(Source!$H$3:$H$100,$E$1),ROW($H$3:$H$100)-ROW($H$3)+1),ROWS($A$1:B4))))","v":"أسعد"},{"$f":"IF(ROWS($A$1:C4)>$C$1,\"\",INDEX(Source!C$3:C$100,LARGE(IF(Source!$H$3:$H$100>=LARGE(Source!$H$3:$H$100,$E$1),ROW($H$3:$H$100)-ROW($H$3)+1),ROWS($A$1:C4))))","v":"سوزي"},{"$f":"IF(ROWS($A$1:D4)>$C$1,\"\",INDEX(Source!D$3:D$100,LARGE(IF(Source!$H$3:$H$100>=LARGE(Source!$H$3:$H$100,$E$1),ROW($H$3:$H$100)-ROW($H$3)+1),ROWS($A$1:D4))))","v":"1982-05-03"},{"$f":"IF(ROWS($A$1:E4)>$C$1,\"\",INDEX(Source!E$3:E$100,LARGE(IF(Source!$H$3:$H$100>=LARGE(Source!$H$3:$H$100,$E$1),ROW($H$3:$H$100)-ROW($H$3)+1),ROWS($A$1:E4))))","v":"انثى"},{"$f":"IF(ROWS($A$1:F4)>$C$1,\"\",INDEX(Source!F$3:F$100,LARGE(IF(Source!$H$3:$H$100>=LARGE(Source!$H$3:$H$100,$E$1),ROW($H$3:$H$100)-ROW($H$3)+1),ROWS($A$1:F4))))","v":"2007-09-04"},{"$f":"IF(ROWS($A$1:G4)>$C$1,\"\",INDEX(Source!G$3:G$100,LARGE(IF(Source!$H$3:$H$100>=LARGE(Source!$H$3:$H$100,$E$1),ROW($H$3:$H$100)-ROW($H$3)+1),ROWS($A$1:G4))))","v":34575675},{"$f":"IF(ROWS($A$1:H4)>$C$1,\"\",INDEX(Source!H$3:H$100,LARGE(IF(Source!$H$3:$H$100>=LARGE(Source!$H$3:$H$100,$E$1),ROW($H$3:$H$100)-ROW($H$3)+1),ROWS($A$1:H4))))","v":2342322546},{"$f":"IF(ROWS($A$1:I4)>$C$1,\"\",INDEX(Source!I$3:I$100,LARGE(IF(Source!$H$3:$H$100>=LARGE(Source!$H$3:$H$100,$E$1),ROW($H$3:$H$100)-ROW($H$3)+1),ROWS($A$1:I4))))","v":"سحب "},{"$f":"IF(ROWS($A$1:J4)>$C$1,\"\",INDEX(Source!J$3:J$100,LARGE(IF(Source!$H$3:$H$100>=LARGE(Source!$H$3:$H$100,$E$1),ROW($H$3:$H$100)-ROW($H$3)+1),ROWS($A$1:J4))))","v":"2019-06-03"}]
[null,{"$f":"IF(ROWS($A$1:A5)>$C$1,\"\",INDEX(Source!A$3:A$100,LARGE(IF(Source!$H$3:$H$100>=LARGE(Source!$H$3:$H$100,$E$1),ROW($H$3:$H$100)-ROW($H$3)+1),ROWS($A$1:A5))))","v":"إبراهيم سالوخة"},{"$f":"IF(ROWS($A$1:B5)>$C$1,\"\",INDEX(Source!B$3:B$100,LARGE(IF(Source!$H$3:$H$100>=LARGE(Source!$H$3:$H$100,$E$1),ROW($H$3:$H$100)-ROW($H$3)+1),ROWS($A$1:B5))))","v":"صفوان"},{"$f":"IF(ROWS($A$1:C5)>$C$1,\"\",INDEX(Source!C$3:C$100,LARGE(IF(Source!$H$3:$H$100>=LARGE(Source!$H$3:$H$100,$E$1),ROW($H$3:$H$100)-ROW($H$3)+1),ROWS($A$1:C5))))","v":"نهى"},{"$f":"IF(ROWS($A$1:D5)>$C$1,\"\",INDEX(Source!D$3:D$100,LARGE(IF(Source!$H$3:$H$100>=LARGE(Source!$H$3:$H$100,$E$1),ROW($H$3:$H$100)-ROW($H$3)+1),ROWS($A$1:D5))))","v":"2001-06-14"},{"$f":"IF(ROWS($A$1:E5)>$C$1,\"\",INDEX(Source!E$3:E$100,LARGE(IF(Source!$H$3:$H$100>=LARGE(Source!$H$3:$H$100,$E$1),ROW($H$3:$H$100)-ROW($H$3)+1),ROWS($A$1:E5))))","v":"ذكر"},{"$f":"IF(ROWS($A$1:F5)>$C$1,\"\",INDEX(Source!F$3:F$100,LARGE(IF(Source!$H$3:$H$100>=LARGE(Source!$H$3:$H$100,$E$1),ROW($H$3:$H$100)-ROW($H$3)+1),ROWS($A$1:F5))))","v":"2018-09-06"},{"$f":"IF(ROWS($A$1:G5)>$C$1,\"\",INDEX(Source!G$3:G$100,LARGE(IF(Source!$H$3:$H$100>=LARGE(Source!$H$3:$H$100,$E$1),ROW($H$3:$H$100)-ROW($H$3)+1),ROWS($A$1:G5))))","v":3453553673},{"$f":"IF(ROWS($A$1:H5)>$C$1,\"\",INDEX(Source!H$3:H$100,LARGE(IF(Source!$H$3:$H$100>=LARGE(Source!$H$3:$H$100,$E$1),ROW($H$3:$H$100)-ROW($H$3)+1),ROWS($A$1:H5))))","v":488320000},{"$f":"IF(ROWS($A$1:I5)>$C$1,\"\",INDEX(Source!I$3:I$100,LARGE(IF(Source!$H$3:$H$100>=LARGE(Source!$H$3:$H$100,$E$1),ROW($H$3:$H$100)-ROW($H$3)+1),ROWS($A$1:I5))))","v":"سحب "},{"$f":"IF(ROWS($A$1:J5)>$C$1,\"\",INDEX(Source!J$3:J$100,LARGE(IF(Source!$H$3:$H$100>=LARGE(Source!$H$3:$H$100,$E$1),ROW($H$3:$H$100)-ROW($H$3)+1),ROWS($A$1:J5))))","v":"2018-03-02"}]
[null,{"$f":"IF(ROWS($A$1:A6)>$C$1,\"\",INDEX(Source!A$3:A$100,LARGE(IF(Source!$H$3:$H$100>=LARGE(Source!$H$3:$H$100,$E$1),ROW($H$3:$H$100)-ROW($H$3)+1),ROWS($A$1:A6))))","v":""},{"$f":"IF(ROWS($A$1:B6)>$C$1,\"\",INDEX(Source!B$3:B$100,LARGE(IF(Source!$H$3:$H$100>=LARGE(Source!$H$3:$H$100,$E$1),ROW($H$3:$H$100)-ROW($H$3)+1),ROWS($A$1:B6))))","v":""},{"$f":"IF(ROWS($A$1:C6)>$C$1,\"\",INDEX(Source!C$3:C$100,LARGE(IF(Source!$H$3:$H$100>=LARGE(Source!$H$3:$H$100,$E$1),ROW($H$3:$H$100)-ROW($H$3)+1),ROWS($A$1:C6))))","v":""},{"$f":"IF(ROWS($A$1:D6)>$C$1,\"\",INDEX(Source!D$3:D$100,LARGE(IF(Source!$H$3:$H$100>=LARGE(Source!$H$3:$H$100,$E$1),ROW($H$3:$H$100)-ROW($H$3)+1),ROWS($A$1:D6))))","v":""},{"$f":"IF(ROWS($A$1:E6)>$C$1,\"\",INDEX(Source!E$3:E$100,LARGE(IF(Source!$H$3:$H$100>=LARGE(Source!$H$3:$H$100,$E$1),ROW($H$3:$H$100)-ROW($H$3)+1),ROWS($A$1:E6))))","v":""},{"$f":"IF(ROWS($A$1:F6)>$C$1,\"\",INDEX(Source!F$3:F$100,LARGE(IF(Source!$H$3:$H$100>=LARGE(Source!$H$3:$H$100,$E$1),ROW($H$3:$H$100)-ROW($H$3)+1),ROWS($A$1:F6))))","v":""},{"$f":"IF(ROWS($A$1:G6)>$C$1,\"\",INDEX(Source!G$3:G$100,LARGE(IF(Source!$H$3:$H$100>=LARGE(Source!$H$3:$H$100,$E$1),ROW($H$3:$H$100)-ROW($H$3)+1),ROWS($A$1:G6))))","v":""},{"$f":"IF(ROWS($A$1:H6)>$C$1,\"\",INDEX(Source!H$3:H$100,LARGE(IF(Source!$H$3:$H$100>=LARGE(Source!$H$3:$H$100,$E$1),ROW($H$3:$H$100)-ROW($H$3)+1),ROWS($A$1:H6))))","v":""},{"$f":"IF(ROWS($A$1:I6)>$C$1,\"\",INDEX(Source!I$3:I$100,LARGE(IF(Source!$H$3:$H$100>=LARGE(Source!$H$3:$H$100,$E$1),ROW($H$3:$H$100)-ROW($H$3)+1),ROWS($A$1:I6))))","v":""},{"$f":"IF(ROWS($A$1:J6)>$C$1,\"\",INDEX(Source!J$3:J$100,LARGE(IF(Source!$H$3:$H$100>=LARGE(Source!$H$3:$H$100,$E$1),ROW($H$3:$H$100)-ROW($H$3)+1),ROWS($A$1:J6))))","v":""}]
[null,{"$f":"IF(ROWS($A$1:A7)>$C$1,\"\",INDEX(Source!A$3:A$100,LARGE(IF(Source!$H$3:$H$100>=LARGE(Source!$H$3:$H$100,$E$1),ROW($H$3:$H$100)-ROW($H$3)+1),ROWS($A$1:A7))))","v":""},{"$f":"IF(ROWS($A$1:B7)>$C$1,\"\",INDEX(Source!B$3:B$100,LARGE(IF(Source!$H$3:$H$100>=LARGE(Source!$H$3:$H$100,$E$1),ROW($H$3:$H$100)-ROW($H$3)+1),ROWS($A$1:B7))))","v":""},{"$f":"IF(ROWS($A$1:C7)>$C$1,\"\",INDEX(Source!C$3:C$100,LARGE(IF(Source!$H$3:$H$100>=LARGE(Source!$H$3:$H$100,$E$1),ROW($H$3:$H$100)-ROW($H$3)+1),ROWS($A$1:C7))))","v":""},{"$f":"IF(ROWS($A$1:D7)>$C$1,\"\",INDEX(Source!D$3:D$100,LARGE(IF(Source!$H$3:$H$100>=LARGE(Source!$H$3:$H$100,$E$1),ROW($H$3:$H$100)-ROW($H$3)+1),ROWS($A$1:D7))))","v":""},{"$f":"IF(ROWS($A$1:E7)>$C$1,\"\",INDEX(Source!E$3:E$100,LARGE(IF(Source!$H$3:$H$100>=LARGE(Source!$H$3:$H$100,$E$1),ROW($H$3:$H$100)-ROW($H$3)+1),ROWS($A$1:E7))))","v":""},{"$f":"IF(ROWS($A$1:F7)>$C$1,\"\",INDEX(Source!F$3:F$100,LARGE(IF(Source!$H$3:$H$100>=LARGE(Source!$H$3:$H$100,$E$1),ROW($H$3:$H$100)-ROW($H$3)+1),ROWS($A$1:F7))))","v":""},{"$f":"IF(ROWS($A$1:G7)>$C$1,\"\",INDEX(Source!G$3:G$100,LARGE(IF(Source!$H$3:$H$100>=LARGE(Source!$H$3:$H$100,$E$1),ROW($H$3:$H$100)-ROW($H$3)+1),ROWS($A$1:G7))))","v":""},{"$f":"IF(ROWS($A$1:H7)>$C$1,\"\",INDEX(Source!H$3:H$100,LARGE(IF(Source!$H$3:$H$100>=LARGE(Source!$H$3:$H$100,$E$1),ROW($H$3:$H$100)-ROW($H$3)+1),ROWS($A$1:H7))))","v":""},{"$f":"IF(ROWS($A$1:I7)>$C$1,\"\",INDEX(Source!I$3:I$100,LARGE(IF(Source!$H$3:$H$100>=LARGE(Source!$H$3:$H$100,$E$1),ROW($H$3:$H$100)-ROW($H$3)+1),ROWS($A$1:I7))))","v":""},{"$f":"IF(ROWS($A$1:J7)>$C$1,\"\",INDEX(Source!J$3:J$100,LARGE(IF(Source!$H$3:$H$100>=LARGE(Source!$H$3:$H$100,$E$1),ROW($H$3:$H$100)-ROW($H$3)+1),ROWS($A$1:J7))))","v":""}]
[null,{"$f":"IF(ROWS($A$1:A8)>$C$1,\"\",INDEX(Source!A$3:A$100,LARGE(IF(Source!$H$3:$H$100>=LARGE(Source!$H$3:$H$100,$E$1),ROW($H$3:$H$100)-ROW($H$3)+1),ROWS($A$1:A8))))","v":""},{"$f":"IF(ROWS($A$1:B8)>$C$1,\"\",INDEX(Source!B$3:B$100,LARGE(IF(Source!$H$3:$H$100>=LARGE(Source!$H$3:$H$100,$E$1),ROW($H$3:$H$100)-ROW($H$3)+1),ROWS($A$1:B8))))","v":""},{"$f":"IF(ROWS($A$1:C8)>$C$1,\"\",INDEX(Source!C$3:C$100,LARGE(IF(Source!$H$3:$H$100>=LARGE(Source!$H$3:$H$100,$E$1),ROW($H$3:$H$100)-ROW($H$3)+1),ROWS($A$1:C8))))","v":""},{"$f":"IF(ROWS($A$1:D8)>$C$1,\"\",INDEX(Source!D$3:D$100,LARGE(IF(Source!$H$3:$H$100>=LARGE(Source!$H$3:$H$100,$E$1),ROW($H$3:$H$100)-ROW($H$3)+1),ROWS($A$1:D8))))","v":""},{"$f":"IF(ROWS($A$1:E8)>$C$1,\"\",INDEX(Source!E$3:E$100,LARGE(IF(Source!$H$3:$H$100>=LARGE(Source!$H$3:$H$100,$E$1),ROW($H$3:$H$100)-ROW($H$3)+1),ROWS($A$1:E8))))","v":""},{"$f":"IF(ROWS($A$1:F8)>$C$1,\"\",INDEX(Source!F$3:F$100,LARGE(IF(Source!$H$3:$H$100>=LARGE(Source!$H$3:$H$100,$E$1),ROW($H$3:$H$100)-ROW($H$3)+1),ROWS($A$1:F8))))","v":""},{"$f":"IF(ROWS($A$1:G8)>$C$1,\"\",INDEX(Source!G$3:G$100,LARGE(IF(Source!$H$3:$H$100>=LARGE(Source!$H$3:$H$100,$E$1),ROW($H$3:$H$100)-ROW($H$3)+1),ROWS($A$1:G8))))","v":""},{"$f":"IF(ROWS($A$1:H8)>$C$1,\"\",INDEX(Source!H$3:H$100,LARGE(IF(Source!$H$3:$H$100>=LARGE(Source!$H$3:$H$100,$E$1),ROW($H$3:$H$100)-ROW($H$3)+1),ROWS($A$1:H8))))","v":""},{"$f":"IF(ROWS($A$1:I8)>$C$1,\"\",INDEX(Source!I$3:I$100,LARGE(IF(Source!$H$3:$H$100>=LARGE(Source!$H$3:$H$100,$E$1),ROW($H$3:$H$100)-ROW($H$3)+1),ROWS($A$1:I8))))","v":""},{"$f":"IF(ROWS($A$1:J8)>$C$1,\"\",INDEX(Source!J$3:J$100,LARGE(IF(Source!$H$3:$H$100>=LARGE(Source!$H$3:$H$100,$E$1),ROW($H$3:$H$100)-ROW($H$3)+1),ROWS($A$1:J8))))","v":""}]
[null,{"$f":"IF(ROWS($A$1:A9)>$C$1,\"\",INDEX(Source!A$3:A$100,LARGE(IF(Source!$H$3:$H$100>=LARGE(Source!$H$3:$H$100,$E$1),ROW($H$3:$H$100)-ROW($H$3)+1),ROWS($A$1:A9))))","v":""},{"$f":"IF(ROWS($A$1:B9)>$C$1,\"\",INDEX(Source!B$3:B$100,LARGE(IF(Source!$H$3:$H$100>=LARGE(Source!$H$3:$H$100,$E$1),ROW($H$3:$H$100)-ROW($H$3)+1),ROWS($A$1:B9))))","v":""},{"$f":"IF(ROWS($A$1:C9)>$C$1,\"\",INDEX(Source!C$3:C$100,LARGE(IF(Source!$H$3:$H$100>=LARGE(Source!$H$3:$H$100,$E$1),ROW($H$3:$H$100)-ROW($H$3)+1),ROWS($A$1:C9))))","v":""},{"$f":"IF(ROWS($A$1:D9)>$C$1,\"\",INDEX(Source!D$3:D$100,LARGE(IF(Source!$H$3:$H$100>=LARGE(Source!$H$3:$H$100,$E$1),ROW($H$3:$H$100)-ROW($H$3)+1),ROWS($A$1:D9))))","v":""},{"$f":"IF(ROWS($A$1:E9)>$C$1,\"\",INDEX(Source!E$3:E$100,LARGE(IF(Source!$H$3:$H$100>=LARGE(Source!$H$3:$H$100,$E$1),ROW($H$3:$H$100)-ROW($H$3)+1),ROWS($A$1:E9))))","v":""},{"$f":"IF(ROWS($A$1:F9)>$C$1,\"\",INDEX(Source!F$3:F$100,LARGE(IF(Source!$H$3:$H$100>=LARGE(Source!$H$3:$H$100,$E$1),ROW($H$3:$H$100)-ROW($H$3)+1),ROWS($A$1:F9))))","v":""},{"$f":"IF(ROWS($A$1:G9)>$C$1,\"\",INDEX(Source!G$3:G$100,LARGE(IF(Source!$H$3:$H$100>=LARGE(Source!$H$3:$H$100,$E$1),ROW($H$3:$H$100)-ROW($H$3)+1),ROWS($A$1:G9))))","v":""},{"$f":"IF(ROWS($A$1:H9)>$C$1,\"\",INDEX(Source!H$3:H$100,LARGE(IF(Source!$H$3:$H$100>=LARGE(Source!$H$3:$H$100,$E$1),ROW($H$3:$H$100)-ROW($H$3)+1),ROWS($A$1:H9))))","v":""},{"$f":"IF(ROWS($A$1:I9)>$C$1,\"\",INDEX(Source!I$3:I$100,LARGE(IF(Source!$H$3:$H$100>=LARGE(Source!$H$3:$H$100,$E$1),ROW($H$3:$H$100)-ROW($H$3)+1),ROWS($A$1:I9))))","v":""},{"$f":"IF(ROWS($A$1:J9)>$C$1,\"\",INDEX(Source!J$3:J$100,LARGE(IF(Source!$H$3:$H$100>=LARGE(Source!$H$3:$H$100,$E$1),ROW($H$3:$H$100)-ROW($H$3)+1),ROWS($A$1:J9))))","v":""}]
[null,{"$f":"IF(ROWS($A$1:A10)>$C$1,\"\",INDEX(Source!A$3:A$100,LARGE(IF(Source!$H$3:$H$100>=LARGE(Source!$H$3:$H$100,$E$1),ROW($H$3:$H$100)-ROW($H$3)+1),ROWS($A$1:A10))))","v":""},{"$f":"IF(ROWS($A$1:B10)>$C$1,\"\",INDEX(Source!B$3:B$100,LARGE(IF(Source!$H$3:$H$100>=LARGE(Source!$H$3:$H$100,$E$1),ROW($H$3:$H$100)-ROW($H$3)+1),ROWS($A$1:B10))))","v":""},{"$f":"IF(ROWS($A$1:C10)>$C$1,\"\",INDEX(Source!C$3:C$100,LARGE(IF(Source!$H$3:$H$100>=LARGE(Source!$H$3:$H$100,$E$1),ROW($H$3:$H$100)-ROW($H$3)+1),ROWS($A$1:C10))))","v":""},{"$f":"IF(ROWS($A$1:D10)>$C$1,\"\",INDEX(Source!D$3:D$100,LARGE(IF(Source!$H$3:$H$100>=LARGE(Source!$H$3:$H$100,$E$1),ROW($H$3:$H$100)-ROW($H$3)+1),ROWS($A$1:D10))))","v":""},{"$f":"IF(ROWS($A$1:E10)>$C$1,\"\",INDEX(Source!E$3:E$100,LARGE(IF(Source!$H$3:$H$100>=LARGE(Source!$H$3:$H$100,$E$1),ROW($H$3:$H$100)-ROW($H$3)+1),ROWS($A$1:E10))))","v":""},{"$f":"IF(ROWS($A$1:F10)>$C$1,\"\",INDEX(Source!F$3:F$100,LARGE(IF(Source!$H$3:$H$100>=LARGE(Source!$H$3:$H$100,$E$1),ROW($H$3:$H$100)-ROW($H$3)+1),ROWS($A$1:F10))))","v":""},{"$f":"IF(ROWS($A$1:G10)>$C$1,\"\",INDEX(Source!G$3:G$100,LARGE(IF(Source!$H$3:$H$100>=LARGE(Source!$H$3:$H$100,$E$1),ROW($H$3:$H$100)-ROW($H$3)+1),ROWS($A$1:G10))))","v":""},{"$f":"IF(ROWS($A$1:H10)>$C$1,\"\",INDEX(Source!H$3:H$100,LARGE(IF(Source!$H$3:$H$100>=LARGE(Source!$H$3:$H$100,$E$1),ROW($H$3:$H$100)-ROW($H$3)+1),ROWS($A$1:H10))))","v":""},{"$f":"IF(ROWS($A$1:I10)>$C$1,\"\",INDEX(Source!I$3:I$100,LARGE(IF(Source!$H$3:$H$100>=LARGE(Source!$H$3:$H$100,$E$1),ROW($H$3:$H$100)-ROW($H$3)+1),ROWS($A$1:I10))))","v":""},{"$f":"IF(ROWS($A$1:J10)>$C$1,\"\",INDEX(Source!J$3:J$100,LARGE(IF(Source!$H$3:$H$100>=LARGE(Source!$H$3:$H$100,$E$1),ROW($H$3:$H$100)-ROW($H$3)+1),ROWS($A$1:J10))))","v":""}]
[null,{"$f":"IF(ROWS($A$1:A11)>$C$1,\"\",INDEX(Source!A$3:A$100,LARGE(IF(Source!$H$3:$H$100>=LARGE(Source!$H$3:$H$100,$E$1),ROW($H$3:$H$100)-ROW($H$3)+1),ROWS($A$1:A11))))","v":""},{"$f":"IF(ROWS($A$1:B11)>$C$1,\"\",INDEX(Source!B$3:B$100,LARGE(IF(Source!$H$3:$H$100>=LARGE(Source!$H$3:$H$100,$E$1),ROW($H$3:$H$100)-ROW($H$3)+1),ROWS($A$1:B11))))","v":""},{"$f":"IF(ROWS($A$1:C11)>$C$1,\"\",INDEX(Source!C$3:C$100,LARGE(IF(Source!$H$3:$H$100>=LARGE(Source!$H$3:$H$100,$E$1),ROW($H$3:$H$100)-ROW($H$3)+1),ROWS($A$1:C11))))","v":""},{"$f":"IF(ROWS($A$1:D11)>$C$1,\"\",INDEX(Source!D$3:D$100,LARGE(IF(Source!$H$3:$H$100>=LARGE(Source!$H$3:$H$100,$E$1),ROW($H$3:$H$100)-ROW($H$3)+1),ROWS($A$1:D11))))","v":""},{"$f":"IF(ROWS($A$1:E11)>$C$1,\"\",INDEX(Source!E$3:E$100,LARGE(IF(Source!$H$3:$H$100>=LARGE(Source!$H$3:$H$100,$E$1),ROW($H$3:$H$100)-ROW($H$3)+1),ROWS($A$1:E11))))","v":""},{"$f":"IF(ROWS($A$1:F11)>$C$1,\"\",INDEX(Source!F$3:F$100,LARGE(IF(Source!$H$3:$H$100>=LARGE(Source!$H$3:$H$100,$E$1),ROW($H$3:$H$100)-ROW($H$3)+1),ROWS($A$1:F11))))","v":""},{"$f":"IF(ROWS($A$1:G11)>$C$1,\"\",INDEX(Source!G$3:G$100,LARGE(IF(Source!$H$3:$H$100>=LARGE(Source!$H$3:$H$100,$E$1),ROW($H$3:$H$100)-ROW($H$3)+1),ROWS($A$1:G11))))","v":""},{"$f":"IF(ROWS($A$1:H11)>$C$1,\"\",INDEX(Source!H$3:H$100,LARGE(IF(Source!$H$3:$H$100>=LARGE(Source!$H$3:$H$100,$E$1),ROW($H$3:$H$100)-ROW($H$3)+1),ROWS($A$1:H11))))","v":""},{"$f":"IF(ROWS($A$1:I11)>$C$1,\"\",INDEX(Source!I$3:I$100,LARGE(IF(Source!$H$3:$H$100>=LARGE(Source!$H$3:$H$100,$E$1),ROW($H$3:$H$100)-ROW($H$3)+1),ROWS($A$1:I11))))","v":""},{"$f":"IF(ROWS($A$1:J11)>$C$1,\"\",INDEX(Source!J$3:J$100,LARGE(IF(Source!$H$3:$H$100>=LARGE(Source!$H$3:$H$100,$E$1),ROW($H$3:$H$100)-ROW($H$3)+1),ROWS($A$1:J11))))","v":""}]
[null,{"$f":"IF(ROWS($A$1:A12)>$C$1,\"\",INDEX(Source!A$3:A$100,LARGE(IF(Source!$H$3:$H$100>=LARGE(Source!$H$3:$H$100,$E$1),ROW($H$3:$H$100)-ROW($H$3)+1),ROWS($A$1:A12))))","v":""},{"$f":"IF(ROWS($A$1:B12)>$C$1,\"\",INDEX(Source!B$3:B$100,LARGE(IF(Source!$H$3:$H$100>=LARGE(Source!$H$3:$H$100,$E$1),ROW($H$3:$H$100)-ROW($H$3)+1),ROWS($A$1:B12))))","v":""},{"$f":"IF(ROWS($A$1:C12)>$C$1,\"\",INDEX(Source!C$3:C$100,LARGE(IF(Source!$H$3:$H$100>=LARGE(Source!$H$3:$H$100,$E$1),ROW($H$3:$H$100)-ROW($H$3)+1),ROWS($A$1:C12))))","v":""},{"$f":"IF(ROWS($A$1:D12)>$C$1,\"\",INDEX(Source!D$3:D$100,LARGE(IF(Source!$H$3:$H$100>=LARGE(Source!$H$3:$H$100,$E$1),ROW($H$3:$H$100)-ROW($H$3)+1),ROWS($A$1:D12))))","v":""},{"$f":"IF(ROWS($A$1:E12)>$C$1,\"\",INDEX(Source!E$3:E$100,LARGE(IF(Source!$H$3:$H$100>=LARGE(Source!$H$3:$H$100,$E$1),ROW($H$3:$H$100)-ROW($H$3)+1),ROWS($A$1:E12))))","v":""},{"$f":"IF(ROWS($A$1:F12)>$C$1,\"\",INDEX(Source!F$3:F$100,LARGE(IF(Source!$H$3:$H$100>=LARGE(Source!$H$3:$H$100,$E$1),ROW($H$3:$H$100)-ROW($H$3)+1),ROWS($A$1:F12))))","v":""},{"$f":"IF(ROWS($A$1:G12)>$C$1,\"\",INDEX(Source!G$3:G$100,LARGE(IF(Source!$H$3:$H$100>=LARGE(Source!$H$3:$H$100,$E$1),ROW($H$3:$H$100)-ROW($H$3)+1),ROWS($A$1:G12))))","v":""},{"$f":"IF(ROWS($A$1:H12)>$C$1,\"\",INDEX(Source!H$3:H$100,LARGE(IF(Source!$H$3:$H$100>=LARGE(Source!$H$3:$H$100,$E$1),ROW($H$3:$H$100)-ROW($H$3)+1),ROWS($A$1:H12))))","v":""},{"$f":"IF(ROWS($A$1:I12)>$C$1,\"\",INDEX(Source!I$3:I$100,LARGE(IF(Source!$H$3:$H$100>=LARGE(Source!$H$3:$H$100,$E$1),ROW($H$3:$H$100)-ROW($H$3)+1),ROWS($A$1:I12))))","v":""},{"$f":"IF(ROWS($A$1:J12)>$C$1,\"\",INDEX(Source!J$3:J$100,LARGE(IF(Source!$H$3:$H$100>=LARGE(Source!$H$3:$H$100,$E$1),ROW($H$3:$H$100)-ROW($H$3)+1),ROWS($A$1:J12))))","v":""}]
{"$rows_left_out":158}