{"text_format":"1","workbook":"xlsx","n_sheets":10,"sheets":["MOG","HA","MOG_OMT","HA_OMT","JARD_MOG","JARD_HA","JARD_MOG_OMT","JARD_HA_OMT","ALL","جدول تسليم البطاقات"],"not_rendered":{"charts":0,"images":0,"macros":1,"external_links":0,"defined_names":5,"comments":0,"pivot_tables":0},"unopened":[],"bounds":{"document_bytes":16777216,"sheet_cells":100000,"rows_first":2000,"rows_last":500,"rows_between":2000,"halvings":0,"cell_chars":16384,"cell_head_chars":4096},"cells_cut":0,"cells_raw":0,"read":"whole","date_system":"1900"}

{"sheet":"MOG","index":0,"n_rows":52,"n_cols":39,"rows_kept":52,"cut":false,"hidden":false,"merged":[]}
[2020,"مغلفات",null,{"$f":"ALL!C1","v":"2020-12-01"}]
["كانون اول","رمز","المنصرم",{"$f":"ALL!C2","v":"02/12/"},null,null,null,null,null,null,null,null,null,null,null,null,null,null,null,null,null,null,null,null,null,null,null,null,null,null,null,null,null,null,null,null,"مغلفات مستلمة ","مغلفات مستلمة+ المنصرم ","مغلفات غير مسلّمة"]
["بيروت","A",11,{"$f":"IFERROR(VLOOKUP($A3&$B3,CHOOSE({1,2},ALL!$A$4:$A$500&ALL!$B$4:$B$500,ALL!$C$4:$C$500),2,FALSE),\"\")","v":4},null,null,null,null,null,null,null,null,null,null,null,null,null,null,null,null,null,null,null,null,null,null,null,null,null,null,null,null,null,null,null,null,{"$f":"SUM(D3:AH3)","v":4},{"$f":"SUM(AK3+C3)","v":15},0]
["بعبدا","B1",0,{"$f":"IFERROR(VLOOKUP($A4&$B4,CHOOSE({1,2},ALL!$A$4:$A$500&ALL!$B$4:$B$500,ALL!$C$4:$C$500),2,FALSE),\"\")","v":3},null,null,null,null,null,null,null,null,null,null,null,null,null,null,null,null,null,null,null,null,null,null,null,null,null,null,null,null,null,null,null,null,{"$f":"SUM(D4:AH4)","v":3},{"$f":"SUM(AK4+C4)","v":3},3]
["بكفيا","B10",11,{"$f":"IFERROR(VLOOKUP($A5&$B5,CHOOSE({1,2},ALL!$A$4:$A$500&ALL!$B$4:$B$500,ALL!$C$4:$C$500),2,FALSE),\"\")","v":4},null,null,null,null,null,null,null,null,null,null,null,null,null,null,null,null,null,null,null,null,null,null,null,null,null,null,null,null,null,null,null,null,4,15,4]
["المتن الشمالي العالي","B11",7,{"$f":"IFERROR(VLOOKUP($A6&$B6,CHOOSE({1,2},ALL!$A$4:$A$500&ALL!$B$4:$B$500,ALL!$C$4:$C$500),2,FALSE),\"\")","v":5},null,null,null,null,null,null,null,null,null,null,null,null,null,null,null,null,null,null,null,null,null,null,null,null,null,null,null,null,null,null,null,null,5,12,5]
["كسروان ","B12",30,{"$f":"IFERROR(VLOOKUP($A7&$B7,CHOOSE({1,2},ALL!$A$4:$A$500&ALL!$B$4:$B$500,ALL!$C$4:$C$500),2,FALSE),\"\")","v":12},null,null,null,null,null,null,null,null,null,null,null,null,null,null,null,null,null,null,null,null,null,null,null,null,null,null,null,null,null,null,null,null,12,42,12]
["جبيل","B13",12,{"$f":"IFERROR(VLOOKUP($A8&$B8,CHOOSE({1,2},ALL!$A$4:$A$500&ALL!$B$4:$B$500,ALL!$C$4:$C$500),2,FALSE),\"\")","v":0},null,null,null,null,null,null,null,null,null,null,null,null,null,null,null,null,null,null,null,null,null,null,null,null,null,null,null,null,null,null,null,null,0,12,0]
{"$rows_left_out":45}
{"sheet":"HA","index":1,"n_rows":52,"n_cols":39,"rows_kept":52,"cut":false,"hidden":false,"merged":[]}
[2020,"هويات",null,{"$f":"ALL!C1","v":"2020-12-01"}]
["كانون اول","رمز","المنصرم",{"$f":"ALL!C2","v":"02/12/"},null,null,null,null,null,null,null,null,null,null,null,null,null,null,null,null,null,null,null,null,null,null,null,null,null,null,null,null,null,null,null,null,"هويات مستلمة","هويات مستلمة + المنصرم","هويات غير مسلّمة "]
["بيروت","A",140,{"$f":"IFERROR(VLOOKUP($A3&$B3,CHOOSE({1,2},ALL!$A$4:$A$500&ALL!$B$4:$B$500,ALL!$D$4:$D$500),2,FALSE),\"\")","v":4},null,null,null,null,null,null,null,null,null,null,null,null,null,null,null,null,null,null,null,null,null,null,null,null,null,null,null,null,null,null,null,null,{"$f":"SUM(D3:AH3)","v":4},{"$f":"SUM(AK3+C3)","v":144},0]
["بعبدا","B1",0,{"$f":"IFERROR(VLOOKUP($A4&$B4,CHOOSE({1,2},ALL!$A$4:$A$500&ALL!$B$4:$B$500,ALL!$D$4:$D$500),2,FALSE),\"\")","v":22},null,null,null,null,null,null,null,null,null,null,null,null,null,null,null,null,null,null,null,null,null,null,null,null,null,null,null,null,null,null,null,null,{"$f":"SUM(D4:AH4)","v":22},{"$f":"SUM(AK4+C4)","v":22},22]
["بكفيا","B10",88,{"$f":"IFERROR(VLOOKUP($A5&$B5,CHOOSE({1,2},ALL!$A$4:$A$500&ALL!$B$4:$B$500,ALL!$D$4:$D$500),2,FALSE),\"\")","v":82},null,null,null,null,null,null,null,null,null,null,null,null,null,null,null,null,null,null,null,null,null,null,null,null,null,null,null,null,null,null,null,null,82,170,82]
["المتن الشمالي العالي","B11",16,{"$f":"IFERROR(VLOOKUP($A6&$B6,CHOOSE({1,2},ALL!$A$4:$A$500&ALL!$B$4:$B$500,ALL!$D$4:$D$500),2,FALSE),\"\")","v":9},null,null,null,null,null,null,null,null,null,null,null,null,null,null,null,null,null,null,null,null,null,null,null,null,null,null,null,null,null,null,null,null,9,25,9]
["كسروان ","B12",81,{"$f":"IFERROR(VLOOKUP($A7&$B7,CHOOSE({1,2},ALL!$A$4:$A$500&ALL!$B$4:$B$500,ALL!$D$4:$D$500),2,FALSE),\"\")","v":63},null,null,null,null,null,null,null,null,null,null,null,null,null,null,null,null,null,null,null,null,null,null,null,null,null,null,null,null,null,null,null,null,63,144,63]
["جبيل","B13",81,{"$f":"IFERROR(VLOOKUP($A8&$B8,CHOOSE({1,2},ALL!$A$4:$A$500&ALL!$B$4:$B$500,ALL!$D$4:$D$500),2,FALSE),\"\")","v":0},null,null,null,null,null,null,null,null,null,null,null,null,null,null,null,null,null,null,null,null,null,null,null,null,null,null,null,null,null,null,null,null,0,81,0]
{"$rows_left_out":45}
{"sheet":"MOG_OMT","index":2,"n_rows":52,"n_cols":39,"rows_kept":52,"cut":false,"hidden":false,"merged":[]}
[2020,"مغلفات OMT",null,{"$f":"ALL!C1","v":"2020-12-01"}]
["كانون اول","رمز","المنصرم",{"$f":"ALL!C2","v":"02/12/"},null,null,null,null,null,null,null,null,null,null,null,null,null,null,null,null,null,null,null,null,null,null,null,null,null,null,null,null,null,null,null,"مغلفات OMTمستلمة",null,"مغلفات OMTمستلمة + المنصرم","مغلفات OMT غير مسلمة "]
["بيروت","A",null,0,null,null,null,null,null,null,null,null,null,null,null,null,null,null,null,null,null,null,null,null,null,null,null,null,null,null,null,null,null,null,null,{"$f":"SUM(D3:AG3)","v":0},null,{"$f":"SUM(AJ3+C3)","v":0},0]
["بعبدا","B1",null,0,null,null,null,null,null,null,null,null,null,null,null,null,null,null,null,null,null,null,null,null,null,null,null,null,null,null,null,null,null,null,null,{"$f":"SUM(D4:AG4)","v":0},null,{"$f":"SUM(AJ4+C4)","v":0},0]
["بكفيا","B10",null,{"$f":"IFERROR(VLOOKUP($A5&$B5,CHOOSE({1,2},ALL!$A$4:$A$500&ALL!$B$4:$B$500,ALL!$E$4:$E$500),2,FALSE),\"\")","v":0},null,null,null,null,null,null,null,null,null,null,null,null,null,null,null,null,null,null,null,null,null,null,null,null,null,null,null,null,null,null,null,0,null,0,0]
["المتن الشمالي العالي","B11",null,0,null,null,null,null,null,null,null,null,null,null,null,null,null,null,null,null,null,null,null,null,null,null,null,null,null,null,null,null,null,null,null,0,null,0,0]
["كسروان ","B12",null,{"$f":"IFERROR(VLOOKUP($A7&$B7,CHOOSE({1,2},ALL!$A$4:$A$500&ALL!$B$4:$B$500,ALL!$E$4:$E$500),2,FALSE),\"\")","v":0},null,null,null,null,null,null,null,null,null,null,null,null,null,null,null,null,null,null,null,null,null,null,null,null,null,null,null,null,null,null,null,0,null,0,0]
["جبيل","B13",null,{"$f":"IFERROR(VLOOKUP($A8&$B8,CHOOSE({1,2},ALL!$A$4:$A$500&ALL!$B$4:$B$500,ALL!$E$4:$E$500),2,FALSE),\"\")","v":0},null,null,null,null,null,null,null,null,null,null,null,null,null,null,null,null,null,null,null,null,null,null,null,null,null,null,null,null,null,null,null,0,null,0,0]
{"$rows_left_out":45}
{"sheet":"HA_OMT","index":3,"n_rows":52,"n_cols":39,"rows_kept":52,"cut":false,"hidden":false,"merged":[]}
[2020,"هويات OMT",null,{"$f":"ALL!C1","v":"2020-12-01"}]
["كانون اول","رمز","المنصرم",{"$f":"ALL!C2","v":"02/12/"},null,null,null,null,null,null,null,null,null,null,null,null,null,null,null,null,null,null,null,null,null,null,null,null,null,null,null,null,null,null,null,"هويات مستلمة",null,"هويات OMT مستلمة + المنصرم","هويات OMT غير مسلمة "]
["بيروت","A",null,0,null,null,null,null,null,null,null,null,null,null,null,null,null,null,null,null,null,null,null,null,null,null,null,null,null,null,null,null,null,null,null,{"$f":"SUM(C3:AG3)","v":0},null,{"$f":"SUM(AJ3+C3)","v":0},0]
["بعبدا","B1",null,0,null,null,null,null,null,null,null,null,null,null,null,null,null,null,null,null,null,null,null,null,null,null,null,null,null,null,null,null,null,null,null,{"$f":"SUM(C4:AG4)","v":0},null,{"$f":"SUM(AJ4+C4)","v":0},0]
["بكفيا","B10",null,0,null,null,null,null,null,null,null,null,null,null,null,null,null,null,null,null,null,null,null,null,null,null,null,null,null,null,null,null,null,null,null,0,null,0,0]
["المتن الشمالي العالي","B11",null,0,null,null,null,null,null,null,null,null,null,null,null,null,null,null,null,null,null,null,null,null,null,null,null,null,null,null,null,null,null,null,null,0,null,0,0]
["كسروان ","B12",null,{"$f":"IFERROR(VLOOKUP($A7&$B7,CHOOSE({1,2},ALL!$A$4:$A$500&ALL!$B$4:$B$500,ALL!$F$4:$F$500),2,FALSE),\"\")","v":0},null,null,null,null,null,null,null,null,null,null,null,null,null,null,null,null,null,null,null,null,null,null,null,null,null,null,null,null,null,null,null,0,null,0,0]
["جبيل","B13",null,{"$f":"IFERROR(VLOOKUP($A8&$B8,CHOOSE({1,2},ALL!$A$4:$A$500&ALL!$B$4:$B$500,ALL!$F$4:$F$500),2,FALSE),\"\")","v":0},null,null,null,null,null,null,null,null,null,null,null,null,null,null,null,null,null,null,null,null,null,null,null,null,null,null,null,null,null,null,null,0,null,0,0]
{"$rows_left_out":45}
{"sheet":"JARD_MOG","index":4,"n_rows":52,"n_cols":6,"rows_kept":52,"cut":false,"hidden":false,"merged":[[0,1,0,5]]}
[null,"جدول بعدد المغلفات المستلمة من المشغل  والمسلمة الى اقلام النفوس والتي هي قيد التسليم من 2020/12/1 لغــاية 2020/12/31"]
["قلم النفوس","رمز","المجموع العام لغاية2020/12/31 ","مغلفات  الشهر المنصرم","مغلفات المسلمة لغاية 2020/12/31","مغلفات  قيد التسليم"]
["بيروت","A",{"$f":"IFERROR(VLOOKUP($A3&$B3,CHOOSE({1,2},MOG!$A$3:$A$500&MOG!$B$3:$B$500,MOG!$AK$3:$AK$500),2,FALSE),\"\")","v":4},11,{"$f":"SUM((D3+C3)-F3)","v":15},{"$f":"IFERROR(VLOOKUP($A3&$B3,CHOOSE({1,2},MOG!$A$3:$A$500&MOG!$B$3:$B$500,MOG!$AM$3:$AM$500),2,FALSE),\"\")","v":0}]
["بعبدا","B1",{"$f":"IFERROR(VLOOKUP($A4&$B4,CHOOSE({1,2},MOG!$A$3:$A$500&MOG!$B$3:$B$500,MOG!$AK$3:$AK$500),2,FALSE),\"\")","v":3},0,{"$f":"SUM((D4+C4)-F4)","v":0},{"$f":"IFERROR(VLOOKUP($A4&$B4,CHOOSE({1,2},MOG!$A$3:$A$500&MOG!$B$3:$B$500,MOG!$AM$3:$AM$500),2,FALSE),\"\")","v":3}]
["بكفيا","B10",{"$f":"IFERROR(VLOOKUP($A5&$B5,CHOOSE({1,2},MOG!$A$3:$A$500&MOG!$B$3:$B$500,MOG!$AK$3:$AK$500),2,FALSE),\"\")","v":4},11,11,{"$f":"IFERROR(VLOOKUP($A5&$B5,CHOOSE({1,2},MOG!$A$3:$A$500&MOG!$B$3:$B$500,MOG!$AM$3:$AM$500),2,FALSE),\"\")","v":4}]
["المتن الشمالي العالي","B11",{"$f":"IFERROR(VLOOKUP($A6&$B6,CHOOSE({1,2},MOG!$A$3:$A$500&MOG!$B$3:$B$500,MOG!$AK$3:$AK$500),2,FALSE),\"\")","v":5},7,7,{"$f":"IFERROR(VLOOKUP($A6&$B6,CHOOSE({1,2},MOG!$A$3:$A$500&MOG!$B$3:$B$500,MOG!$AM$3:$AM$500),2,FALSE),\"\")","v":5}]
["كسروان ","B12",{"$f":"IFERROR(VLOOKUP($A7&$B7,CHOOSE({1,2},MOG!$A$3:$A$500&MOG!$B$3:$B$500,MOG!$AK$3:$AK$500),2,FALSE),\"\")","v":12},30,30,{"$f":"IFERROR(VLOOKUP($A7&$B7,CHOOSE({1,2},MOG!$A$3:$A$500&MOG!$B$3:$B$500,MOG!$AM$3:$AM$500),2,FALSE),\"\")","v":12}]
["جبيل","B13",{"$f":"IFERROR(VLOOKUP($A8&$B8,CHOOSE({1,2},MOG!$A$3:$A$500&MOG!$B$3:$B$500,MOG!$AK$3:$AK$500),2,FALSE),\"\")","v":0},12,12,{"$f":"IFERROR(VLOOKUP($A8&$B8,CHOOSE({1,2},MOG!$A$3:$A$500&MOG!$B$3:$B$500,MOG!$AM$3:$AM$500),2,FALSE),\"\")","v":0}]
{"$rows_left_out":45}
{"sheet":"JARD_HA","index":5,"n_rows":52,"n_cols":6,"rows_kept":52,"cut":false,"hidden":false,"merged":[[0,1,0,5]]}
[null,"جدول بعدد الهويات المستلمة من المشغل  والمسلمة الى اقلام النفوس والتي هي قيد التسليم من 2020/12/1 لغــاية 2020/12/31"]
["قلم النفوس","رمز","  المجموع العام لغاية2020/12/31   ","بطاقات الشهر المنصرم","بطاقات المسلمة لغاية 2020/12/31","بطاقات قيد التسليم"]
["بيروت","A",{"$f":"IFERROR(VLOOKUP($A3&$B3,CHOOSE({1,2},HA!$A$3:$A$500&HA!$B$3:$B$500,HA!$AK$3:$AK$500),2,FALSE),\"\")","v":4},140,{"$f":"SUM((D3+C3)-F3)","v":144},{"$f":"IFERROR(VLOOKUP($A3&$B3,CHOOSE({1,2},HA!$A$3:$A$500&HA!$B$3:$B$500,HA!$AM$3:$AM$500),2,FALSE),\"\")","v":0}]
["بعبدا","B1",{"$f":"IFERROR(VLOOKUP($A4&$B4,CHOOSE({1,2},HA!$A$3:$A$500&HA!$B$3:$B$500,HA!$AK$3:$AK$500),2,FALSE),\"\")","v":22},0,{"$f":"SUM((D4+C4)-F4)","v":0},{"$f":"IFERROR(VLOOKUP($A4&$B4,CHOOSE({1,2},HA!$A$3:$A$500&HA!$B$3:$B$500,HA!$AM$3:$AM$500),2,FALSE),\"\")","v":22}]
["بكفيا","B10",{"$f":"IFERROR(VLOOKUP($A5&$B5,CHOOSE({1,2},HA!$A$3:$A$500&HA!$B$3:$B$500,HA!$AK$3:$AK$500),2,FALSE),\"\")","v":82},88,88,{"$f":"IFERROR(VLOOKUP($A5&$B5,CHOOSE({1,2},HA!$A$3:$A$500&HA!$B$3:$B$500,HA!$AM$3:$AM$500),2,FALSE),\"\")","v":82}]
["المتن الشمالي العالي","B11",{"$f":"IFERROR(VLOOKUP($A6&$B6,CHOOSE({1,2},HA!$A$3:$A$500&HA!$B$3:$B$500,HA!$AK$3:$AK$500),2,FALSE),\"\")","v":9},16,16,{"$f":"IFERROR(VLOOKUP($A6&$B6,CHOOSE({1,2},HA!$A$3:$A$500&HA!$B$3:$B$500,HA!$AM$3:$AM$500),2,FALSE),\"\")","v":9}]
["كسروان ","B12",{"$f":"IFERROR(VLOOKUP($A7&$B7,CHOOSE({1,2},HA!$A$3:$A$500&HA!$B$3:$B$500,HA!$AK$3:$AK$500),2,FALSE),\"\")","v":63},81,81,{"$f":"IFERROR(VLOOKUP($A7&$B7,CHOOSE({1,2},HA!$A$3:$A$500&HA!$B$3:$B$500,HA!$AM$3:$AM$500),2,FALSE),\"\")","v":63}]
["جبيل","B13",{"$f":"IFERROR(VLOOKUP($A8&$B8,CHOOSE({1,2},HA!$A$3:$A$500&HA!$B$3:$B$500,HA!$AK$3:$AK$500),2,FALSE),\"\")","v":0},81,81,{"$f":"IFERROR(VLOOKUP($A8&$B8,CHOOSE({1,2},HA!$A$3:$A$500&HA!$B$3:$B$500,HA!$AM$3:$AM$500),2,FALSE),\"\")","v":0}]
{"$rows_left_out":45}
{"sheet":"JARD_MOG_OMT","index":6,"n_rows":52,"n_cols":6,"rows_kept":52,"cut":false,"hidden":false,"merged":[[0,1,0,5]]}
[null,"جدول بعدد المغلفات المستلمة من المشغل  والمسلمة الى اقلام النفوس والتي هي قيد التسليم من 2020/12/1 لغــاية 2020/12/31"]
["قلم النفوس","رمز","المجموع العام لغاية2020/12/31 ","مغلفات  الشهر المنصرم","مغلفات المسلمة لغاية 2020/12/31","مغلفات  قيد التسليم"]
["بيروت","A",{"$f":"IFERROR(VLOOKUP($A3&$B3,CHOOSE({1,2},MOG_OMT!$A$3:$A$500&MOG_OMT!$B$3:$B$500,MOG_OMT!$AK$3:$AK$500),2,FALSE),\"\")","v":0},0,{"$f":"SUM((D3+C3)-F3)","v":0},{"$f":"IFERROR(VLOOKUP($A3&$B3,CHOOSE({1,2},MOG_OMT!$A$3:$A$500&MOG_OMT!$B$3:$B$500,MOG_OMT!$AM$3:$AM$500),2,FALSE),\"\")","v":0}]
["بعبدا","B1",{"$f":"IFERROR(VLOOKUP($A4&$B4,CHOOSE({1,2},MOG_OMT!$A$3:$A$500&MOG_OMT!$B$3:$B$500,MOG_OMT!$AK$3:$AK$500),2,FALSE),\"\")","v":0},0,{"$f":"SUM((D4+C4)-F4)","v":0},{"$f":"IFERROR(VLOOKUP($A4&$B4,CHOOSE({1,2},MOG_OMT!$A$3:$A$500&MOG_OMT!$B$3:$B$500,MOG_OMT!$AM$3:$AM$500),2,FALSE),\"\")","v":0}]
["بكفيا","B10",{"$f":"IFERROR(VLOOKUP($A5&$B5,CHOOSE({1,2},MOG_OMT!$A$3:$A$500&MOG_OMT!$B$3:$B$500,MOG_OMT!$AK$3:$AK$500),2,FALSE),\"\")","v":0},0,0,{"$f":"IFERROR(VLOOKUP($A5&$B5,CHOOSE({1,2},MOG_OMT!$A$3:$A$500&MOG_OMT!$B$3:$B$500,MOG_OMT!$AM$3:$AM$500),2,FALSE),\"\")","v":0}]
["المتن الشمالي العالي","B11",{"$f":"IFERROR(VLOOKUP($A6&$B6,CHOOSE({1,2},MOG_OMT!$A$3:$A$500&MOG_OMT!$B$3:$B$500,MOG_OMT!$AK$3:$AK$500),2,FALSE),\"\")","v":0},0,0,{"$f":"IFERROR(VLOOKUP($A6&$B6,CHOOSE({1,2},MOG_OMT!$A$3:$A$500&MOG_OMT!$B$3:$B$500,MOG_OMT!$AM$3:$AM$500),2,FALSE),\"\")","v":0}]
["كسروان ","B12",{"$f":"IFERROR(VLOOKUP($A7&$B7,CHOOSE({1,2},MOG_OMT!$A$3:$A$500&MOG_OMT!$B$3:$B$500,MOG_OMT!$AK$3:$AK$500),2,FALSE),\"\")","v":0},0,0,{"$f":"IFERROR(VLOOKUP($A7&$B7,CHOOSE({1,2},MOG_OMT!$A$3:$A$500&MOG_OMT!$B$3:$B$500,MOG_OMT!$AM$3:$AM$500),2,FALSE),\"\")","v":0}]
["جبيل","B13",{"$f":"IFERROR(VLOOKUP($A8&$B8,CHOOSE({1,2},MOG_OMT!$A$3:$A$500&MOG_OMT!$B$3:$B$500,MOG_OMT!$AK$3:$AK$500),2,FALSE),\"\")","v":0},0,0,{"$f":"IFERROR(VLOOKUP($A8&$B8,CHOOSE({1,2},MOG_OMT!$A$3:$A$500&MOG_OMT!$B$3:$B$500,MOG_OMT!$AM$3:$AM$500),2,FALSE),\"\")","v":0}]
{"$rows_left_out":45}
{"sheet":"JARD_HA_OMT","index":7,"n_rows":52,"n_cols":6,"rows_kept":52,"cut":false,"hidden":false,"merged":[[0,1,0,5]]}
[null,"جدول بعدد الهويات المستلمة من المشغل  والمسلمة الى اقلام النفوس والتي هي قيد التسليم من 2020/12/1 لغــاية 2020/12/31"]
["قلم النفوس","رمز","  المجموع العام لغاية2020/12/31   ","بطاقات الشهر المنصرم","بطاقات المسلمة لغاية 2020/12/31","بطاقات قيد التسليم"]
["بيروت","A",{"$f":"IFERROR(VLOOKUP($A3&$B3,CHOOSE({1,2},HA_OMT!$A$3:$A$500&HA_OMT!$B$3:$B$500,HA_OMT!$AK$3:$AK$500),2,FALSE),\"\")","v":0},0,{"$f":"SUM((D3+C3)-F3)","v":0},{"$f":"IFERROR(VLOOKUP($A3&$B3,CHOOSE({1,2},HA_OMT!$A$3:$A$500&HA_OMT!$B$3:$B$500,HA_OMT!$AM$3:$AM$500),2,FALSE),\"\")","v":0}]
["بعبدا","B1",{"$f":"IFERROR(VLOOKUP($A4&$B4,CHOOSE({1,2},HA_OMT!$A$3:$A$500&HA_OMT!$B$3:$B$500,HA_OMT!$AK$3:$AK$500),2,FALSE),\"\")","v":0},0,{"$f":"SUM((D4+C4)-F4)","v":0},{"$f":"IFERROR(VLOOKUP($A4&$B4,CHOOSE({1,2},HA_OMT!$A$3:$A$500&HA_OMT!$B$3:$B$500,HA_OMT!$AM$3:$AM$500),2,FALSE),\"\")","v":0}]
["بكفيا","B10",{"$f":"IFERROR(VLOOKUP($A5&$B5,CHOOSE({1,2},HA_OMT!$A$3:$A$500&HA_OMT!$B$3:$B$500,HA_OMT!$AK$3:$AK$500),2,FALSE),\"\")","v":0},0,0,{"$f":"IFERROR(VLOOKUP($A5&$B5,CHOOSE({1,2},HA_OMT!$A$3:$A$500&HA_OMT!$B$3:$B$500,HA_OMT!$AM$3:$AM$500),2,FALSE),\"\")","v":0}]
["المتن الشمالي العالي","B11",{"$f":"IFERROR(VLOOKUP($A6&$B6,CHOOSE({1,2},HA_OMT!$A$3:$A$500&HA_OMT!$B$3:$B$500,HA_OMT!$AK$3:$AK$500),2,FALSE),\"\")","v":0},0,0,{"$f":"IFERROR(VLOOKUP($A6&$B6,CHOOSE({1,2},HA_OMT!$A$3:$A$500&HA_OMT!$B$3:$B$500,HA_OMT!$AM$3:$AM$500),2,FALSE),\"\")","v":0}]
["كسروان ","B12",{"$f":"IFERROR(VLOOKUP($A7&$B7,CHOOSE({1,2},HA_OMT!$A$3:$A$500&HA_OMT!$B$3:$B$500,HA_OMT!$AK$3:$AK$500),2,FALSE),\"\")","v":0},0,0,{"$f":"IFERROR(VLOOKUP($A7&$B7,CHOOSE({1,2},HA_OMT!$A$3:$A$500&HA_OMT!$B$3:$B$500,HA_OMT!$AM$3:$AM$500),2,FALSE),\"\")","v":0}]
["جبيل","B13",{"$f":"IFERROR(VLOOKUP($A8&$B8,CHOOSE({1,2},HA_OMT!$A$3:$A$500&HA_OMT!$B$3:$B$500,HA_OMT!$AK$3:$AK$500),2,FALSE),\"\")","v":0},0,0,{"$f":"IFERROR(VLOOKUP($A8&$B8,CHOOSE({1,2},HA_OMT!$A$3:$A$500&HA_OMT!$B$3:$B$500,HA_OMT!$AM$3:$AM$500),2,FALSE),\"\")","v":0}]
{"$rows_left_out":45}
{"sheet":"ALL","index":8,"n_rows":53,"n_cols":133,"rows_kept":53,"cut":false,"hidden":false,"merged":[[0,18,0,21],[1,2,1,5],[0,2,0,5],[0,6,0,9],[0,10,0,13],[0,14,0,17],[0,62,0,65],[0,46,0,49],[1,6,1,9],[1,10,1,13],[1,14,1,17],[1,18,1,21],[1,22,1,25],[1,26,1,29],[1,30,1,33],[1,34,1,37],[1,38,1,41],[0,22,0,25],[0,26,0,29],[0,30,0,33],[0,34,0,37],[0,38,0,41],[1,42,1,45],[1,46,1,49],[0,50,0,53],[0,54,0,57],[0,58,0,61],[0,42,0,45],[0,102,0,105],[0,90,0,93],[0,94,0,97],[1,50,1,53],[1,54,1,57],[1,58,1,61],[1,62,1,65],[1,66,1,69],[1,70,1,73],[1,74,1,77],[1,78,1,81],[0,66,0,69],[0,70,0,73],[0,74,0,77],[0,78,0,81],[0,82,0,85],[1,82,1,85],[1,86,1,89],[1,90,1,93],[1,94,1,97],[0,98,0,101],[0,86,0,89],[0,106,0,109],[0,110,0,113],[0,114,0,117],[0,118,0,121],[0,122,0,125],[1,122,1,125],[1,98,1,101],[1,102,1,105],[1,106,1,109],[1,110,1,113],[1,114,1,117],[1,118,1,121]]}
[2020,"ALL","2020-12-01"]
["كانون اول","رمز","02/12/"]
[null,null,"مغلفات","هويات","مغلفات OMT","هويات OMT","مغلفات","هويات","مغلفات OMT","هويات OMT","مغلفات","هويات","مغلفات OMT","هويات OMT","مغلفات","هويات","مغلفات OMT","هويات OMT","مغلفات","هويات","مغلفات OMT","هويات OMT","مغلفات","هويات","مغلفات OMT","هويات OMT","مغلفات","هويات","مغلفات OMT","هويات OMT","مغلفات","هويات","مغلفات OMT","هويات OMT","مغلفات","هويات","مغلفات OMT","هويات OMT","مغلفات","هويات","مغلفات OMT","هويات OMT","مغلفات","هويات","مغلفات OMT","هويات OMT","مغلفات","هويات","مغلفات OMT","هويات OMT","مغلفات","هويات","مغلفات OMT","هويات OMT","مغلفات","هويات","مغلفات OMT","هويات OMT","مغلفات","هويات","مغلفات OMT","هويات OMT","مغلفات","هويات","مغلفات OMT","هويات OMT","مغلفات","هويات","مغلفات OMT","هويات OMT","مغلفات","هويات","مغلفات OMT","هويات OMT","مغلفات","هويات","مغلفات OMT","هويات OMT","مغلفات","هويات","مغلفات OMT","هويات OMT","مغلفات","هويات","مغلفات OMT","هويات OMT","مغلفات","هويات","مغلفات OMT","هويات OMT","مغلفات","هويات","مغلفات OMT","هويات OMT","مغلفات","هويات","مغلفات OMT","هويات OMT","مغلفات","هويات","مغلفات OMT","هويات OMT","مغلفات","هويات","مغلفات OMT","هويات OMT","مغلفات","هويات","مغلفات OMT","هويات OMT","مغلفات","هويات","مغلفات OMT","هويات OMT","مغلفات","هويات","مغلفات OMT","هويات OMT","مغلفات","هويات","مغلفات OMT","هويات OMT","مغلفات","هويات","مغلفات OMT","هويات OMT",null,null,null,"مغلفات","هويات","مغلفات OMT","هويات OMT"]
["بيروت","A",4,4,null,null,null,null,null,null,null,null,null,null,null,null,null,null,null,null,null,null,null,null,null,null,null,null,null,null,null,null,null,null,null,null,null,null,null,null,null,null,null,null,null,null,null,null,null,null,null,null,null,null,null,null,null,null,null,null,null,null,null,null,null,null,null,null,null,null,null,null,null,null,null,null,null,null,null,null,null,null,null,null,null,null,null,null,null,null,null,null,null,null,null,null,null,null,null,null,null,null,null,null,null,null,null,null,null,null,null,null,null,null,null,null,null,null,null,null,null,null,null,null,null,null,null,null,null,{"$f":"SUM(C4+G4+K4+O4+S4+W4+AA4+AE4+AI4+AM4+AQ4+AU4+AY4+BC4+BG4+BK4+BO4+BS4+BW4+CA4+CE4+CI4+CM4+CQ4+CU4+CY4+DC4+DG4+DK4+DO4+DS4)","v":4},{"$f":"SUM(D4+H4+L4+P4+T4+X4+AB4+AF4+AJ4+AN4+AR4+AV4+AZ4+BD4+BH4+BL4+BP4+BT4+BX4+CB4+CF4+CJ4+CN4+CR4+CV4+CZ4+DD4+DH4+DL4+DP4+DT4)","v":4},{"$f":"SUM(E4+I4+M4+Q4+U4+Y4+AC4+AG4+AK4+AO4+AS4+AW4+BA4+BE4+BI4+BM4+BQ4+BU4+BY4+CC4+CG4+CK4+CO4+CS4+CW4+DA4+DE4+DI4+DM4+DQ4+DU4)","v":0},{"$f":"SUM(F4+J4+N4+R4+V4+Z4+AD4+AH4+AL4+AP4+AT4+AX4+BB4+BF4+BJ4+BN4+BR4+BV4+BZ4+CD4+CH4+CL4+CP4+CT4+CX4+DB4+DF4+DJ4+DN4+DR4+DV4)","v":0}]
["بعبدا","B1",3,22,null,null,null,null,null,null,null,null,null,null,null,null,null,null,null,null,null,null,null,null,null,null,null,null,null,null,null,null,null,null,null,null,null,null,null,null,null,null,null,null,null,null,null,null,null,null,null,null,null,null,null,null,null,null,null,null,null,null,null,null,null,null,null,null,null,null,null,null,null,null,null,null,null,null,null,null,null,null,null,null,null,null,null,null,null,null,null,null,null,null,null,null,null,null,null,null,null,null,null,null,null,null,null,null,null,null,null,null,null,null,null,null,null,null,null,null,null,null,null,null,null,null,null,null,null,{"$f":"SUM(C5+G5+K5+O5+S5+W5+AA5+AE5+AI5+AM5+AQ5+AU5+AY5+BC5+BG5+BK5+BO5+BS5+BW5+CA5+CE5+CI5+CM5+CQ5+CU5+CY5+DC5+DG5+DK5+DO5+DS5)","v":3},{"$f":"SUM(D5+H5+L5+P5+T5+X5+AB5+AF5+AJ5+AN5+AR5+AV5+AZ5+BD5+BH5+BL5+BP5+BT5+BX5+CB5+CF5+CJ5+CN5+CR5+CV5+CZ5+DD5+DH5+DL5+DP5+DT5)","v":22},{"$f":"SUM(E5+I5+M5+Q5+U5+Y5+AC5+AG5+AK5+AO5+AS5+AW5+BA5+BE5+BI5+BM5+BQ5+BU5+BY5+CC5+CG5+CK5+CO5+CS5+CW5+DA5+DE5+DI5+DM5+DQ5+DU5)","v":0},{"$f":"SUM(F5+J5+N5+R5+V5+Z5+AD5+AH5+AL5+AP5+AT5+AX5+BB5+BF5+BJ5+BN5+BR5+BV5+BZ5+CD5+CH5+CL5+CP5+CT5+CX5+DB5+DF5+DJ5+DN5+DR5+DV5)","v":0}]
["بكفيا","B10",4,82,null,null,null,null,null,null,null,null,null,null,null,null,null,null,null,null,null,null,null,null,null,null,null,null,null,null,null,null,null,null,null,null,null,null,null,null,null,null,null,null,null,null,null,null,null,null,null,null,null,null,null,null,null,null,null,null,null,null,null,null,null,null,null,null,null,null,null,null,null,null,null,null,null,null,null,null,null,null,null,null,null,null,null,null,null,null,null,null,null,null,null,null,null,null,null,null,null,null,null,null,null,null,null,null,null,null,null,null,null,null,null,null,null,null,null,null,null,null,null,null,null,null,null,null,null,4,82,0,0]
["المتن الشمالي العالي","B11",5,9,null,null,null,null,null,null,null,null,null,null,null,null,null,null,null,null,null,null,null,null,null,null,null,null,null,null,null,null,null,null,null,null,null,null,null,null,null,null,null,null,null,null,null,null,null,null,null,null,null,null,null,null,null,null,null,null,null,null,null,null,null,null,null,null,null,null,null,null,null,null,null,null,null,null,null,null,null,null,null,null,null,null,null,null,null,null,null,null,null,null,null,null,null,null,null,null,null,null,null,null,null,null,null,null,null,null,null,null,null,null,null,null,null,null,null,null,null,null,null,null,null,null,null,null,null,5,9,0,0]
["كسروان ","B12",12,63,null,null,null,null,null,null,null,null,null,null,null,null,null,null,null,null,null,null,null,null,null,null,null,null,null,null,null,null,null,null,null,null,null,null,null,null,null,null,null,null,null,null,null,null,null,null,null,null,null,null,null,null,null,null,null,null,null,null,null,null,null,null,null,null,null,null,null,null,null,null,null,null,null,null,null,null,null,null,null,null,null,null,null,null,null,null,null,null,null,null,null,null,null,null,null,null,null,null,null,null,null,null,null,null,null,null,null,null,null,null,null,null,null,null,null,null,null,null,null,null,null,null,null,null,null,12,63,0,0]
{"$rows_left_out":46}
{"sheet":"جدول تسليم البطاقات","index":9,"n_rows":41,"n_cols":11,"rows_kept":41,"cut":false,"hidden":false,"merged":[[39,0,39,4],[39,6,39,10],[40,0,40,4],[40,6,40,10],[8,0,8,10],[9,0,9,10],[10,0,11,0],[10,6,11,6],[38,0,38,4],[38,6,38,10]]}
["وزارة الداخــلية والبلــديات"]
["المديرية العامة للاحوال الشخصية",null,null,null,null,null,"جانب: رئيس دائرة التنسيق والمراقبة ."]
[]
["رقم المحفوظات:"]
["رقم الصادر:"]
[null,null,null,null,null,"الموضوع: بيان بحركة استمارات وبطاقات الهوية في مشغل بطاقة الهوية ."]
[null,null,null,null,null,"المرجع: المذكرة رقم 3/ص تاريخ 2007/3/9 ."]
[]
{"$rows_left_out":33}