{"text_format":"1","workbook":"xlsx","n_sheets":3,"sheets":["Sheet1","Sheet2","Sheet3"],"not_rendered":{"charts":0,"images":0,"macros":1,"external_links":0,"defined_names":0,"comments":0,"pivot_tables":0},"unopened":[],"bounds":{"document_bytes":16777216,"sheet_cells":100000,"rows_first":2000,"rows_last":500,"rows_between":2000,"halvings":0,"cell_chars":16384,"cell_head_chars":4096},"cells_cut":0,"cells_raw":0,"read":"whole","date_system":"1900"}

{"sheet":"Sheet1","index":0,"n_rows":40,"n_cols":15,"rows_kept":40,"cut":false,"hidden":false,"merged":[]}
[1,2,3,4,5,6,7,8,9,10,11,12,13]
[null,null,-5,4,null,-101.99999999999987,-495.2000000000001,-16,null,null,{"$f":"IF(AND(C2<=0,D2>=0,F2<=0,G2<=0,H2<=-15,M2<=-13),\"Sell\",\"\")","v":"Sell"},{"$f":"IF(AND(F2<=0,G2<=0,H2<=-15,M2<=-8),\"Wait\",\"Close\")","v":"Wait"},-14,{"$f":"IF(AND(F2>=0,G2>=0,H2>=15,M2>=8),\"Wait\",\"Close\")","v":"Close"},{"$f":"IF(AND(C2>=0,D2<=0,F2>=0,G2>=0,H2>=15,M2>=13),\"Buy\",\"\")","v":""}]
[null,null,2,-2,null,-11.299999999998533,-182.29999999999967,-14,null,null,{"$f":"IF(AND(C3<=0,D3>=0,F3<=0,G3<=0,H3<=-15,M3<=-13),\"Sell\",\"\")","v":""},"Close",4,"Close",{"$f":"IF(AND(C3>=0,D3<=0,F3>=0,G3>=0,H3>=15,M3>=13),\"Buy\",\"\")","v":""}]
[null,null,2,4,null,-96.200000000001751,-198.79999999999995,-2,null,null,"","Close",-2,"Close",""]
[null,null,2,2,null,-51.299999999998569,-248.39999999999972,0,null,null,"","Close",0,"Close",""]
[null,null,2,-1,null,-87.800000000000097,-380.49999999999915,3,null,null,"","Close",3,"Close",""]
[null,null,2,8,null,-69.399999999999466,-186.599999999999,-6,null,null,"","Close",-6,"Close",""]
[null,null,-8,7,null,-60,-34.19999999999979,-19,null,null,"Sell","Wait",-14,"Close",""]
[null,null,-5,4,null,-67.999999999999261,-38.700000000000045,-9,null,null,"","Close",-9,"Close",""]
[null,null,-5,-1,null,-17.199999999999438,-126.59999999999894,-4,null,null,"","Close",-4,"Close",""]
[null,null,500]
[null,null,-5,8,null,-24.799999999998157,-19.099999999998563,-16,null,null,"Sell",{"$f":"IF(AND(F12<=0,G12<=0,H12<=-15,M12<=-8),\"Wait\",\"Close\")","v":"Wait"},-15,{"$f":"IF(AND(F12>=0,G12>=0,H12>=15,M12>=8),\"Wait\",\"Close\")","v":"Close"},""]
[null,null,-1,8,null,-10.000000000000009,45.600000000000087,-9,null,null,"","Close",-9,"Close",""]
[null,null,8,2,null,30.399999999999316,-7.3999999999996291,6,null,null,"","Close",6,"Close",""]
[null,null,8,-2,null,35.199999999999676,-10.999999999999899,10,null,null,"","Close",10,"Close",""]
[null,null,-7,9,null,-24.900000000000944,-10.200000000000387,-18,null,null,"Sell","Wait",-16,"Close",""]
[null,null,4,8,null,-2.7000000000010349E-2,1.0119999999999907,-4,null,null,"","Close",-4,"Close",""]
[null,null,4,2,null,20.200000000000216,124.40000000000006,2,null,null,"","Close",2,"Close",""]
[null,null,4,-2,null,26.199999999999555,89.39999999999948,6,null,null,"","Close",6,"Close",""]
[null,null,4,4,null,-19.600000000001216,100,0,null,null,"","Close",0,"Close",""]
[null,null,8,-8,null,106.26599999999999,77,16,null,null,"","Close",16,"Wait","Buy"]
[null,null,2,-2,null,12.699999999999934,0.20000000000020002,4,null,null,"","Close",4,"Close",""]
[null,null,2,4,null,-38.700000000000045,1.2000000000000455,-2,null,null,"","Close",-2,"Close",""]
[null,null,-2,4,null,-81.60000000000025,13.299999999999557,-6,null,null,"","Close",-6,"Close",""]
[null,null,-5,4,null,-0.33900000000000041,-2.4519999999999875,-9,null,null,"","Close",-9,"Close",""]
[null,null,-5,-2,null,19.800000000000928,-25.600000000001177,-3,null,null,"","Close",-3,"Close",""]
[null,null,-5,2,null,21.999999999999797,103.99999999999964,-7,null,null,"","Close",-7,"Close",""]
[null,null,-1,2,null,8.099999999999774,54.600000000000207,-3,null,null,"","Close",-3,"Close",""]
[null,null,-1,-2,null,-19238.300000000003,32.999999999999694,1,null,null,"","Close",1,"Close",""]
[null,null,-1,4,null,7113.7699999999995,43.39999999999975,-5,null,null,"","Close",-5,"Close",""]
[null,null,5,8,null,183675.57,200,-3,null,null,"","Close",-3,"Close",""]
[]
[null,null,17,13,null,-89.000000000001307,-367.99999999999943,4,null,null,"",{"$f":"IF(AND(F33<=-1,G33<=-1,H33<=-15,M33<=-8),\"Wait\",\"Close\")","v":"Close"},4,{"$f":"IF(AND(F33>=1,G33>=1,H33>=15,M33>=8),\"Wait\",\"Close\")","v":"Close"},""]
[null,null,10,20,null,-3.00000000000189,-24.999999999999467,-10,null,null,"","Close",-10,"Close",""]
[null,null,19,11,null,-18.499999999999517,-1.8999999999998352,-8,null,null,"","Close",-8,"Close",""]
[null,null,23,7,null,29.000000000001247,-6.9999999999992291,16,null,null,"","Close",16,"Close",""]
[null,null,13,17,null,2423.9999999999995,53.999999999998494,-4,null,null,"","Close",-4,"Close",""]
[null,null,17,13,null,-4144.9999999999991,13.000000000000789,4,null,null,"","Close",4,"Close",""]
[null,null,19,11,null,-4720,187.99999999999929,8,null,null,"","Close",8,"Close",""]
[null,null,14,16,null,-5583,79.000000000000185,-2,null,null,"","Close",-2,"Close",""]

{"sheet":"Sheet2","index":1,"n_rows":40,"n_cols":15,"rows_kept":40,"cut":false,"hidden":false,"merged":[]}
[]
[null,null,-5,4,null,-101.99999999999987,-495.2000000000001,-16,null,null,null,null,-14,null," "]
[null,null,2,-2,null,-11.299999999998533,-182.29999999999967,-14,null,null,null,null,4,null," "]
[null,null,2,4,null,-96.200000000001751,-198.79999999999995,-2,null,null,null,null,-2,null," "]
[null,null,2,2,null,-51.299999999998569,-248.39999999999972,0,null,null,null,null,0,null," "]
[null,null,2,-1,null,-87.800000000000097,-380.49999999999915,3,null,null,null,null,3,null," "]
[null,null,2,8,null,-69.399999999999466,-186.599999999999,-6,null,null,null,null,-6,null," "]
[null,null,-8,7,null,-60,-34.19999999999979,-19,null,null,null,null,-14,null," "]
[null,null,-5,4,null,-67.999999999999261,-38.700000000000045,-9,null,null,null,null,-9,null," "]
[null,null,-5,-1,null,-17.199999999999438,-126.59999999999894,-4,null,null,null,null,-4,null," "]
[null,null,500,null,null,null,null,null,null,null,null,null,null,null," "]
[null,null,-5,8,null,-24.799999999998157,-19.099999999998563,-16,null,null,null,null,-15,null," "]
[null,null,-1,8,null,-10.000000000000009,45.600000000000087,-9,null,null,null,null,-9,null," "]
[null,null,8,2,null,30.399999999999316,-7.3999999999996291,6,null,null,null,null,6,null," "]
[null,null,8,-2,null,35.199999999999676,-10.999999999999899,10,null,null,null,null,10,null," "]
[null,null,-7,9,null,-24.900000000000944,-10.200000000000387,-18,null,null,null,null,-16,null," "]
[null,null,4,8,null,-2.7000000000010349E-2,1.0119999999999907,-4,null,null,null,null,-4,null," "]
[null,null,4,2,null,20.200000000000216,124.40000000000006,2,null,null,null,null,2,null," "]
[null,null,4,-2,null,26.199999999999555,89.39999999999948,6,null,null,null,null,6,null," "]
[null,null,4,4,null,-19.600000000001216,100,0,null,null,null,null,0,null," "]
[null,null,8,-8,null,106.26599999999999,77,16,null,null,null,null,16,null,"BUY"]
[null,null,2,-2,null,12.699999999999934,0.20000000000020002,4,null,null,null,null,4,null," "]
[null,null,2,4,null,-38.700000000000045,1.2000000000000455,-2,null,null,null,null,-2,null," "]
[null,null,-2,4,null,-81.60000000000025,13.299999999999557,-6,null,null,null,null,-6,null," "]
[null,null,-5,4,null,-0.33900000000000041,-2.4519999999999875,-9,null,null,null,null,-9,null," "]
[null,null,-5,-2,null,19.800000000000928,-25.600000000001177,-3,null,null,null,null,-3,null," "]
[null,null,-5,2,null,21.999999999999797,103.99999999999964,-7,null,null,null,null,-7,null," "]
[null,null,-1,2,null,8.099999999999774,54.600000000000207,-3,null,null,null,null,-3,null," "]
[null,null,-1,-2,null,-19238.300000000003,32.999999999999694,1,null,null,null,null,1,null," "]
[null,null,-1,4,null,7113.7699999999995,43.39999999999975,-5,null,null,null,null,-5,null," "]
[null,null,5,8,null,183675.57,200,-3,null,null,null,null,-3,null," "]
[null,null,null,null,null,null,null,null,null,null,null,null,null,null," "]
[null,null,17,13,null,-89.000000000001307,-367.99999999999943,4,null,null,null,null,4,null," "]
[null,null,10,20,null,-3.00000000000189,-24.999999999999467,-10,null,null,null,null,-10,null," "]
[null,null,19,11,null,-18.499999999999517,-1.8999999999998352,-8,null,null,null,null,-8,null," "]
[null,null,23,7,null,29.000000000001247,-6.9999999999992291,16,null,null,null,null,16,null," "]
[null,null,13,17,null,2423.9999999999995,53.999999999998494,-4,null,null,null,null,-4,null," "]
[null,null,17,13,null,-4144.9999999999991,13.000000000000789,4,null,null,null,null,4,null," "]
[null,null,19,11,null,-4720,187.99999999999929,8,null,null,null,null,8,null," "]
[null,null,14,16,null,-5583,79.000000000000185,-2,null,null,null,null,-2,null," "]

{"sheet":"Sheet3","index":2,"n_rows":0,"n_cols":0,"rows_kept":0,"cut":false,"hidden":false,"merged":[]}