{"text_format":"1","workbook":"xlsx","n_sheets":5,"sheets":["جريده الوطن","نادي الفروسيه","مدرسه السلامه","Payments","One For_All"],"not_rendered":{"charts":0,"images":0,"macros":1,"external_links":6,"defined_names":45,"comments":0,"pivot_tables":0},"unopened":[],"bounds":{"document_bytes":16777216,"sheet_cells":100000,"rows_first":2000,"rows_last":500,"rows_between":2000,"halvings":0,"cell_chars":16384,"cell_head_chars":4096},"cells_cut":0,"cells_raw":0,"read":"whole","date_system":"1900"}

{"sheet":"جريده الوطن","index":0,"n_rows":70,"n_cols":10,"rows_kept":70,"cut":false,"hidden":false,"merged":[]}
[null,null,null,null,null,"Sum",null,"المستفيد","المبلغ","المشروع"]
["الموقع","جريده الوطن",null,null,null,{"$f":"SUM(F5:F67)","v":9003}]
["تاريخ بدء العمل"]
[null,"م","Date","الموقع","المستفيد","المبلغ","التفاصيل"]
[null,{"$f":"IF(C5=\"\",\"\",MAX($B$4:B4)+1)","v":1},{"$f":"IF(ROWS(C$5:C5)>COUNTIF(Payments!$C$2:$C$100,$B$2),\"\",INDEX(Payments!B$2:B$100,SMALL(IF(Payments!$C$2:$C$100<>\"\",IF(Payments!$C$2:$C$100=$B$2,ROW($C$7:$C$105)-ROW($C$7)+1)),ROWS(C$5:C5))))","v":"2020-12-13"},{"$f":"IF(ROWS(D$5:D5)>COUNTIF(Payments!$C$2:$C$100,$B$2),\"\",INDEX(Payments!C$2:C$100,SMALL(IF(Payments!$C$2:$C$100<>\"\",IF(Payments!$C$2:$C$100=$B$2,ROW($C$7:$C$105)-ROW($C$7)+1)),ROWS(D$5:D5))))","v":"جريده الوطن"},{"$f":"IF(ROWS(E$5:E5)>COUNTIF(Payments!$C$2:$C$100,$B$2),\"\",INDEX(Payments!D$2:D$100,SMALL(IF(Payments!$C$2:$C$100<>\"\",IF(Payments!$C$2:$C$100=$B$2,ROW($C$7:$C$105)-ROW($C$7)+1)),ROWS(E$5:E5))))","v":"محمد علي"},{"$f":"IF(ROWS(F$5:F5)>COUNTIF(Payments!$C$2:$C$100,$B$2),\"\",INDEX(Payments!E$2:E$100,SMALL(IF(Payments!$C$2:$C$100<>\"\",IF(Payments!$C$2:$C$100=$B$2,ROW($C$7:$C$105)-ROW($C$7)+1)),ROWS(F$5:F5))))","v":2000},{"$f":"IF(ROWS(G$5:G5)>COUNTIF(Payments!$C$2:$C$100,$B$2),\"\",INDEX(Payments!F$2:F$100,SMALL(IF(Payments!$C$2:$C$100<>\"\",IF(Payments!$C$2:$C$100=$B$2,ROW($C$7:$C$105)-ROW($C$7)+1)),ROWS(G$5:G5))))","v":"السور الخارجي"}]
[null,{"$f":"IF(C6=\"\",\"\",MAX($B$4:B5)+1)","v":2},{"$f":"IF(ROWS(C$5:C6)>COUNTIF(Payments!$C$2:$C$100,$B$2),\"\",INDEX(Payments!B$2:B$100,SMALL(IF(Payments!$C$2:$C$100<>\"\",IF(Payments!$C$2:$C$100=$B$2,ROW($C$7:$C$105)-ROW($C$7)+1)),ROWS(C$5:C6))))","v":"2020-12-15"},{"$f":"IF(ROWS(D$5:D6)>COUNTIF(Payments!$C$2:$C$100,$B$2),\"\",INDEX(Payments!C$2:C$100,SMALL(IF(Payments!$C$2:$C$100<>\"\",IF(Payments!$C$2:$C$100=$B$2,ROW($C$7:$C$105)-ROW($C$7)+1)),ROWS(D$5:D6))))","v":"جريده الوطن"},{"$f":"IF(ROWS(E$5:E6)>COUNTIF(Payments!$C$2:$C$100,$B$2),\"\",INDEX(Payments!D$2:D$100,SMALL(IF(Payments!$C$2:$C$100<>\"\",IF(Payments!$C$2:$C$100=$B$2,ROW($C$7:$C$105)-ROW($C$7)+1)),ROWS(E$5:E6))))","v":"محمد علي"},{"$f":"IF(ROWS(F$5:F6)>COUNTIF(Payments!$C$2:$C$100,$B$2),\"\",INDEX(Payments!E$2:E$100,SMALL(IF(Payments!$C$2:$C$100<>\"\",IF(Payments!$C$2:$C$100=$B$2,ROW($C$7:$C$105)-ROW($C$7)+1)),ROWS(F$5:F6))))","v":"1902-09-27"},{"$f":"IF(ROWS(G$5:G6)>COUNTIF(Payments!$C$2:$C$100,$B$2),\"\",INDEX(Payments!F$2:F$100,SMALL(IF(Payments!$C$2:$C$100<>\"\",IF(Payments!$C$2:$C$100=$B$2,ROW($C$7:$C$105)-ROW($C$7)+1)),ROWS(G$5:G6))))","v":"المسبح"}]
[null,{"$f":"IF(C7=\"\",\"\",MAX($B$4:B6)+1)","v":3},{"$f":"IF(ROWS(C$5:C7)>COUNTIF(Payments!$C$2:$C$100,$B$2),\"\",INDEX(Payments!B$2:B$100,SMALL(IF(Payments!$C$2:$C$100<>\"\",IF(Payments!$C$2:$C$100=$B$2,ROW($C$7:$C$105)-ROW($C$7)+1)),ROWS(C$5:C7))))","v":"2020-12-13"},{"$f":"IF(ROWS(D$5:D7)>COUNTIF(Payments!$C$2:$C$100,$B$2),\"\",INDEX(Payments!C$2:C$100,SMALL(IF(Payments!$C$2:$C$100<>\"\",IF(Payments!$C$2:$C$100=$B$2,ROW($C$7:$C$105)-ROW($C$7)+1)),ROWS(D$5:D7))))","v":"جريده الوطن"},{"$f":"IF(ROWS(E$5:E7)>COUNTIF(Payments!$C$2:$C$100,$B$2),\"\",INDEX(Payments!D$2:D$100,SMALL(IF(Payments!$C$2:$C$100<>\"\",IF(Payments!$C$2:$C$100=$B$2,ROW($C$7:$C$105)-ROW($C$7)+1)),ROWS(E$5:E7))))","v":"محمد علي"},{"$f":"IF(ROWS(F$5:F7)>COUNTIF(Payments!$C$2:$C$100,$B$2),\"\",INDEX(Payments!E$2:E$100,SMALL(IF(Payments!$C$2:$C$100<>\"\",IF(Payments!$C$2:$C$100=$B$2,ROW($C$7:$C$105)-ROW($C$7)+1)),ROWS(F$5:F7))))","v":"1905-06-22"},{"$f":"IF(ROWS(G$5:G7)>COUNTIF(Payments!$C$2:$C$100,$B$2),\"\",INDEX(Payments!F$2:F$100,SMALL(IF(Payments!$C$2:$C$100<>\"\",IF(Payments!$C$2:$C$100=$B$2,ROW($C$7:$C$105)-ROW($C$7)+1)),ROWS(G$5:G7))))","v":"السور الخارجي"}]
[null,{"$f":"IF(C8=\"\",\"\",MAX($B$4:B7)+1)","v":4},{"$f":"IF(ROWS(C$5:C8)>COUNTIF(Payments!$C$2:$C$100,$B$2),\"\",INDEX(Payments!B$2:B$100,SMALL(IF(Payments!$C$2:$C$100<>\"\",IF(Payments!$C$2:$C$100=$B$2,ROW($C$7:$C$105)-ROW($C$7)+1)),ROWS(C$5:C8))))","v":"2020-12-15"},{"$f":"IF(ROWS(D$5:D8)>COUNTIF(Payments!$C$2:$C$100,$B$2),\"\",INDEX(Payments!C$2:C$100,SMALL(IF(Payments!$C$2:$C$100<>\"\",IF(Payments!$C$2:$C$100=$B$2,ROW($C$7:$C$105)-ROW($C$7)+1)),ROWS(D$5:D8))))","v":"جريده الوطن"},{"$f":"IF(ROWS(E$5:E8)>COUNTIF(Payments!$C$2:$C$100,$B$2),\"\",INDEX(Payments!D$2:D$100,SMALL(IF(Payments!$C$2:$C$100<>\"\",IF(Payments!$C$2:$C$100=$B$2,ROW($C$7:$C$105)-ROW($C$7)+1)),ROWS(E$5:E8))))","v":"النور احمد"},{"$f":"IF(ROWS(F$5:F8)>COUNTIF(Payments!$C$2:$C$100,$B$2),\"\",INDEX(Payments!E$2:E$100,SMALL(IF(Payments!$C$2:$C$100<>\"\",IF(Payments!$C$2:$C$100=$B$2,ROW($C$7:$C$105)-ROW($C$7)+1)),ROWS(F$5:F8))))","v":"1902-09-27"},{"$f":"IF(ROWS(G$5:G8)>COUNTIF(Payments!$C$2:$C$100,$B$2),\"\",INDEX(Payments!F$2:F$100,SMALL(IF(Payments!$C$2:$C$100<>\"\",IF(Payments!$C$2:$C$100=$B$2,ROW($C$7:$C$105)-ROW($C$7)+1)),ROWS(G$5:G8))))","v":"المسبح"}]
[null,{"$f":"IF(C9=\"\",\"\",MAX($B$4:B8)+1)","v":5},{"$f":"IF(ROWS(C$5:C9)>COUNTIF(Payments!$C$2:$C$100,$B$2),\"\",INDEX(Payments!B$2:B$100,SMALL(IF(Payments!$C$2:$C$100<>\"\",IF(Payments!$C$2:$C$100=$B$2,ROW($C$7:$C$105)-ROW($C$7)+1)),ROWS(C$5:C9))))","v":"2020-12-16"},{"$f":"IF(ROWS(D$5:D9)>COUNTIF(Payments!$C$2:$C$100,$B$2),\"\",INDEX(Payments!C$2:C$100,SMALL(IF(Payments!$C$2:$C$100<>\"\",IF(Payments!$C$2:$C$100=$B$2,ROW($C$7:$C$105)-ROW($C$7)+1)),ROWS(D$5:D9))))","v":"جريده الوطن"},{"$f":"IF(ROWS(E$5:E9)>COUNTIF(Payments!$C$2:$C$100,$B$2),\"\",INDEX(Payments!D$2:D$100,SMALL(IF(Payments!$C$2:$C$100<>\"\",IF(Payments!$C$2:$C$100=$B$2,ROW($C$7:$C$105)-ROW($C$7)+1)),ROWS(E$5:E9))))","v":"Officena"},{"$f":"IF(ROWS(F$5:F9)>COUNTIF(Payments!$C$2:$C$100,$B$2),\"\",INDEX(Payments!E$2:E$100,SMALL(IF(Payments!$C$2:$C$100<>\"\",IF(Payments!$C$2:$C$100=$B$2,ROW($C$7:$C$105)-ROW($C$7)+1)),ROWS(F$5:F9))))","v":"1905-06-22"},{"$f":"IF(ROWS(G$5:G9)>COUNTIF(Payments!$C$2:$C$100,$B$2),\"\",INDEX(Payments!F$2:F$100,SMALL(IF(Payments!$C$2:$C$100<>\"\",IF(Payments!$C$2:$C$100=$B$2,ROW($C$7:$C$105)-ROW($C$7)+1)),ROWS(G$5:G9))))","v":"السور الخارجي"}]
[null,{"$f":"IF(C10=\"\",\"\",MAX($B$4:B9)+1)","v":6},{"$f":"IF(ROWS(C$5:C10)>COUNTIF(Payments!$C$2:$C$100,$B$2),\"\",INDEX(Payments!B$2:B$100,SMALL(IF(Payments!$C$2:$C$100<>\"\",IF(Payments!$C$2:$C$100=$B$2,ROW($C$7:$C$105)-ROW($C$7)+1)),ROWS(C$5:C10))))","v":"2020-12-15"},{"$f":"IF(ROWS(D$5:D10)>COUNTIF(Payments!$C$2:$C$100,$B$2),\"\",INDEX(Payments!C$2:C$100,SMALL(IF(Payments!$C$2:$C$100<>\"\",IF(Payments!$C$2:$C$100=$B$2,ROW($C$7:$C$105)-ROW($C$7)+1)),ROWS(D$5:D10))))","v":"جريده الوطن"},{"$f":"IF(ROWS(E$5:E10)>COUNTIF(Payments!$C$2:$C$100,$B$2),\"\",INDEX(Payments!D$2:D$100,SMALL(IF(Payments!$C$2:$C$100<>\"\",IF(Payments!$C$2:$C$100=$B$2,ROW($C$7:$C$105)-ROW($C$7)+1)),ROWS(E$5:E10))))","v":"Officena"},{"$f":"IF(ROWS(F$5:F10)>COUNTIF(Payments!$C$2:$C$100,$B$2),\"\",INDEX(Payments!E$2:E$100,SMALL(IF(Payments!$C$2:$C$100<>\"\",IF(Payments!$C$2:$C$100=$B$2,ROW($C$7:$C$105)-ROW($C$7)+1)),ROWS(F$5:F10))))","v":"1902-09-27"},{"$f":"IF(ROWS(G$5:G10)>COUNTIF(Payments!$C$2:$C$100,$B$2),\"\",INDEX(Payments!F$2:F$100,SMALL(IF(Payments!$C$2:$C$100<>\"\",IF(Payments!$C$2:$C$100=$B$2,ROW($C$7:$C$105)-ROW($C$7)+1)),ROWS(G$5:G10))))","v":"المسبح"}]
[null,{"$f":"IF(C11=\"\",\"\",MAX($B$4:B10)+1)","v":""},{"$f":"IF(ROWS(C$5:C11)>COUNTIF(Payments!$C$2:$C$100,$B$2),\"\",INDEX(Payments!B$2:B$100,SMALL(IF(Payments!$C$2:$C$100<>\"\",IF(Payments!$C$2:$C$100=$B$2,ROW($C$7:$C$105)-ROW($C$7)+1)),ROWS(C$5:C11))))","v":""},{"$f":"IF(ROWS(D$5:D11)>COUNTIF(Payments!$C$2:$C$100,$B$2),\"\",INDEX(Payments!C$2:C$100,SMALL(IF(Payments!$C$2:$C$100<>\"\",IF(Payments!$C$2:$C$100=$B$2,ROW($C$7:$C$105)-ROW($C$7)+1)),ROWS(D$5:D11))))","v":""},{"$f":"IF(ROWS(E$5:E11)>COUNTIF(Payments!$C$2:$C$100,$B$2),\"\",INDEX(Payments!D$2:D$100,SMALL(IF(Payments!$C$2:$C$100<>\"\",IF(Payments!$C$2:$C$100=$B$2,ROW($C$7:$C$105)-ROW($C$7)+1)),ROWS(E$5:E11))))","v":""},{"$f":"IF(ROWS(F$5:F11)>COUNTIF(Payments!$C$2:$C$100,$B$2),\"\",INDEX(Payments!E$2:E$100,SMALL(IF(Payments!$C$2:$C$100<>\"\",IF(Payments!$C$2:$C$100=$B$2,ROW($C$7:$C$105)-ROW($C$7)+1)),ROWS(F$5:F11))))","v":""},{"$f":"IF(ROWS(G$5:G11)>COUNTIF(Payments!$C$2:$C$100,$B$2),\"\",INDEX(Payments!F$2:F$100,SMALL(IF(Payments!$C$2:$C$100<>\"\",IF(Payments!$C$2:$C$100=$B$2,ROW($C$7:$C$105)-ROW($C$7)+1)),ROWS(G$5:G11))))","v":""}]
[null,{"$f":"IF(C12=\"\",\"\",MAX($B$4:B11)+1)","v":""},{"$f":"IF(ROWS(C$5:C12)>COUNTIF(Payments!$C$2:$C$100,$B$2),\"\",INDEX(Payments!B$2:B$100,SMALL(IF(Payments!$C$2:$C$100<>\"\",IF(Payments!$C$2:$C$100=$B$2,ROW($C$7:$C$105)-ROW($C$7)+1)),ROWS(C$5:C12))))","v":""},{"$f":"IF(ROWS(D$5:D12)>COUNTIF(Payments!$C$2:$C$100,$B$2),\"\",INDEX(Payments!C$2:C$100,SMALL(IF(Payments!$C$2:$C$100<>\"\",IF(Payments!$C$2:$C$100=$B$2,ROW($C$7:$C$105)-ROW($C$7)+1)),ROWS(D$5:D12))))","v":""},{"$f":"IF(ROWS(E$5:E12)>COUNTIF(Payments!$C$2:$C$100,$B$2),\"\",INDEX(Payments!D$2:D$100,SMALL(IF(Payments!$C$2:$C$100<>\"\",IF(Payments!$C$2:$C$100=$B$2,ROW($C$7:$C$105)-ROW($C$7)+1)),ROWS(E$5:E12))))","v":""},{"$f":"IF(ROWS(F$5:F12)>COUNTIF(Payments!$C$2:$C$100,$B$2),\"\",INDEX(Payments!E$2:E$100,SMALL(IF(Payments!$C$2:$C$100<>\"\",IF(Payments!$C$2:$C$100=$B$2,ROW($C$7:$C$105)-ROW($C$7)+1)),ROWS(F$5:F12))))","v":""},{"$f":"IF(ROWS(G$5:G12)>COUNTIF(Payments!$C$2:$C$100,$B$2),\"\",INDEX(Payments!F$2:F$100,SMALL(IF(Payments!$C$2:$C$100<>\"\",IF(Payments!$C$2:$C$100=$B$2,ROW($C$7:$C$105)-ROW($C$7)+1)),ROWS(G$5:G12))))","v":""}]
[null,{"$f":"IF(C13=\"\",\"\",MAX($B$4:B12)+1)","v":""},{"$f":"IF(ROWS(C$5:C13)>COUNTIF(Payments!$C$2:$C$100,$B$2),\"\",INDEX(Payments!B$2:B$100,SMALL(IF(Payments!$C$2:$C$100<>\"\",IF(Payments!$C$2:$C$100=$B$2,ROW($C$7:$C$105)-ROW($C$7)+1)),ROWS(C$5:C13))))","v":""},{"$f":"IF(ROWS(D$5:D13)>COUNTIF(Payments!$C$2:$C$100,$B$2),\"\",INDEX(Payments!C$2:C$100,SMALL(IF(Payments!$C$2:$C$100<>\"\",IF(Payments!$C$2:$C$100=$B$2,ROW($C$7:$C$105)-ROW($C$7)+1)),ROWS(D$5:D13))))","v":""},{"$f":"IF(ROWS(E$5:E13)>COUNTIF(Payments!$C$2:$C$100,$B$2),\"\",INDEX(Payments!D$2:D$100,SMALL(IF(Payments!$C$2:$C$100<>\"\",IF(Payments!$C$2:$C$100=$B$2,ROW($C$7:$C$105)-ROW($C$7)+1)),ROWS(E$5:E13))))","v":""},{"$f":"IF(ROWS(F$5:F13)>COUNTIF(Payments!$C$2:$C$100,$B$2),\"\",INDEX(Payments!E$2:E$100,SMALL(IF(Payments!$C$2:$C$100<>\"\",IF(Payments!$C$2:$C$100=$B$2,ROW($C$7:$C$105)-ROW($C$7)+1)),ROWS(F$5:F13))))","v":""},{"$f":"IF(ROWS(G$5:G13)>COUNTIF(Payments!$C$2:$C$100,$B$2),\"\",INDEX(Payments!F$2:F$100,SMALL(IF(Payments!$C$2:$C$100<>\"\",IF(Payments!$C$2:$C$100=$B$2,ROW($C$7:$C$105)-ROW($C$7)+1)),ROWS(G$5:G13))))","v":""}]
[null,{"$f":"IF(C14=\"\",\"\",MAX($B$4:B13)+1)","v":""},{"$f":"IF(ROWS(C$5:C14)>COUNTIF(Payments!$C$2:$C$100,$B$2),\"\",INDEX(Payments!B$2:B$100,SMALL(IF(Payments!$C$2:$C$100<>\"\",IF(Payments!$C$2:$C$100=$B$2,ROW($C$7:$C$105)-ROW($C$7)+1)),ROWS(C$5:C14))))","v":""},{"$f":"IF(ROWS(D$5:D14)>COUNTIF(Payments!$C$2:$C$100,$B$2),\"\",INDEX(Payments!C$2:C$100,SMALL(IF(Payments!$C$2:$C$100<>\"\",IF(Payments!$C$2:$C$100=$B$2,ROW($C$7:$C$105)-ROW($C$7)+1)),ROWS(D$5:D14))))","v":""},{"$f":"IF(ROWS(E$5:E14)>COUNTIF(Payments!$C$2:$C$100,$B$2),\"\",INDEX(Payments!D$2:D$100,SMALL(IF(Payments!$C$2:$C$100<>\"\",IF(Payments!$C$2:$C$100=$B$2,ROW($C$7:$C$105)-ROW($C$7)+1)),ROWS(E$5:E14))))","v":""},{"$f":"IF(ROWS(F$5:F14)>COUNTIF(Payments!$C$2:$C$100,$B$2),\"\",INDEX(Payments!E$2:E$100,SMALL(IF(Payments!$C$2:$C$100<>\"\",IF(Payments!$C$2:$C$100=$B$2,ROW($C$7:$C$105)-ROW($C$7)+1)),ROWS(F$5:F14))))","v":""},{"$f":"IF(ROWS(G$5:G14)>COUNTIF(Payments!$C$2:$C$100,$B$2),\"\",INDEX(Payments!F$2:F$100,SMALL(IF(Payments!$C$2:$C$100<>\"\",IF(Payments!$C$2:$C$100=$B$2,ROW($C$7:$C$105)-ROW($C$7)+1)),ROWS(G$5:G14))))","v":""}]
[null,{"$f":"IF(C15=\"\",\"\",MAX($B$4:B14)+1)","v":""},{"$f":"IF(ROWS(C$5:C15)>COUNTIF(Payments!$C$2:$C$100,$B$2),\"\",INDEX(Payments!B$2:B$100,SMALL(IF(Payments!$C$2:$C$100<>\"\",IF(Payments!$C$2:$C$100=$B$2,ROW($C$7:$C$105)-ROW($C$7)+1)),ROWS(C$5:C15))))","v":""},{"$f":"IF(ROWS(D$5:D15)>COUNTIF(Payments!$C$2:$C$100,$B$2),\"\",INDEX(Payments!C$2:C$100,SMALL(IF(Payments!$C$2:$C$100<>\"\",IF(Payments!$C$2:$C$100=$B$2,ROW($C$7:$C$105)-ROW($C$7)+1)),ROWS(D$5:D15))))","v":""},{"$f":"IF(ROWS(E$5:E15)>COUNTIF(Payments!$C$2:$C$100,$B$2),\"\",INDEX(Payments!D$2:D$100,SMALL(IF(Payments!$C$2:$C$100<>\"\",IF(Payments!$C$2:$C$100=$B$2,ROW($C$7:$C$105)-ROW($C$7)+1)),ROWS(E$5:E15))))","v":""},{"$f":"IF(ROWS(F$5:F15)>COUNTIF(Payments!$C$2:$C$100,$B$2),\"\",INDEX(Payments!E$2:E$100,SMALL(IF(Payments!$C$2:$C$100<>\"\",IF(Payments!$C$2:$C$100=$B$2,ROW($C$7:$C$105)-ROW($C$7)+1)),ROWS(F$5:F15))))","v":""},{"$f":"IF(ROWS(G$5:G15)>COUNTIF(Payments!$C$2:$C$100,$B$2),\"\",INDEX(Payments!F$2:F$100,SMALL(IF(Payments!$C$2:$C$100<>\"\",IF(Payments!$C$2:$C$100=$B$2,ROW($C$7:$C$105)-ROW($C$7)+1)),ROWS(G$5:G15))))","v":""}]
[null,{"$f":"IF(C16=\"\",\"\",MAX($B$4:B15)+1)","v":""},{"$f":"IF(ROWS(C$5:C16)>COUNTIF(Payments!$C$2:$C$100,$B$2),\"\",INDEX(Payments!B$2:B$100,SMALL(IF(Payments!$C$2:$C$100<>\"\",IF(Payments!$C$2:$C$100=$B$2,ROW($C$7:$C$105)-ROW($C$7)+1)),ROWS(C$5:C16))))","v":""},{"$f":"IF(ROWS(D$5:D16)>COUNTIF(Payments!$C$2:$C$100,$B$2),\"\",INDEX(Payments!C$2:C$100,SMALL(IF(Payments!$C$2:$C$100<>\"\",IF(Payments!$C$2:$C$100=$B$2,ROW($C$7:$C$105)-ROW($C$7)+1)),ROWS(D$5:D16))))","v":""},{"$f":"IF(ROWS(E$5:E16)>COUNTIF(Payments!$C$2:$C$100,$B$2),\"\",INDEX(Payments!D$2:D$100,SMALL(IF(Payments!$C$2:$C$100<>\"\",IF(Payments!$C$2:$C$100=$B$2,ROW($C$7:$C$105)-ROW($C$7)+1)),ROWS(E$5:E16))))","v":""},{"$f":"IF(ROWS(F$5:F16)>COUNTIF(Payments!$C$2:$C$100,$B$2),\"\",INDEX(Payments!E$2:E$100,SMALL(IF(Payments!$C$2:$C$100<>\"\",IF(Payments!$C$2:$C$100=$B$2,ROW($C$7:$C$105)-ROW($C$7)+1)),ROWS(F$5:F16))))","v":""},{"$f":"IF(ROWS(G$5:G16)>COUNTIF(Payments!$C$2:$C$100,$B$2),\"\",INDEX(Payments!F$2:F$100,SMALL(IF(Payments!$C$2:$C$100<>\"\",IF(Payments!$C$2:$C$100=$B$2,ROW($C$7:$C$105)-ROW($C$7)+1)),ROWS(G$5:G16))))","v":""}]
[null,{"$f":"IF(C17=\"\",\"\",MAX($B$4:B16)+1)","v":""},{"$f":"IF(ROWS(C$5:C17)>COUNTIF(Payments!$C$2:$C$100,$B$2),\"\",INDEX(Payments!B$2:B$100,SMALL(IF(Payments!$C$2:$C$100<>\"\",IF(Payments!$C$2:$C$100=$B$2,ROW($C$7:$C$105)-ROW($C$7)+1)),ROWS(C$5:C17))))","v":""},{"$f":"IF(ROWS(D$5:D17)>COUNTIF(Payments!$C$2:$C$100,$B$2),\"\",INDEX(Payments!C$2:C$100,SMALL(IF(Payments!$C$2:$C$100<>\"\",IF(Payments!$C$2:$C$100=$B$2,ROW($C$7:$C$105)-ROW($C$7)+1)),ROWS(D$5:D17))))","v":""},{"$f":"IF(ROWS(E$5:E17)>COUNTIF(Payments!$C$2:$C$100,$B$2),\"\",INDEX(Payments!D$2:D$100,SMALL(IF(Payments!$C$2:$C$100<>\"\",IF(Payments!$C$2:$C$100=$B$2,ROW($C$7:$C$105)-ROW($C$7)+1)),ROWS(E$5:E17))))","v":""},{"$f":"IF(ROWS(F$5:F17)>COUNTIF(Payments!$C$2:$C$100,$B$2),\"\",INDEX(Payments!E$2:E$100,SMALL(IF(Payments!$C$2:$C$100<>\"\",IF(Payments!$C$2:$C$100=$B$2,ROW($C$7:$C$105)-ROW($C$7)+1)),ROWS(F$5:F17))))","v":""},{"$f":"IF(ROWS(G$5:G17)>COUNTIF(Payments!$C$2:$C$100,$B$2),\"\",INDEX(Payments!F$2:F$100,SMALL(IF(Payments!$C$2:$C$100<>\"\",IF(Payments!$C$2:$C$100=$B$2,ROW($C$7:$C$105)-ROW($C$7)+1)),ROWS(G$5:G17))))","v":""}]
[null,{"$f":"IF(C18=\"\",\"\",MAX($B$4:B17)+1)","v":""},{"$f":"IF(ROWS(C$5:C18)>COUNTIF(Payments!$C$2:$C$100,$B$2),\"\",INDEX(Payments!B$2:B$100,SMALL(IF(Payments!$C$2:$C$100<>\"\",IF(Payments!$C$2:$C$100=$B$2,ROW($C$7:$C$105)-ROW($C$7)+1)),ROWS(C$5:C18))))","v":""},{"$f":"IF(ROWS(D$5:D18)>COUNTIF(Payments!$C$2:$C$100,$B$2),\"\",INDEX(Payments!C$2:C$100,SMALL(IF(Payments!$C$2:$C$100<>\"\",IF(Payments!$C$2:$C$100=$B$2,ROW($C$7:$C$105)-ROW($C$7)+1)),ROWS(D$5:D18))))","v":""},{"$f":"IF(ROWS(E$5:E18)>COUNTIF(Payments!$C$2:$C$100,$B$2),\"\",INDEX(Payments!D$2:D$100,SMALL(IF(Payments!$C$2:$C$100<>\"\",IF(Payments!$C$2:$C$100=$B$2,ROW($C$7:$C$105)-ROW($C$7)+1)),ROWS(E$5:E18))))","v":""},{"$f":"IF(ROWS(F$5:F18)>COUNTIF(Payments!$C$2:$C$100,$B$2),\"\",INDEX(Payments!E$2:E$100,SMALL(IF(Payments!$C$2:$C$100<>\"\",IF(Payments!$C$2:$C$100=$B$2,ROW($C$7:$C$105)-ROW($C$7)+1)),ROWS(F$5:F18))))","v":""},{"$f":"IF(ROWS(G$5:G18)>COUNTIF(Payments!$C$2:$C$100,$B$2),\"\",INDEX(Payments!F$2:F$100,SMALL(IF(Payments!$C$2:$C$100<>\"\",IF(Payments!$C$2:$C$100=$B$2,ROW($C$7:$C$105)-ROW($C$7)+1)),ROWS(G$5:G18))))","v":""}]
[null,{"$f":"IF(C19=\"\",\"\",MAX($B$4:B18)+1)","v":""},{"$f":"IF(ROWS(C$5:C19)>COUNTIF(Payments!$C$2:$C$100,$B$2),\"\",INDEX(Payments!B$2:B$100,SMALL(IF(Payments!$C$2:$C$100<>\"\",IF(Payments!$C$2:$C$100=$B$2,ROW($C$7:$C$105)-ROW($C$7)+1)),ROWS(C$5:C19))))","v":""},{"$f":"IF(ROWS(D$5:D19)>COUNTIF(Payments!$C$2:$C$100,$B$2),\"\",INDEX(Payments!C$2:C$100,SMALL(IF(Payments!$C$2:$C$100<>\"\",IF(Payments!$C$2:$C$100=$B$2,ROW($C$7:$C$105)-ROW($C$7)+1)),ROWS(D$5:D19))))","v":""},{"$f":"IF(ROWS(E$5:E19)>COUNTIF(Payments!$C$2:$C$100,$B$2),\"\",INDEX(Payments!D$2:D$100,SMALL(IF(Payments!$C$2:$C$100<>\"\",IF(Payments!$C$2:$C$100=$B$2,ROW($C$7:$C$105)-ROW($C$7)+1)),ROWS(E$5:E19))))","v":""},{"$f":"IF(ROWS(F$5:F19)>COUNTIF(Payments!$C$2:$C$100,$B$2),\"\",INDEX(Payments!E$2:E$100,SMALL(IF(Payments!$C$2:$C$100<>\"\",IF(Payments!$C$2:$C$100=$B$2,ROW($C$7:$C$105)-ROW($C$7)+1)),ROWS(F$5:F19))))","v":""},{"$f":"IF(ROWS(G$5:G19)>COUNTIF(Payments!$C$2:$C$100,$B$2),\"\",INDEX(Payments!F$2:F$100,SMALL(IF(Payments!$C$2:$C$100<>\"\",IF(Payments!$C$2:$C$100=$B$2,ROW($C$7:$C$105)-ROW($C$7)+1)),ROWS(G$5:G19))))","v":""}]
[null,{"$f":"IF(C20=\"\",\"\",MAX($B$4:B19)+1)","v":""},{"$f":"IF(ROWS(C$5:C20)>COUNTIF(Payments!$C$2:$C$100,$B$2),\"\",INDEX(Payments!B$2:B$100,SMALL(IF(Payments!$C$2:$C$100<>\"\",IF(Payments!$C$2:$C$100=$B$2,ROW($C$7:$C$105)-ROW($C$7)+1)),ROWS(C$5:C20))))","v":""},{"$f":"IF(ROWS(D$5:D20)>COUNTIF(Payments!$C$2:$C$100,$B$2),\"\",INDEX(Payments!C$2:C$100,SMALL(IF(Payments!$C$2:$C$100<>\"\",IF(Payments!$C$2:$C$100=$B$2,ROW($C$7:$C$105)-ROW($C$7)+1)),ROWS(D$5:D20))))","v":""},{"$f":"IF(ROWS(E$5:E20)>COUNTIF(Payments!$C$2:$C$100,$B$2),\"\",INDEX(Payments!D$2:D$100,SMALL(IF(Payments!$C$2:$C$100<>\"\",IF(Payments!$C$2:$C$100=$B$2,ROW($C$7:$C$105)-ROW($C$7)+1)),ROWS(E$5:E20))))","v":""},{"$f":"IF(ROWS(F$5:F20)>COUNTIF(Payments!$C$2:$C$100,$B$2),\"\",INDEX(Payments!E$2:E$100,SMALL(IF(Payments!$C$2:$C$100<>\"\",IF(Payments!$C$2:$C$100=$B$2,ROW($C$7:$C$105)-ROW($C$7)+1)),ROWS(F$5:F20))))","v":""},{"$f":"IF(ROWS(G$5:G20)>COUNTIF(Payments!$C$2:$C$100,$B$2),\"\",INDEX(Payments!F$2:F$100,SMALL(IF(Payments!$C$2:$C$100<>\"\",IF(Payments!$C$2:$C$100=$B$2,ROW($C$7:$C$105)-ROW($C$7)+1)),ROWS(G$5:G20))))","v":""}]
[null,{"$f":"IF(C21=\"\",\"\",MAX($B$4:B20)+1)","v":""},{"$f":"IF(ROWS(C$5:C21)>COUNTIF(Payments!$C$2:$C$100,$B$2),\"\",INDEX(Payments!B$2:B$100,SMALL(IF(Payments!$C$2:$C$100<>\"\",IF(Payments!$C$2:$C$100=$B$2,ROW($C$7:$C$105)-ROW($C$7)+1)),ROWS(C$5:C21))))","v":""},{"$f":"IF(ROWS(D$5:D21)>COUNTIF(Payments!$C$2:$C$100,$B$2),\"\",INDEX(Payments!C$2:C$100,SMALL(IF(Payments!$C$2:$C$100<>\"\",IF(Payments!$C$2:$C$100=$B$2,ROW($C$7:$C$105)-ROW($C$7)+1)),ROWS(D$5:D21))))","v":""},{"$f":"IF(ROWS(E$5:E21)>COUNTIF(Payments!$C$2:$C$100,$B$2),\"\",INDEX(Payments!D$2:D$100,SMALL(IF(Payments!$C$2:$C$100<>\"\",IF(Payments!$C$2:$C$100=$B$2,ROW($C$7:$C$105)-ROW($C$7)+1)),ROWS(E$5:E21))))","v":""},{"$f":"IF(ROWS(F$5:F21)>COUNTIF(Payments!$C$2:$C$100,$B$2),\"\",INDEX(Payments!E$2:E$100,SMALL(IF(Payments!$C$2:$C$100<>\"\",IF(Payments!$C$2:$C$100=$B$2,ROW($C$7:$C$105)-ROW($C$7)+1)),ROWS(F$5:F21))))","v":""},{"$f":"IF(ROWS(G$5:G21)>COUNTIF(Payments!$C$2:$C$100,$B$2),\"\",INDEX(Payments!F$2:F$100,SMALL(IF(Payments!$C$2:$C$100<>\"\",IF(Payments!$C$2:$C$100=$B$2,ROW($C$7:$C$105)-ROW($C$7)+1)),ROWS(G$5:G21))))","v":""}]
[null,{"$f":"IF(C22=\"\",\"\",MAX($B$4:B21)+1)","v":""},{"$f":"IF(ROWS(C$5:C22)>COUNTIF(Payments!$C$2:$C$100,$B$2),\"\",INDEX(Payments!B$2:B$100,SMALL(IF(Payments!$C$2:$C$100<>\"\",IF(Payments!$C$2:$C$100=$B$2,ROW($C$7:$C$105)-ROW($C$7)+1)),ROWS(C$5:C22))))","v":""},{"$f":"IF(ROWS(D$5:D22)>COUNTIF(Payments!$C$2:$C$100,$B$2),\"\",INDEX(Payments!C$2:C$100,SMALL(IF(Payments!$C$2:$C$100<>\"\",IF(Payments!$C$2:$C$100=$B$2,ROW($C$7:$C$105)-ROW($C$7)+1)),ROWS(D$5:D22))))","v":""},{"$f":"IF(ROWS(E$5:E22)>COUNTIF(Payments!$C$2:$C$100,$B$2),\"\",INDEX(Payments!D$2:D$100,SMALL(IF(Payments!$C$2:$C$100<>\"\",IF(Payments!$C$2:$C$100=$B$2,ROW($C$7:$C$105)-ROW($C$7)+1)),ROWS(E$5:E22))))","v":""},{"$f":"IF(ROWS(F$5:F22)>COUNTIF(Payments!$C$2:$C$100,$B$2),\"\",INDEX(Payments!E$2:E$100,SMALL(IF(Payments!$C$2:$C$100<>\"\",IF(Payments!$C$2:$C$100=$B$2,ROW($C$7:$C$105)-ROW($C$7)+1)),ROWS(F$5:F22))))","v":""},{"$f":"IF(ROWS(G$5:G22)>COUNTIF(Payments!$C$2:$C$100,$B$2),\"\",INDEX(Payments!F$2:F$100,SMALL(IF(Payments!$C$2:$C$100<>\"\",IF(Payments!$C$2:$C$100=$B$2,ROW($C$7:$C$105)-ROW($C$7)+1)),ROWS(G$5:G22))))","v":""}]
[null,{"$f":"IF(C23=\"\",\"\",MAX($B$4:B22)+1)","v":""},{"$f":"IF(ROWS(C$5:C23)>COUNTIF(Payments!$C$2:$C$100,$B$2),\"\",INDEX(Payments!B$2:B$100,SMALL(IF(Payments!$C$2:$C$100<>\"\",IF(Payments!$C$2:$C$100=$B$2,ROW($C$7:$C$105)-ROW($C$7)+1)),ROWS(C$5:C23))))","v":""},{"$f":"IF(ROWS(D$5:D23)>COUNTIF(Payments!$C$2:$C$100,$B$2),\"\",INDEX(Payments!C$2:C$100,SMALL(IF(Payments!$C$2:$C$100<>\"\",IF(Payments!$C$2:$C$100=$B$2,ROW($C$7:$C$105)-ROW($C$7)+1)),ROWS(D$5:D23))))","v":""},{"$f":"IF(ROWS(E$5:E23)>COUNTIF(Payments!$C$2:$C$100,$B$2),\"\",INDEX(Payments!D$2:D$100,SMALL(IF(Payments!$C$2:$C$100<>\"\",IF(Payments!$C$2:$C$100=$B$2,ROW($C$7:$C$105)-ROW($C$7)+1)),ROWS(E$5:E23))))","v":""},{"$f":"IF(ROWS(F$5:F23)>COUNTIF(Payments!$C$2:$C$100,$B$2),\"\",INDEX(Payments!E$2:E$100,SMALL(IF(Payments!$C$2:$C$100<>\"\",IF(Payments!$C$2:$C$100=$B$2,ROW($C$7:$C$105)-ROW($C$7)+1)),ROWS(F$5:F23))))","v":""},{"$f":"IF(ROWS(G$5:G23)>COUNTIF(Payments!$C$2:$C$100,$B$2),\"\",INDEX(Payments!F$2:F$100,SMALL(IF(Payments!$C$2:$C$100<>\"\",IF(Payments!$C$2:$C$100=$B$2,ROW($C$7:$C$105)-ROW($C$7)+1)),ROWS(G$5:G23))))","v":""}]
[null,{"$f":"IF(C24=\"\",\"\",MAX($B$4:B23)+1)","v":""},{"$f":"IF(ROWS(C$5:C24)>COUNTIF(Payments!$C$2:$C$100,$B$2),\"\",INDEX(Payments!B$2:B$100,SMALL(IF(Payments!$C$2:$C$100<>\"\",IF(Payments!$C$2:$C$100=$B$2,ROW($C$7:$C$105)-ROW($C$7)+1)),ROWS(C$5:C24))))","v":""},{"$f":"IF(ROWS(D$5:D24)>COUNTIF(Payments!$C$2:$C$100,$B$2),\"\",INDEX(Payments!C$2:C$100,SMALL(IF(Payments!$C$2:$C$100<>\"\",IF(Payments!$C$2:$C$100=$B$2,ROW($C$7:$C$105)-ROW($C$7)+1)),ROWS(D$5:D24))))","v":""},{"$f":"IF(ROWS(E$5:E24)>COUNTIF(Payments!$C$2:$C$100,$B$2),\"\",INDEX(Payments!D$2:D$100,SMALL(IF(Payments!$C$2:$C$100<>\"\",IF(Payments!$C$2:$C$100=$B$2,ROW($C$7:$C$105)-ROW($C$7)+1)),ROWS(E$5:E24))))","v":""},{"$f":"IF(ROWS(F$5:F24)>COUNTIF(Payments!$C$2:$C$100,$B$2),\"\",INDEX(Payments!E$2:E$100,SMALL(IF(Payments!$C$2:$C$100<>\"\",IF(Payments!$C$2:$C$100=$B$2,ROW($C$7:$C$105)-ROW($C$7)+1)),ROWS(F$5:F24))))","v":""},{"$f":"IF(ROWS(G$5:G24)>COUNTIF(Payments!$C$2:$C$100,$B$2),\"\",INDEX(Payments!F$2:F$100,SMALL(IF(Payments!$C$2:$C$100<>\"\",IF(Payments!$C$2:$C$100=$B$2,ROW($C$7:$C$105)-ROW($C$7)+1)),ROWS(G$5:G24))))","v":""}]
[null,{"$f":"IF(C25=\"\",\"\",MAX($B$4:B24)+1)","v":""},{"$f":"IF(ROWS(C$5:C25)>COUNTIF(Payments!$C$2:$C$100,$B$2),\"\",INDEX(Payments!B$2:B$100,SMALL(IF(Payments!$C$2:$C$100<>\"\",IF(Payments!$C$2:$C$100=$B$2,ROW($C$7:$C$105)-ROW($C$7)+1)),ROWS(C$5:C25))))","v":""},{"$f":"IF(ROWS(D$5:D25)>COUNTIF(Payments!$C$2:$C$100,$B$2),\"\",INDEX(Payments!C$2:C$100,SMALL(IF(Payments!$C$2:$C$100<>\"\",IF(Payments!$C$2:$C$100=$B$2,ROW($C$7:$C$105)-ROW($C$7)+1)),ROWS(D$5:D25))))","v":""},{"$f":"IF(ROWS(E$5:E25)>COUNTIF(Payments!$C$2:$C$100,$B$2),\"\",INDEX(Payments!D$2:D$100,SMALL(IF(Payments!$C$2:$C$100<>\"\",IF(Payments!$C$2:$C$100=$B$2,ROW($C$7:$C$105)-ROW($C$7)+1)),ROWS(E$5:E25))))","v":""},{"$f":"IF(ROWS(F$5:F25)>COUNTIF(Payments!$C$2:$C$100,$B$2),\"\",INDEX(Payments!E$2:E$100,SMALL(IF(Payments!$C$2:$C$100<>\"\",IF(Payments!$C$2:$C$100=$B$2,ROW($C$7:$C$105)-ROW($C$7)+1)),ROWS(F$5:F25))))","v":""},{"$f":"IF(ROWS(G$5:G25)>COUNTIF(Payments!$C$2:$C$100,$B$2),\"\",INDEX(Payments!F$2:F$100,SMALL(IF(Payments!$C$2:$C$100<>\"\",IF(Payments!$C$2:$C$100=$B$2,ROW($C$7:$C$105)-ROW($C$7)+1)),ROWS(G$5:G25))))","v":""}]
[null,{"$f":"IF(C26=\"\",\"\",MAX($B$4:B25)+1)","v":""},{"$f":"IF(ROWS(C$5:C26)>COUNTIF(Payments!$C$2:$C$100,$B$2),\"\",INDEX(Payments!B$2:B$100,SMALL(IF(Payments!$C$2:$C$100<>\"\",IF(Payments!$C$2:$C$100=$B$2,ROW($C$7:$C$105)-ROW($C$7)+1)),ROWS(C$5:C26))))","v":""},{"$f":"IF(ROWS(D$5:D26)>COUNTIF(Payments!$C$2:$C$100,$B$2),\"\",INDEX(Payments!C$2:C$100,SMALL(IF(Payments!$C$2:$C$100<>\"\",IF(Payments!$C$2:$C$100=$B$2,ROW($C$7:$C$105)-ROW($C$7)+1)),ROWS(D$5:D26))))","v":""},{"$f":"IF(ROWS(E$5:E26)>COUNTIF(Payments!$C$2:$C$100,$B$2),\"\",INDEX(Payments!D$2:D$100,SMALL(IF(Payments!$C$2:$C$100<>\"\",IF(Payments!$C$2:$C$100=$B$2,ROW($C$7:$C$105)-ROW($C$7)+1)),ROWS(E$5:E26))))","v":""},{"$f":"IF(ROWS(F$5:F26)>COUNTIF(Payments!$C$2:$C$100,$B$2),\"\",INDEX(Payments!E$2:E$100,SMALL(IF(Payments!$C$2:$C$100<>\"\",IF(Payments!$C$2:$C$100=$B$2,ROW($C$7:$C$105)-ROW($C$7)+1)),ROWS(F$5:F26))))","v":""},{"$f":"IF(ROWS(G$5:G26)>COUNTIF(Payments!$C$2:$C$100,$B$2),\"\",INDEX(Payments!F$2:F$100,SMALL(IF(Payments!$C$2:$C$100<>\"\",IF(Payments!$C$2:$C$100=$B$2,ROW($C$7:$C$105)-ROW($C$7)+1)),ROWS(G$5:G26))))","v":""}]
[null,{"$f":"IF(C27=\"\",\"\",MAX($B$4:B26)+1)","v":""},{"$f":"IF(ROWS(C$5:C27)>COUNTIF(Payments!$C$2:$C$100,$B$2),\"\",INDEX(Payments!B$2:B$100,SMALL(IF(Payments!$C$2:$C$100<>\"\",IF(Payments!$C$2:$C$100=$B$2,ROW($C$7:$C$105)-ROW($C$7)+1)),ROWS(C$5:C27))))","v":""},{"$f":"IF(ROWS(D$5:D27)>COUNTIF(Payments!$C$2:$C$100,$B$2),\"\",INDEX(Payments!C$2:C$100,SMALL(IF(Payments!$C$2:$C$100<>\"\",IF(Payments!$C$2:$C$100=$B$2,ROW($C$7:$C$105)-ROW($C$7)+1)),ROWS(D$5:D27))))","v":""},{"$f":"IF(ROWS(E$5:E27)>COUNTIF(Payments!$C$2:$C$100,$B$2),\"\",INDEX(Payments!D$2:D$100,SMALL(IF(Payments!$C$2:$C$100<>\"\",IF(Payments!$C$2:$C$100=$B$2,ROW($C$7:$C$105)-ROW($C$7)+1)),ROWS(E$5:E27))))","v":""},{"$f":"IF(ROWS(F$5:F27)>COUNTIF(Payments!$C$2:$C$100,$B$2),\"\",INDEX(Payments!E$2:E$100,SMALL(IF(Payments!$C$2:$C$100<>\"\",IF(Payments!$C$2:$C$100=$B$2,ROW($C$7:$C$105)-ROW($C$7)+1)),ROWS(F$5:F27))))","v":""},{"$f":"IF(ROWS(G$5:G27)>COUNTIF(Payments!$C$2:$C$100,$B$2),\"\",INDEX(Payments!F$2:F$100,SMALL(IF(Payments!$C$2:$C$100<>\"\",IF(Payments!$C$2:$C$100=$B$2,ROW($C$7:$C$105)-ROW($C$7)+1)),ROWS(G$5:G27))))","v":""}]
[null,{"$f":"IF(C28=\"\",\"\",MAX($B$4:B27)+1)","v":""},{"$f":"IF(ROWS(C$5:C28)>COUNTIF(Payments!$C$2:$C$100,$B$2),\"\",INDEX(Payments!B$2:B$100,SMALL(IF(Payments!$C$2:$C$100<>\"\",IF(Payments!$C$2:$C$100=$B$2,ROW($C$7:$C$105)-ROW($C$7)+1)),ROWS(C$5:C28))))","v":""},{"$f":"IF(ROWS(D$5:D28)>COUNTIF(Payments!$C$2:$C$100,$B$2),\"\",INDEX(Payments!C$2:C$100,SMALL(IF(Payments!$C$2:$C$100<>\"\",IF(Payments!$C$2:$C$100=$B$2,ROW($C$7:$C$105)-ROW($C$7)+1)),ROWS(D$5:D28))))","v":""},{"$f":"IF(ROWS(E$5:E28)>COUNTIF(Payments!$C$2:$C$100,$B$2),\"\",INDEX(Payments!D$2:D$100,SMALL(IF(Payments!$C$2:$C$100<>\"\",IF(Payments!$C$2:$C$100=$B$2,ROW($C$7:$C$105)-ROW($C$7)+1)),ROWS(E$5:E28))))","v":""},{"$f":"IF(ROWS(F$5:F28)>COUNTIF(Payments!$C$2:$C$100,$B$2),\"\",INDEX(Payments!E$2:E$100,SMALL(IF(Payments!$C$2:$C$100<>\"\",IF(Payments!$C$2:$C$100=$B$2,ROW($C$7:$C$105)-ROW($C$7)+1)),ROWS(F$5:F28))))","v":""},{"$f":"IF(ROWS(G$5:G28)>COUNTIF(Payments!$C$2:$C$100,$B$2),\"\",INDEX(Payments!F$2:F$100,SMALL(IF(Payments!$C$2:$C$100<>\"\",IF(Payments!$C$2:$C$100=$B$2,ROW($C$7:$C$105)-ROW($C$7)+1)),ROWS(G$5:G28))))","v":""}]
[null,{"$f":"IF(C29=\"\",\"\",MAX($B$4:B28)+1)","v":""},{"$f":"IF(ROWS(C$5:C29)>COUNTIF(Payments!$C$2:$C$100,$B$2),\"\",INDEX(Payments!B$2:B$100,SMALL(IF(Payments!$C$2:$C$100<>\"\",IF(Payments!$C$2:$C$100=$B$2,ROW($C$7:$C$105)-ROW($C$7)+1)),ROWS(C$5:C29))))","v":""},{"$f":"IF(ROWS(D$5:D29)>COUNTIF(Payments!$C$2:$C$100,$B$2),\"\",INDEX(Payments!C$2:C$100,SMALL(IF(Payments!$C$2:$C$100<>\"\",IF(Payments!$C$2:$C$100=$B$2,ROW($C$7:$C$105)-ROW($C$7)+1)),ROWS(D$5:D29))))","v":""},{"$f":"IF(ROWS(E$5:E29)>COUNTIF(Payments!$C$2:$C$100,$B$2),\"\",INDEX(Payments!D$2:D$100,SMALL(IF(Payments!$C$2:$C$100<>\"\",IF(Payments!$C$2:$C$100=$B$2,ROW($C$7:$C$105)-ROW($C$7)+1)),ROWS(E$5:E29))))","v":""},{"$f":"IF(ROWS(F$5:F29)>COUNTIF(Payments!$C$2:$C$100,$B$2),\"\",INDEX(Payments!E$2:E$100,SMALL(IF(Payments!$C$2:$C$100<>\"\",IF(Payments!$C$2:$C$100=$B$2,ROW($C$7:$C$105)-ROW($C$7)+1)),ROWS(F$5:F29))))","v":""},{"$f":"IF(ROWS(G$5:G29)>COUNTIF(Payments!$C$2:$C$100,$B$2),\"\",INDEX(Payments!F$2:F$100,SMALL(IF(Payments!$C$2:$C$100<>\"\",IF(Payments!$C$2:$C$100=$B$2,ROW($C$7:$C$105)-ROW($C$7)+1)),ROWS(G$5:G29))))","v":""}]
[null,{"$f":"IF(C30=\"\",\"\",MAX($B$4:B29)+1)","v":""},{"$f":"IF(ROWS(C$5:C30)>COUNTIF(Payments!$C$2:$C$100,$B$2),\"\",INDEX(Payments!B$2:B$100,SMALL(IF(Payments!$C$2:$C$100<>\"\",IF(Payments!$C$2:$C$100=$B$2,ROW($C$7:$C$105)-ROW($C$7)+1)),ROWS(C$5:C30))))","v":""},{"$f":"IF(ROWS(D$5:D30)>COUNTIF(Payments!$C$2:$C$100,$B$2),\"\",INDEX(Payments!C$2:C$100,SMALL(IF(Payments!$C$2:$C$100<>\"\",IF(Payments!$C$2:$C$100=$B$2,ROW($C$7:$C$105)-ROW($C$7)+1)),ROWS(D$5:D30))))","v":""},{"$f":"IF(ROWS(E$5:E30)>COUNTIF(Payments!$C$2:$C$100,$B$2),\"\",INDEX(Payments!D$2:D$100,SMALL(IF(Payments!$C$2:$C$100<>\"\",IF(Payments!$C$2:$C$100=$B$2,ROW($C$7:$C$105)-ROW($C$7)+1)),ROWS(E$5:E30))))","v":""},{"$f":"IF(ROWS(F$5:F30)>COUNTIF(Payments!$C$2:$C$100,$B$2),\"\",INDEX(Payments!E$2:E$100,SMALL(IF(Payments!$C$2:$C$100<>\"\",IF(Payments!$C$2:$C$100=$B$2,ROW($C$7:$C$105)-ROW($C$7)+1)),ROWS(F$5:F30))))","v":""},{"$f":"IF(ROWS(G$5:G30)>COUNTIF(Payments!$C$2:$C$100,$B$2),\"\",INDEX(Payments!F$2:F$100,SMALL(IF(Payments!$C$2:$C$100<>\"\",IF(Payments!$C$2:$C$100=$B$2,ROW($C$7:$C$105)-ROW($C$7)+1)),ROWS(G$5:G30))))","v":""}]
[null,{"$f":"IF(C31=\"\",\"\",MAX($B$4:B30)+1)","v":""},{"$f":"IF(ROWS(C$5:C31)>COUNTIF(Payments!$C$2:$C$100,$B$2),\"\",INDEX(Payments!B$2:B$100,SMALL(IF(Payments!$C$2:$C$100<>\"\",IF(Payments!$C$2:$C$100=$B$2,ROW($C$7:$C$105)-ROW($C$7)+1)),ROWS(C$5:C31))))","v":""},{"$f":"IF(ROWS(D$5:D31)>COUNTIF(Payments!$C$2:$C$100,$B$2),\"\",INDEX(Payments!C$2:C$100,SMALL(IF(Payments!$C$2:$C$100<>\"\",IF(Payments!$C$2:$C$100=$B$2,ROW($C$7:$C$105)-ROW($C$7)+1)),ROWS(D$5:D31))))","v":""},{"$f":"IF(ROWS(E$5:E31)>COUNTIF(Payments!$C$2:$C$100,$B$2),\"\",INDEX(Payments!D$2:D$100,SMALL(IF(Payments!$C$2:$C$100<>\"\",IF(Payments!$C$2:$C$100=$B$2,ROW($C$7:$C$105)-ROW($C$7)+1)),ROWS(E$5:E31))))","v":""},{"$f":"IF(ROWS(F$5:F31)>COUNTIF(Payments!$C$2:$C$100,$B$2),\"\",INDEX(Payments!E$2:E$100,SMALL(IF(Payments!$C$2:$C$100<>\"\",IF(Payments!$C$2:$C$100=$B$2,ROW($C$7:$C$105)-ROW($C$7)+1)),ROWS(F$5:F31))))","v":""},{"$f":"IF(ROWS(G$5:G31)>COUNTIF(Payments!$C$2:$C$100,$B$2),\"\",INDEX(Payments!F$2:F$100,SMALL(IF(Payments!$C$2:$C$100<>\"\",IF(Payments!$C$2:$C$100=$B$2,ROW($C$7:$C$105)-ROW($C$7)+1)),ROWS(G$5:G31))))","v":""}]
[null,{"$f":"IF(C32=\"\",\"\",MAX($B$4:B31)+1)","v":""},{"$f":"IF(ROWS(C$5:C32)>COUNTIF(Payments!$C$2:$C$100,$B$2),\"\",INDEX(Payments!B$2:B$100,SMALL(IF(Payments!$C$2:$C$100<>\"\",IF(Payments!$C$2:$C$100=$B$2,ROW($C$7:$C$105)-ROW($C$7)+1)),ROWS(C$5:C32))))","v":""},{"$f":"IF(ROWS(D$5:D32)>COUNTIF(Payments!$C$2:$C$100,$B$2),\"\",INDEX(Payments!C$2:C$100,SMALL(IF(Payments!$C$2:$C$100<>\"\",IF(Payments!$C$2:$C$100=$B$2,ROW($C$7:$C$105)-ROW($C$7)+1)),ROWS(D$5:D32))))","v":""},{"$f":"IF(ROWS(E$5:E32)>COUNTIF(Payments!$C$2:$C$100,$B$2),\"\",INDEX(Payments!D$2:D$100,SMALL(IF(Payments!$C$2:$C$100<>\"\",IF(Payments!$C$2:$C$100=$B$2,ROW($C$7:$C$105)-ROW($C$7)+1)),ROWS(E$5:E32))))","v":""},{"$f":"IF(ROWS(F$5:F32)>COUNTIF(Payments!$C$2:$C$100,$B$2),\"\",INDEX(Payments!E$2:E$100,SMALL(IF(Payments!$C$2:$C$100<>\"\",IF(Payments!$C$2:$C$100=$B$2,ROW($C$7:$C$105)-ROW($C$7)+1)),ROWS(F$5:F32))))","v":""},{"$f":"IF(ROWS(G$5:G32)>COUNTIF(Payments!$C$2:$C$100,$B$2),\"\",INDEX(Payments!F$2:F$100,SMALL(IF(Payments!$C$2:$C$100<>\"\",IF(Payments!$C$2:$C$100=$B$2,ROW($C$7:$C$105)-ROW($C$7)+1)),ROWS(G$5:G32))))","v":""}]
[null,{"$f":"IF(C33=\"\",\"\",MAX($B$4:B32)+1)","v":""},{"$f":"IF(ROWS(C$5:C33)>COUNTIF(Payments!$C$2:$C$100,$B$2),\"\",INDEX(Payments!B$2:B$100,SMALL(IF(Payments!$C$2:$C$100<>\"\",IF(Payments!$C$2:$C$100=$B$2,ROW($C$7:$C$105)-ROW($C$7)+1)),ROWS(C$5:C33))))","v":""},{"$f":"IF(ROWS(D$5:D33)>COUNTIF(Payments!$C$2:$C$100,$B$2),\"\",INDEX(Payments!C$2:C$100,SMALL(IF(Payments!$C$2:$C$100<>\"\",IF(Payments!$C$2:$C$100=$B$2,ROW($C$7:$C$105)-ROW($C$7)+1)),ROWS(D$5:D33))))","v":""},{"$f":"IF(ROWS(E$5:E33)>COUNTIF(Payments!$C$2:$C$100,$B$2),\"\",INDEX(Payments!D$2:D$100,SMALL(IF(Payments!$C$2:$C$100<>\"\",IF(Payments!$C$2:$C$100=$B$2,ROW($C$7:$C$105)-ROW($C$7)+1)),ROWS(E$5:E33))))","v":""},{"$f":"IF(ROWS(F$5:F33)>COUNTIF(Payments!$C$2:$C$100,$B$2),\"\",INDEX(Payments!E$2:E$100,SMALL(IF(Payments!$C$2:$C$100<>\"\",IF(Payments!$C$2:$C$100=$B$2,ROW($C$7:$C$105)-ROW($C$7)+1)),ROWS(F$5:F33))))","v":""},{"$f":"IF(ROWS(G$5:G33)>COUNTIF(Payments!$C$2:$C$100,$B$2),\"\",INDEX(Payments!F$2:F$100,SMALL(IF(Payments!$C$2:$C$100<>\"\",IF(Payments!$C$2:$C$100=$B$2,ROW($C$7:$C$105)-ROW($C$7)+1)),ROWS(G$5:G33))))","v":""}]
[null,{"$f":"IF(C34=\"\",\"\",MAX($B$4:B33)+1)","v":""},{"$f":"IF(ROWS(C$5:C34)>COUNTIF(Payments!$C$2:$C$100,$B$2),\"\",INDEX(Payments!B$2:B$100,SMALL(IF(Payments!$C$2:$C$100<>\"\",IF(Payments!$C$2:$C$100=$B$2,ROW($C$7:$C$105)-ROW($C$7)+1)),ROWS(C$5:C34))))","v":""},{"$f":"IF(ROWS(D$5:D34)>COUNTIF(Payments!$C$2:$C$100,$B$2),\"\",INDEX(Payments!C$2:C$100,SMALL(IF(Payments!$C$2:$C$100<>\"\",IF(Payments!$C$2:$C$100=$B$2,ROW($C$7:$C$105)-ROW($C$7)+1)),ROWS(D$5:D34))))","v":""},{"$f":"IF(ROWS(E$5:E34)>COUNTIF(Payments!$C$2:$C$100,$B$2),\"\",INDEX(Payments!D$2:D$100,SMALL(IF(Payments!$C$2:$C$100<>\"\",IF(Payments!$C$2:$C$100=$B$2,ROW($C$7:$C$105)-ROW($C$7)+1)),ROWS(E$5:E34))))","v":""},{"$f":"IF(ROWS(F$5:F34)>COUNTIF(Payments!$C$2:$C$100,$B$2),\"\",INDEX(Payments!E$2:E$100,SMALL(IF(Payments!$C$2:$C$100<>\"\",IF(Payments!$C$2:$C$100=$B$2,ROW($C$7:$C$105)-ROW($C$7)+1)),ROWS(F$5:F34))))","v":""},{"$f":"IF(ROWS(G$5:G34)>COUNTIF(Payments!$C$2:$C$100,$B$2),\"\",INDEX(Payments!F$2:F$100,SMALL(IF(Payments!$C$2:$C$100<>\"\",IF(Payments!$C$2:$C$100=$B$2,ROW($C$7:$C$105)-ROW($C$7)+1)),ROWS(G$5:G34))))","v":""}]
[null,{"$f":"IF(C35=\"\",\"\",MAX($B$4:B34)+1)","v":""},{"$f":"IF(ROWS(C$5:C35)>COUNTIF(Payments!$C$2:$C$100,$B$2),\"\",INDEX(Payments!B$2:B$100,SMALL(IF(Payments!$C$2:$C$100<>\"\",IF(Payments!$C$2:$C$100=$B$2,ROW($C$7:$C$105)-ROW($C$7)+1)),ROWS(C$5:C35))))","v":""},{"$f":"IF(ROWS(D$5:D35)>COUNTIF(Payments!$C$2:$C$100,$B$2),\"\",INDEX(Payments!C$2:C$100,SMALL(IF(Payments!$C$2:$C$100<>\"\",IF(Payments!$C$2:$C$100=$B$2,ROW($C$7:$C$105)-ROW($C$7)+1)),ROWS(D$5:D35))))","v":""},{"$f":"IF(ROWS(E$5:E35)>COUNTIF(Payments!$C$2:$C$100,$B$2),\"\",INDEX(Payments!D$2:D$100,SMALL(IF(Payments!$C$2:$C$100<>\"\",IF(Payments!$C$2:$C$100=$B$2,ROW($C$7:$C$105)-ROW($C$7)+1)),ROWS(E$5:E35))))","v":""},{"$f":"IF(ROWS(F$5:F35)>COUNTIF(Payments!$C$2:$C$100,$B$2),\"\",INDEX(Payments!E$2:E$100,SMALL(IF(Payments!$C$2:$C$100<>\"\",IF(Payments!$C$2:$C$100=$B$2,ROW($C$7:$C$105)-ROW($C$7)+1)),ROWS(F$5:F35))))","v":""},{"$f":"IF(ROWS(G$5:G35)>COUNTIF(Payments!$C$2:$C$100,$B$2),\"\",INDEX(Payments!F$2:F$100,SMALL(IF(Payments!$C$2:$C$100<>\"\",IF(Payments!$C$2:$C$100=$B$2,ROW($C$7:$C$105)-ROW($C$7)+1)),ROWS(G$5:G35))))","v":""}]
[null,{"$f":"IF(C36=\"\",\"\",MAX($B$4:B35)+1)","v":""},{"$f":"IF(ROWS(C$5:C36)>COUNTIF(Payments!$C$2:$C$100,$B$2),\"\",INDEX(Payments!B$2:B$100,SMALL(IF(Payments!$C$2:$C$100<>\"\",IF(Payments!$C$2:$C$100=$B$2,ROW($C$7:$C$105)-ROW($C$7)+1)),ROWS(C$5:C36))))","v":""},{"$f":"IF(ROWS(D$5:D36)>COUNTIF(Payments!$C$2:$C$100,$B$2),\"\",INDEX(Payments!C$2:C$100,SMALL(IF(Payments!$C$2:$C$100<>\"\",IF(Payments!$C$2:$C$100=$B$2,ROW($C$7:$C$105)-ROW($C$7)+1)),ROWS(D$5:D36))))","v":""},{"$f":"IF(ROWS(E$5:E36)>COUNTIF(Payments!$C$2:$C$100,$B$2),\"\",INDEX(Payments!D$2:D$100,SMALL(IF(Payments!$C$2:$C$100<>\"\",IF(Payments!$C$2:$C$100=$B$2,ROW($C$7:$C$105)-ROW($C$7)+1)),ROWS(E$5:E36))))","v":""},{"$f":"IF(ROWS(F$5:F36)>COUNTIF(Payments!$C$2:$C$100,$B$2),\"\",INDEX(Payments!E$2:E$100,SMALL(IF(Payments!$C$2:$C$100<>\"\",IF(Payments!$C$2:$C$100=$B$2,ROW($C$7:$C$105)-ROW($C$7)+1)),ROWS(F$5:F36))))","v":""},{"$f":"IF(ROWS(G$5:G36)>COUNTIF(Payments!$C$2:$C$100,$B$2),\"\",INDEX(Payments!F$2:F$100,SMALL(IF(Payments!$C$2:$C$100<>\"\",IF(Payments!$C$2:$C$100=$B$2,ROW($C$7:$C$105)-ROW($C$7)+1)),ROWS(G$5:G36))))","v":""}]
[null,{"$f":"IF(C37=\"\",\"\",MAX($B$4:B36)+1)","v":""},{"$f":"IF(ROWS(C$5:C37)>COUNTIF(Payments!$C$2:$C$100,$B$2),\"\",INDEX(Payments!B$2:B$100,SMALL(IF(Payments!$C$2:$C$100<>\"\",IF(Payments!$C$2:$C$100=$B$2,ROW($C$7:$C$105)-ROW($C$7)+1)),ROWS(C$5:C37))))","v":""},{"$f":"IF(ROWS(D$5:D37)>COUNTIF(Payments!$C$2:$C$100,$B$2),\"\",INDEX(Payments!C$2:C$100,SMALL(IF(Payments!$C$2:$C$100<>\"\",IF(Payments!$C$2:$C$100=$B$2,ROW($C$7:$C$105)-ROW($C$7)+1)),ROWS(D$5:D37))))","v":""},{"$f":"IF(ROWS(E$5:E37)>COUNTIF(Payments!$C$2:$C$100,$B$2),\"\",INDEX(Payments!D$2:D$100,SMALL(IF(Payments!$C$2:$C$100<>\"\",IF(Payments!$C$2:$C$100=$B$2,ROW($C$7:$C$105)-ROW($C$7)+1)),ROWS(E$5:E37))))","v":""},{"$f":"IF(ROWS(F$5:F37)>COUNTIF(Payments!$C$2:$C$100,$B$2),\"\",INDEX(Payments!E$2:E$100,SMALL(IF(Payments!$C$2:$C$100<>\"\",IF(Payments!$C$2:$C$100=$B$2,ROW($C$7:$C$105)-ROW($C$7)+1)),ROWS(F$5:F37))))","v":""},{"$f":"IF(ROWS(G$5:G37)>COUNTIF(Payments!$C$2:$C$100,$B$2),\"\",INDEX(Payments!F$2:F$100,SMALL(IF(Payments!$C$2:$C$100<>\"\",IF(Payments!$C$2:$C$100=$B$2,ROW($C$7:$C$105)-ROW($C$7)+1)),ROWS(G$5:G37))))","v":""}]
[null,{"$f":"IF(C38=\"\",\"\",MAX($B$4:B37)+1)","v":""},{"$f":"IF(ROWS(C$5:C38)>COUNTIF(Payments!$C$2:$C$100,$B$2),\"\",INDEX(Payments!B$2:B$100,SMALL(IF(Payments!$C$2:$C$100<>\"\",IF(Payments!$C$2:$C$100=$B$2,ROW($C$7:$C$105)-ROW($C$7)+1)),ROWS(C$5:C38))))","v":""},{"$f":"IF(ROWS(D$5:D38)>COUNTIF(Payments!$C$2:$C$100,$B$2),\"\",INDEX(Payments!C$2:C$100,SMALL(IF(Payments!$C$2:$C$100<>\"\",IF(Payments!$C$2:$C$100=$B$2,ROW($C$7:$C$105)-ROW($C$7)+1)),ROWS(D$5:D38))))","v":""},{"$f":"IF(ROWS(E$5:E38)>COUNTIF(Payments!$C$2:$C$100,$B$2),\"\",INDEX(Payments!D$2:D$100,SMALL(IF(Payments!$C$2:$C$100<>\"\",IF(Payments!$C$2:$C$100=$B$2,ROW($C$7:$C$105)-ROW($C$7)+1)),ROWS(E$5:E38))))","v":""},{"$f":"IF(ROWS(F$5:F38)>COUNTIF(Payments!$C$2:$C$100,$B$2),\"\",INDEX(Payments!E$2:E$100,SMALL(IF(Payments!$C$2:$C$100<>\"\",IF(Payments!$C$2:$C$100=$B$2,ROW($C$7:$C$105)-ROW($C$7)+1)),ROWS(F$5:F38))))","v":""},{"$f":"IF(ROWS(G$5:G38)>COUNTIF(Payments!$C$2:$C$100,$B$2),\"\",INDEX(Payments!F$2:F$100,SMALL(IF(Payments!$C$2:$C$100<>\"\",IF(Payments!$C$2:$C$100=$B$2,ROW($C$7:$C$105)-ROW($C$7)+1)),ROWS(G$5:G38))))","v":""}]
[null,{"$f":"IF(C39=\"\",\"\",MAX($B$4:B38)+1)","v":""},{"$f":"IF(ROWS(C$5:C39)>COUNTIF(Payments!$C$2:$C$100,$B$2),\"\",INDEX(Payments!B$2:B$100,SMALL(IF(Payments!$C$2:$C$100<>\"\",IF(Payments!$C$2:$C$100=$B$2,ROW($C$7:$C$105)-ROW($C$7)+1)),ROWS(C$5:C39))))","v":""},{"$f":"IF(ROWS(D$5:D39)>COUNTIF(Payments!$C$2:$C$100,$B$2),\"\",INDEX(Payments!C$2:C$100,SMALL(IF(Payments!$C$2:$C$100<>\"\",IF(Payments!$C$2:$C$100=$B$2,ROW($C$7:$C$105)-ROW($C$7)+1)),ROWS(D$5:D39))))","v":""},{"$f":"IF(ROWS(E$5:E39)>COUNTIF(Payments!$C$2:$C$100,$B$2),\"\",INDEX(Payments!D$2:D$100,SMALL(IF(Payments!$C$2:$C$100<>\"\",IF(Payments!$C$2:$C$100=$B$2,ROW($C$7:$C$105)-ROW($C$7)+1)),ROWS(E$5:E39))))","v":""},{"$f":"IF(ROWS(F$5:F39)>COUNTIF(Payments!$C$2:$C$100,$B$2),\"\",INDEX(Payments!E$2:E$100,SMALL(IF(Payments!$C$2:$C$100<>\"\",IF(Payments!$C$2:$C$100=$B$2,ROW($C$7:$C$105)-ROW($C$7)+1)),ROWS(F$5:F39))))","v":""},{"$f":"IF(ROWS(G$5:G39)>COUNTIF(Payments!$C$2:$C$100,$B$2),\"\",INDEX(Payments!F$2:F$100,SMALL(IF(Payments!$C$2:$C$100<>\"\",IF(Payments!$C$2:$C$100=$B$2,ROW($C$7:$C$105)-ROW($C$7)+1)),ROWS(G$5:G39))))","v":""}]
[null,{"$f":"IF(C40=\"\",\"\",MAX($B$4:B39)+1)","v":""},{"$f":"IF(ROWS(C$5:C40)>COUNTIF(Payments!$C$2:$C$100,$B$2),\"\",INDEX(Payments!B$2:B$100,SMALL(IF(Payments!$C$2:$C$100<>\"\",IF(Payments!$C$2:$C$100=$B$2,ROW($C$7:$C$105)-ROW($C$7)+1)),ROWS(C$5:C40))))","v":""},{"$f":"IF(ROWS(D$5:D40)>COUNTIF(Payments!$C$2:$C$100,$B$2),\"\",INDEX(Payments!C$2:C$100,SMALL(IF(Payments!$C$2:$C$100<>\"\",IF(Payments!$C$2:$C$100=$B$2,ROW($C$7:$C$105)-ROW($C$7)+1)),ROWS(D$5:D40))))","v":""},{"$f":"IF(ROWS(E$5:E40)>COUNTIF(Payments!$C$2:$C$100,$B$2),\"\",INDEX(Payments!D$2:D$100,SMALL(IF(Payments!$C$2:$C$100<>\"\",IF(Payments!$C$2:$C$100=$B$2,ROW($C$7:$C$105)-ROW($C$7)+1)),ROWS(E$5:E40))))","v":""},{"$f":"IF(ROWS(F$5:F40)>COUNTIF(Payments!$C$2:$C$100,$B$2),\"\",INDEX(Payments!E$2:E$100,SMALL(IF(Payments!$C$2:$C$100<>\"\",IF(Payments!$C$2:$C$100=$B$2,ROW($C$7:$C$105)-ROW($C$7)+1)),ROWS(F$5:F40))))","v":""},{"$f":"IF(ROWS(G$5:G40)>COUNTIF(Payments!$C$2:$C$100,$B$2),\"\",INDEX(Payments!F$2:F$100,SMALL(IF(Payments!$C$2:$C$100<>\"\",IF(Payments!$C$2:$C$100=$B$2,ROW($C$7:$C$105)-ROW($C$7)+1)),ROWS(G$5:G40))))","v":""}]
[null,{"$f":"IF(C41=\"\",\"\",MAX($B$4:B40)+1)","v":""},{"$f":"IF(ROWS(C$5:C41)>COUNTIF(Payments!$C$2:$C$100,$B$2),\"\",INDEX(Payments!B$2:B$100,SMALL(IF(Payments!$C$2:$C$100<>\"\",IF(Payments!$C$2:$C$100=$B$2,ROW($C$7:$C$105)-ROW($C$7)+1)),ROWS(C$5:C41))))","v":""},{"$f":"IF(ROWS(D$5:D41)>COUNTIF(Payments!$C$2:$C$100,$B$2),\"\",INDEX(Payments!C$2:C$100,SMALL(IF(Payments!$C$2:$C$100<>\"\",IF(Payments!$C$2:$C$100=$B$2,ROW($C$7:$C$105)-ROW($C$7)+1)),ROWS(D$5:D41))))","v":""},{"$f":"IF(ROWS(E$5:E41)>COUNTIF(Payments!$C$2:$C$100,$B$2),\"\",INDEX(Payments!D$2:D$100,SMALL(IF(Payments!$C$2:$C$100<>\"\",IF(Payments!$C$2:$C$100=$B$2,ROW($C$7:$C$105)-ROW($C$7)+1)),ROWS(E$5:E41))))","v":""},{"$f":"IF(ROWS(F$5:F41)>COUNTIF(Payments!$C$2:$C$100,$B$2),\"\",INDEX(Payments!E$2:E$100,SMALL(IF(Payments!$C$2:$C$100<>\"\",IF(Payments!$C$2:$C$100=$B$2,ROW($C$7:$C$105)-ROW($C$7)+1)),ROWS(F$5:F41))))","v":""},{"$f":"IF(ROWS(G$5:G41)>COUNTIF(Payments!$C$2:$C$100,$B$2),\"\",INDEX(Payments!F$2:F$100,SMALL(IF(Payments!$C$2:$C$100<>\"\",IF(Payments!$C$2:$C$100=$B$2,ROW($C$7:$C$105)-ROW($C$7)+1)),ROWS(G$5:G41))))","v":""}]
[null,{"$f":"IF(C42=\"\",\"\",MAX($B$4:B41)+1)","v":""},{"$f":"IF(ROWS(C$5:C42)>COUNTIF(Payments!$C$2:$C$100,$B$2),\"\",INDEX(Payments!B$2:B$100,SMALL(IF(Payments!$C$2:$C$100<>\"\",IF(Payments!$C$2:$C$100=$B$2,ROW($C$7:$C$105)-ROW($C$7)+1)),ROWS(C$5:C42))))","v":""},{"$f":"IF(ROWS(D$5:D42)>COUNTIF(Payments!$C$2:$C$100,$B$2),\"\",INDEX(Payments!C$2:C$100,SMALL(IF(Payments!$C$2:$C$100<>\"\",IF(Payments!$C$2:$C$100=$B$2,ROW($C$7:$C$105)-ROW($C$7)+1)),ROWS(D$5:D42))))","v":""},{"$f":"IF(ROWS(E$5:E42)>COUNTIF(Payments!$C$2:$C$100,$B$2),\"\",INDEX(Payments!D$2:D$100,SMALL(IF(Payments!$C$2:$C$100<>\"\",IF(Payments!$C$2:$C$100=$B$2,ROW($C$7:$C$105)-ROW($C$7)+1)),ROWS(E$5:E42))))","v":""},{"$f":"IF(ROWS(F$5:F42)>COUNTIF(Payments!$C$2:$C$100,$B$2),\"\",INDEX(Payments!E$2:E$100,SMALL(IF(Payments!$C$2:$C$100<>\"\",IF(Payments!$C$2:$C$100=$B$2,ROW($C$7:$C$105)-ROW($C$7)+1)),ROWS(F$5:F42))))","v":""},{"$f":"IF(ROWS(G$5:G42)>COUNTIF(Payments!$C$2:$C$100,$B$2),\"\",INDEX(Payments!F$2:F$100,SMALL(IF(Payments!$C$2:$C$100<>\"\",IF(Payments!$C$2:$C$100=$B$2,ROW($C$7:$C$105)-ROW($C$7)+1)),ROWS(G$5:G42))))","v":""}]
[null,{"$f":"IF(C43=\"\",\"\",MAX($B$4:B42)+1)","v":""},{"$f":"IF(ROWS(C$5:C43)>COUNTIF(Payments!$C$2:$C$100,$B$2),\"\",INDEX(Payments!B$2:B$100,SMALL(IF(Payments!$C$2:$C$100<>\"\",IF(Payments!$C$2:$C$100=$B$2,ROW($C$7:$C$105)-ROW($C$7)+1)),ROWS(C$5:C43))))","v":""},{"$f":"IF(ROWS(D$5:D43)>COUNTIF(Payments!$C$2:$C$100,$B$2),\"\",INDEX(Payments!C$2:C$100,SMALL(IF(Payments!$C$2:$C$100<>\"\",IF(Payments!$C$2:$C$100=$B$2,ROW($C$7:$C$105)-ROW($C$7)+1)),ROWS(D$5:D43))))","v":""},{"$f":"IF(ROWS(E$5:E43)>COUNTIF(Payments!$C$2:$C$100,$B$2),\"\",INDEX(Payments!D$2:D$100,SMALL(IF(Payments!$C$2:$C$100<>\"\",IF(Payments!$C$2:$C$100=$B$2,ROW($C$7:$C$105)-ROW($C$7)+1)),ROWS(E$5:E43))))","v":""},{"$f":"IF(ROWS(F$5:F43)>COUNTIF(Payments!$C$2:$C$100,$B$2),\"\",INDEX(Payments!E$2:E$100,SMALL(IF(Payments!$C$2:$C$100<>\"\",IF(Payments!$C$2:$C$100=$B$2,ROW($C$7:$C$105)-ROW($C$7)+1)),ROWS(F$5:F43))))","v":""},{"$f":"IF(ROWS(G$5:G43)>COUNTIF(Payments!$C$2:$C$100,$B$2),\"\",INDEX(Payments!F$2:F$100,SMALL(IF(Payments!$C$2:$C$100<>\"\",IF(Payments!$C$2:$C$100=$B$2,ROW($C$7:$C$105)-ROW($C$7)+1)),ROWS(G$5:G43))))","v":""}]
[null,{"$f":"IF(C44=\"\",\"\",MAX($B$4:B43)+1)","v":""},{"$f":"IF(ROWS(C$5:C44)>COUNTIF(Payments!$C$2:$C$100,$B$2),\"\",INDEX(Payments!B$2:B$100,SMALL(IF(Payments!$C$2:$C$100<>\"\",IF(Payments!$C$2:$C$100=$B$2,ROW($C$7:$C$105)-ROW($C$7)+1)),ROWS(C$5:C44))))","v":""},{"$f":"IF(ROWS(D$5:D44)>COUNTIF(Payments!$C$2:$C$100,$B$2),\"\",INDEX(Payments!C$2:C$100,SMALL(IF(Payments!$C$2:$C$100<>\"\",IF(Payments!$C$2:$C$100=$B$2,ROW($C$7:$C$105)-ROW($C$7)+1)),ROWS(D$5:D44))))","v":""},{"$f":"IF(ROWS(E$5:E44)>COUNTIF(Payments!$C$2:$C$100,$B$2),\"\",INDEX(Payments!D$2:D$100,SMALL(IF(Payments!$C$2:$C$100<>\"\",IF(Payments!$C$2:$C$100=$B$2,ROW($C$7:$C$105)-ROW($C$7)+1)),ROWS(E$5:E44))))","v":""},{"$f":"IF(ROWS(F$5:F44)>COUNTIF(Payments!$C$2:$C$100,$B$2),\"\",INDEX(Payments!E$2:E$100,SMALL(IF(Payments!$C$2:$C$100<>\"\",IF(Payments!$C$2:$C$100=$B$2,ROW($C$7:$C$105)-ROW($C$7)+1)),ROWS(F$5:F44))))","v":""},{"$f":"IF(ROWS(G$5:G44)>COUNTIF(Payments!$C$2:$C$100,$B$2),\"\",INDEX(Payments!F$2:F$100,SMALL(IF(Payments!$C$2:$C$100<>\"\",IF(Payments!$C$2:$C$100=$B$2,ROW($C$7:$C$105)-ROW($C$7)+1)),ROWS(G$5:G44))))","v":""}]
[null,{"$f":"IF(C45=\"\",\"\",MAX($B$4:B44)+1)","v":""},{"$f":"IF(ROWS(C$5:C45)>COUNTIF(Payments!$C$2:$C$100,$B$2),\"\",INDEX(Payments!B$2:B$100,SMALL(IF(Payments!$C$2:$C$100<>\"\",IF(Payments!$C$2:$C$100=$B$2,ROW($C$7:$C$105)-ROW($C$7)+1)),ROWS(C$5:C45))))","v":""},{"$f":"IF(ROWS(D$5:D45)>COUNTIF(Payments!$C$2:$C$100,$B$2),\"\",INDEX(Payments!C$2:C$100,SMALL(IF(Payments!$C$2:$C$100<>\"\",IF(Payments!$C$2:$C$100=$B$2,ROW($C$7:$C$105)-ROW($C$7)+1)),ROWS(D$5:D45))))","v":""},{"$f":"IF(ROWS(E$5:E45)>COUNTIF(Payments!$C$2:$C$100,$B$2),\"\",INDEX(Payments!D$2:D$100,SMALL(IF(Payments!$C$2:$C$100<>\"\",IF(Payments!$C$2:$C$100=$B$2,ROW($C$7:$C$105)-ROW($C$7)+1)),ROWS(E$5:E45))))","v":""},{"$f":"IF(ROWS(F$5:F45)>COUNTIF(Payments!$C$2:$C$100,$B$2),\"\",INDEX(Payments!E$2:E$100,SMALL(IF(Payments!$C$2:$C$100<>\"\",IF(Payments!$C$2:$C$100=$B$2,ROW($C$7:$C$105)-ROW($C$7)+1)),ROWS(F$5:F45))))","v":""},{"$f":"IF(ROWS(G$5:G45)>COUNTIF(Payments!$C$2:$C$100,$B$2),\"\",INDEX(Payments!F$2:F$100,SMALL(IF(Payments!$C$2:$C$100<>\"\",IF(Payments!$C$2:$C$100=$B$2,ROW($C$7:$C$105)-ROW($C$7)+1)),ROWS(G$5:G45))))","v":""}]
[null,{"$f":"IF(C46=\"\",\"\",MAX($B$4:B45)+1)","v":""},{"$f":"IF(ROWS(C$5:C46)>COUNTIF(Payments!$C$2:$C$100,$B$2),\"\",INDEX(Payments!B$2:B$100,SMALL(IF(Payments!$C$2:$C$100<>\"\",IF(Payments!$C$2:$C$100=$B$2,ROW($C$7:$C$105)-ROW($C$7)+1)),ROWS(C$5:C46))))","v":""},{"$f":"IF(ROWS(D$5:D46)>COUNTIF(Payments!$C$2:$C$100,$B$2),\"\",INDEX(Payments!C$2:C$100,SMALL(IF(Payments!$C$2:$C$100<>\"\",IF(Payments!$C$2:$C$100=$B$2,ROW($C$7:$C$105)-ROW($C$7)+1)),ROWS(D$5:D46))))","v":""},{"$f":"IF(ROWS(E$5:E46)>COUNTIF(Payments!$C$2:$C$100,$B$2),\"\",INDEX(Payments!D$2:D$100,SMALL(IF(Payments!$C$2:$C$100<>\"\",IF(Payments!$C$2:$C$100=$B$2,ROW($C$7:$C$105)-ROW($C$7)+1)),ROWS(E$5:E46))))","v":""},{"$f":"IF(ROWS(F$5:F46)>COUNTIF(Payments!$C$2:$C$100,$B$2),\"\",INDEX(Payments!E$2:E$100,SMALL(IF(Payments!$C$2:$C$100<>\"\",IF(Payments!$C$2:$C$100=$B$2,ROW($C$7:$C$105)-ROW($C$7)+1)),ROWS(F$5:F46))))","v":""},{"$f":"IF(ROWS(G$5:G46)>COUNTIF(Payments!$C$2:$C$100,$B$2),\"\",INDEX(Payments!F$2:F$100,SMALL(IF(Payments!$C$2:$C$100<>\"\",IF(Payments!$C$2:$C$100=$B$2,ROW($C$7:$C$105)-ROW($C$7)+1)),ROWS(G$5:G46))))","v":""}]
[null,{"$f":"IF(C47=\"\",\"\",MAX($B$4:B46)+1)","v":""},{"$f":"IF(ROWS(C$5:C47)>COUNTIF(Payments!$C$2:$C$100,$B$2),\"\",INDEX(Payments!B$2:B$100,SMALL(IF(Payments!$C$2:$C$100<>\"\",IF(Payments!$C$2:$C$100=$B$2,ROW($C$7:$C$105)-ROW($C$7)+1)),ROWS(C$5:C47))))","v":""},{"$f":"IF(ROWS(D$5:D47)>COUNTIF(Payments!$C$2:$C$100,$B$2),\"\",INDEX(Payments!C$2:C$100,SMALL(IF(Payments!$C$2:$C$100<>\"\",IF(Payments!$C$2:$C$100=$B$2,ROW($C$7:$C$105)-ROW($C$7)+1)),ROWS(D$5:D47))))","v":""},{"$f":"IF(ROWS(E$5:E47)>COUNTIF(Payments!$C$2:$C$100,$B$2),\"\",INDEX(Payments!D$2:D$100,SMALL(IF(Payments!$C$2:$C$100<>\"\",IF(Payments!$C$2:$C$100=$B$2,ROW($C$7:$C$105)-ROW($C$7)+1)),ROWS(E$5:E47))))","v":""},{"$f":"IF(ROWS(F$5:F47)>COUNTIF(Payments!$C$2:$C$100,$B$2),\"\",INDEX(Payments!E$2:E$100,SMALL(IF(Payments!$C$2:$C$100<>\"\",IF(Payments!$C$2:$C$100=$B$2,ROW($C$7:$C$105)-ROW($C$7)+1)),ROWS(F$5:F47))))","v":""},{"$f":"IF(ROWS(G$5:G47)>COUNTIF(Payments!$C$2:$C$100,$B$2),\"\",INDEX(Payments!F$2:F$100,SMALL(IF(Payments!$C$2:$C$100<>\"\",IF(Payments!$C$2:$C$100=$B$2,ROW($C$7:$C$105)-ROW($C$7)+1)),ROWS(G$5:G47))))","v":""}]
[null,{"$f":"IF(C48=\"\",\"\",MAX($B$4:B47)+1)","v":""},{"$f":"IF(ROWS(C$5:C48)>COUNTIF(Payments!$C$2:$C$100,$B$2),\"\",INDEX(Payments!B$2:B$100,SMALL(IF(Payments!$C$2:$C$100<>\"\",IF(Payments!$C$2:$C$100=$B$2,ROW($C$7:$C$105)-ROW($C$7)+1)),ROWS(C$5:C48))))","v":""},{"$f":"IF(ROWS(D$5:D48)>COUNTIF(Payments!$C$2:$C$100,$B$2),\"\",INDEX(Payments!C$2:C$100,SMALL(IF(Payments!$C$2:$C$100<>\"\",IF(Payments!$C$2:$C$100=$B$2,ROW($C$7:$C$105)-ROW($C$7)+1)),ROWS(D$5:D48))))","v":""},{"$f":"IF(ROWS(E$5:E48)>COUNTIF(Payments!$C$2:$C$100,$B$2),\"\",INDEX(Payments!D$2:D$100,SMALL(IF(Payments!$C$2:$C$100<>\"\",IF(Payments!$C$2:$C$100=$B$2,ROW($C$7:$C$105)-ROW($C$7)+1)),ROWS(E$5:E48))))","v":""},{"$f":"IF(ROWS(F$5:F48)>COUNTIF(Payments!$C$2:$C$100,$B$2),\"\",INDEX(Payments!E$2:E$100,SMALL(IF(Payments!$C$2:$C$100<>\"\",IF(Payments!$C$2:$C$100=$B$2,ROW($C$7:$C$105)-ROW($C$7)+1)),ROWS(F$5:F48))))","v":""},{"$f":"IF(ROWS(G$5:G48)>COUNTIF(Payments!$C$2:$C$100,$B$2),\"\",INDEX(Payments!F$2:F$100,SMALL(IF(Payments!$C$2:$C$100<>\"\",IF(Payments!$C$2:$C$100=$B$2,ROW($C$7:$C$105)-ROW($C$7)+1)),ROWS(G$5:G48))))","v":""}]
[null,{"$f":"IF(C49=\"\",\"\",MAX($B$4:B48)+1)","v":""},{"$f":"IF(ROWS(C$5:C49)>COUNTIF(Payments!$C$2:$C$100,$B$2),\"\",INDEX(Payments!B$2:B$100,SMALL(IF(Payments!$C$2:$C$100<>\"\",IF(Payments!$C$2:$C$100=$B$2,ROW($C$7:$C$105)-ROW($C$7)+1)),ROWS(C$5:C49))))","v":""},{"$f":"IF(ROWS(D$5:D49)>COUNTIF(Payments!$C$2:$C$100,$B$2),\"\",INDEX(Payments!C$2:C$100,SMALL(IF(Payments!$C$2:$C$100<>\"\",IF(Payments!$C$2:$C$100=$B$2,ROW($C$7:$C$105)-ROW($C$7)+1)),ROWS(D$5:D49))))","v":""},{"$f":"IF(ROWS(E$5:E49)>COUNTIF(Payments!$C$2:$C$100,$B$2),\"\",INDEX(Payments!D$2:D$100,SMALL(IF(Payments!$C$2:$C$100<>\"\",IF(Payments!$C$2:$C$100=$B$2,ROW($C$7:$C$105)-ROW($C$7)+1)),ROWS(E$5:E49))))","v":""},{"$f":"IF(ROWS(F$5:F49)>COUNTIF(Payments!$C$2:$C$100,$B$2),\"\",INDEX(Payments!E$2:E$100,SMALL(IF(Payments!$C$2:$C$100<>\"\",IF(Payments!$C$2:$C$100=$B$2,ROW($C$7:$C$105)-ROW($C$7)+1)),ROWS(F$5:F49))))","v":""},{"$f":"IF(ROWS(G$5:G49)>COUNTIF(Payments!$C$2:$C$100,$B$2),\"\",INDEX(Payments!F$2:F$100,SMALL(IF(Payments!$C$2:$C$100<>\"\",IF(Payments!$C$2:$C$100=$B$2,ROW($C$7:$C$105)-ROW($C$7)+1)),ROWS(G$5:G49))))","v":""}]
[null,{"$f":"IF(C50=\"\",\"\",MAX($B$4:B49)+1)","v":""},{"$f":"IF(ROWS(C$5:C50)>COUNTIF(Payments!$C$2:$C$100,$B$2),\"\",INDEX(Payments!B$2:B$100,SMALL(IF(Payments!$C$2:$C$100<>\"\",IF(Payments!$C$2:$C$100=$B$2,ROW($C$7:$C$105)-ROW($C$7)+1)),ROWS(C$5:C50))))","v":""},{"$f":"IF(ROWS(D$5:D50)>COUNTIF(Payments!$C$2:$C$100,$B$2),\"\",INDEX(Payments!C$2:C$100,SMALL(IF(Payments!$C$2:$C$100<>\"\",IF(Payments!$C$2:$C$100=$B$2,ROW($C$7:$C$105)-ROW($C$7)+1)),ROWS(D$5:D50))))","v":""},{"$f":"IF(ROWS(E$5:E50)>COUNTIF(Payments!$C$2:$C$100,$B$2),\"\",INDEX(Payments!D$2:D$100,SMALL(IF(Payments!$C$2:$C$100<>\"\",IF(Payments!$C$2:$C$100=$B$2,ROW($C$7:$C$105)-ROW($C$7)+1)),ROWS(E$5:E50))))","v":""},{"$f":"IF(ROWS(F$5:F50)>COUNTIF(Payments!$C$2:$C$100,$B$2),\"\",INDEX(Payments!E$2:E$100,SMALL(IF(Payments!$C$2:$C$100<>\"\",IF(Payments!$C$2:$C$100=$B$2,ROW($C$7:$C$105)-ROW($C$7)+1)),ROWS(F$5:F50))))","v":""},{"$f":"IF(ROWS(G$5:G50)>COUNTIF(Payments!$C$2:$C$100,$B$2),\"\",INDEX(Payments!F$2:F$100,SMALL(IF(Payments!$C$2:$C$100<>\"\",IF(Payments!$C$2:$C$100=$B$2,ROW($C$7:$C$105)-ROW($C$7)+1)),ROWS(G$5:G50))))","v":""}]
[null,{"$f":"IF(C51=\"\",\"\",MAX($B$4:B50)+1)","v":""},{"$f":"IF(ROWS(C$5:C51)>COUNTIF(Payments!$C$2:$C$100,$B$2),\"\",INDEX(Payments!B$2:B$100,SMALL(IF(Payments!$C$2:$C$100<>\"\",IF(Payments!$C$2:$C$100=$B$2,ROW($C$7:$C$105)-ROW($C$7)+1)),ROWS(C$5:C51))))","v":""},{"$f":"IF(ROWS(D$5:D51)>COUNTIF(Payments!$C$2:$C$100,$B$2),\"\",INDEX(Payments!C$2:C$100,SMALL(IF(Payments!$C$2:$C$100<>\"\",IF(Payments!$C$2:$C$100=$B$2,ROW($C$7:$C$105)-ROW($C$7)+1)),ROWS(D$5:D51))))","v":""},{"$f":"IF(ROWS(E$5:E51)>COUNTIF(Payments!$C$2:$C$100,$B$2),\"\",INDEX(Payments!D$2:D$100,SMALL(IF(Payments!$C$2:$C$100<>\"\",IF(Payments!$C$2:$C$100=$B$2,ROW($C$7:$C$105)-ROW($C$7)+1)),ROWS(E$5:E51))))","v":""},{"$f":"IF(ROWS(F$5:F51)>COUNTIF(Payments!$C$2:$C$100,$B$2),\"\",INDEX(Payments!E$2:E$100,SMALL(IF(Payments!$C$2:$C$100<>\"\",IF(Payments!$C$2:$C$100=$B$2,ROW($C$7:$C$105)-ROW($C$7)+1)),ROWS(F$5:F51))))","v":""},{"$f":"IF(ROWS(G$5:G51)>COUNTIF(Payments!$C$2:$C$100,$B$2),\"\",INDEX(Payments!F$2:F$100,SMALL(IF(Payments!$C$2:$C$100<>\"\",IF(Payments!$C$2:$C$100=$B$2,ROW($C$7:$C$105)-ROW($C$7)+1)),ROWS(G$5:G51))))","v":""}]
[null,{"$f":"IF(C52=\"\",\"\",MAX($B$4:B51)+1)","v":""},{"$f":"IF(ROWS(C$5:C52)>COUNTIF(Payments!$C$2:$C$100,$B$2),\"\",INDEX(Payments!B$2:B$100,SMALL(IF(Payments!$C$2:$C$100<>\"\",IF(Payments!$C$2:$C$100=$B$2,ROW($C$7:$C$105)-ROW($C$7)+1)),ROWS(C$5:C52))))","v":""},{"$f":"IF(ROWS(D$5:D52)>COUNTIF(Payments!$C$2:$C$100,$B$2),\"\",INDEX(Payments!C$2:C$100,SMALL(IF(Payments!$C$2:$C$100<>\"\",IF(Payments!$C$2:$C$100=$B$2,ROW($C$7:$C$105)-ROW($C$7)+1)),ROWS(D$5:D52))))","v":""},{"$f":"IF(ROWS(E$5:E52)>COUNTIF(Payments!$C$2:$C$100,$B$2),\"\",INDEX(Payments!D$2:D$100,SMALL(IF(Payments!$C$2:$C$100<>\"\",IF(Payments!$C$2:$C$100=$B$2,ROW($C$7:$C$105)-ROW($C$7)+1)),ROWS(E$5:E52))))","v":""},{"$f":"IF(ROWS(F$5:F52)>COUNTIF(Payments!$C$2:$C$100,$B$2),\"\",INDEX(Payments!E$2:E$100,SMALL(IF(Payments!$C$2:$C$100<>\"\",IF(Payments!$C$2:$C$100=$B$2,ROW($C$7:$C$105)-ROW($C$7)+1)),ROWS(F$5:F52))))","v":""},{"$f":"IF(ROWS(G$5:G52)>COUNTIF(Payments!$C$2:$C$100,$B$2),\"\",INDEX(Payments!F$2:F$100,SMALL(IF(Payments!$C$2:$C$100<>\"\",IF(Payments!$C$2:$C$100=$B$2,ROW($C$7:$C$105)-ROW($C$7)+1)),ROWS(G$5:G52))))","v":""}]
[null,{"$f":"IF(C53=\"\",\"\",MAX($B$4:B52)+1)","v":""},{"$f":"IF(ROWS(C$5:C53)>COUNTIF(Payments!$C$2:$C$100,$B$2),\"\",INDEX(Payments!B$2:B$100,SMALL(IF(Payments!$C$2:$C$100<>\"\",IF(Payments!$C$2:$C$100=$B$2,ROW($C$7:$C$105)-ROW($C$7)+1)),ROWS(C$5:C53))))","v":""},{"$f":"IF(ROWS(D$5:D53)>COUNTIF(Payments!$C$2:$C$100,$B$2),\"\",INDEX(Payments!C$2:C$100,SMALL(IF(Payments!$C$2:$C$100<>\"\",IF(Payments!$C$2:$C$100=$B$2,ROW($C$7:$C$105)-ROW($C$7)+1)),ROWS(D$5:D53))))","v":""},{"$f":"IF(ROWS(E$5:E53)>COUNTIF(Payments!$C$2:$C$100,$B$2),\"\",INDEX(Payments!D$2:D$100,SMALL(IF(Payments!$C$2:$C$100<>\"\",IF(Payments!$C$2:$C$100=$B$2,ROW($C$7:$C$105)-ROW($C$7)+1)),ROWS(E$5:E53))))","v":""},{"$f":"IF(ROWS(F$5:F53)>COUNTIF(Payments!$C$2:$C$100,$B$2),\"\",INDEX(Payments!E$2:E$100,SMALL(IF(Payments!$C$2:$C$100<>\"\",IF(Payments!$C$2:$C$100=$B$2,ROW($C$7:$C$105)-ROW($C$7)+1)),ROWS(F$5:F53))))","v":""},{"$f":"IF(ROWS(G$5:G53)>COUNTIF(Payments!$C$2:$C$100,$B$2),\"\",INDEX(Payments!F$2:F$100,SMALL(IF(Payments!$C$2:$C$100<>\"\",IF(Payments!$C$2:$C$100=$B$2,ROW($C$7:$C$105)-ROW($C$7)+1)),ROWS(G$5:G53))))","v":""}]
[null,{"$f":"IF(C54=\"\",\"\",MAX($B$4:B53)+1)","v":""},{"$f":"IF(ROWS(C$5:C54)>COUNTIF(Payments!$C$2:$C$100,$B$2),\"\",INDEX(Payments!B$2:B$100,SMALL(IF(Payments!$C$2:$C$100<>\"\",IF(Payments!$C$2:$C$100=$B$2,ROW($C$7:$C$105)-ROW($C$7)+1)),ROWS(C$5:C54))))","v":""},{"$f":"IF(ROWS(D$5:D54)>COUNTIF(Payments!$C$2:$C$100,$B$2),\"\",INDEX(Payments!C$2:C$100,SMALL(IF(Payments!$C$2:$C$100<>\"\",IF(Payments!$C$2:$C$100=$B$2,ROW($C$7:$C$105)-ROW($C$7)+1)),ROWS(D$5:D54))))","v":""},{"$f":"IF(ROWS(E$5:E54)>COUNTIF(Payments!$C$2:$C$100,$B$2),\"\",INDEX(Payments!D$2:D$100,SMALL(IF(Payments!$C$2:$C$100<>\"\",IF(Payments!$C$2:$C$100=$B$2,ROW($C$7:$C$105)-ROW($C$7)+1)),ROWS(E$5:E54))))","v":""},{"$f":"IF(ROWS(F$5:F54)>COUNTIF(Payments!$C$2:$C$100,$B$2),\"\",INDEX(Payments!E$2:E$100,SMALL(IF(Payments!$C$2:$C$100<>\"\",IF(Payments!$C$2:$C$100=$B$2,ROW($C$7:$C$105)-ROW($C$7)+1)),ROWS(F$5:F54))))","v":""},{"$f":"IF(ROWS(G$5:G54)>COUNTIF(Payments!$C$2:$C$100,$B$2),\"\",INDEX(Payments!F$2:F$100,SMALL(IF(Payments!$C$2:$C$100<>\"\",IF(Payments!$C$2:$C$100=$B$2,ROW($C$7:$C$105)-ROW($C$7)+1)),ROWS(G$5:G54))))","v":""}]
[null,{"$f":"IF(C55=\"\",\"\",MAX($B$4:B54)+1)","v":""},{"$f":"IF(ROWS(C$5:C55)>COUNTIF(Payments!$C$2:$C$100,$B$2),\"\",INDEX(Payments!B$2:B$100,SMALL(IF(Payments!$C$2:$C$100<>\"\",IF(Payments!$C$2:$C$100=$B$2,ROW($C$7:$C$105)-ROW($C$7)+1)),ROWS(C$5:C55))))","v":""},{"$f":"IF(ROWS(D$5:D55)>COUNTIF(Payments!$C$2:$C$100,$B$2),\"\",INDEX(Payments!C$2:C$100,SMALL(IF(Payments!$C$2:$C$100<>\"\",IF(Payments!$C$2:$C$100=$B$2,ROW($C$7:$C$105)-ROW($C$7)+1)),ROWS(D$5:D55))))","v":""},{"$f":"IF(ROWS(E$5:E55)>COUNTIF(Payments!$C$2:$C$100,$B$2),\"\",INDEX(Payments!D$2:D$100,SMALL(IF(Payments!$C$2:$C$100<>\"\",IF(Payments!$C$2:$C$100=$B$2,ROW($C$7:$C$105)-ROW($C$7)+1)),ROWS(E$5:E55))))","v":""},{"$f":"IF(ROWS(F$5:F55)>COUNTIF(Payments!$C$2:$C$100,$B$2),\"\",INDEX(Payments!E$2:E$100,SMALL(IF(Payments!$C$2:$C$100<>\"\",IF(Payments!$C$2:$C$100=$B$2,ROW($C$7:$C$105)-ROW($C$7)+1)),ROWS(F$5:F55))))","v":""},{"$f":"IF(ROWS(G$5:G55)>COUNTIF(Payments!$C$2:$C$100,$B$2),\"\",INDEX(Payments!F$2:F$100,SMALL(IF(Payments!$C$2:$C$100<>\"\",IF(Payments!$C$2:$C$100=$B$2,ROW($C$7:$C$105)-ROW($C$7)+1)),ROWS(G$5:G55))))","v":""}]
[null,{"$f":"IF(C56=\"\",\"\",MAX($B$4:B55)+1)","v":""},{"$f":"IF(ROWS(C$5:C56)>COUNTIF(Payments!$C$2:$C$100,$B$2),\"\",INDEX(Payments!B$2:B$100,SMALL(IF(Payments!$C$2:$C$100<>\"\",IF(Payments!$C$2:$C$100=$B$2,ROW($C$7:$C$105)-ROW($C$7)+1)),ROWS(C$5:C56))))","v":""},{"$f":"IF(ROWS(D$5:D56)>COUNTIF(Payments!$C$2:$C$100,$B$2),\"\",INDEX(Payments!C$2:C$100,SMALL(IF(Payments!$C$2:$C$100<>\"\",IF(Payments!$C$2:$C$100=$B$2,ROW($C$7:$C$105)-ROW($C$7)+1)),ROWS(D$5:D56))))","v":""},{"$f":"IF(ROWS(E$5:E56)>COUNTIF(Payments!$C$2:$C$100,$B$2),\"\",INDEX(Payments!D$2:D$100,SMALL(IF(Payments!$C$2:$C$100<>\"\",IF(Payments!$C$2:$C$100=$B$2,ROW($C$7:$C$105)-ROW($C$7)+1)),ROWS(E$5:E56))))","v":""},{"$f":"IF(ROWS(F$5:F56)>COUNTIF(Payments!$C$2:$C$100,$B$2),\"\",INDEX(Payments!E$2:E$100,SMALL(IF(Payments!$C$2:$C$100<>\"\",IF(Payments!$C$2:$C$100=$B$2,ROW($C$7:$C$105)-ROW($C$7)+1)),ROWS(F$5:F56))))","v":""},{"$f":"IF(ROWS(G$5:G56)>COUNTIF(Payments!$C$2:$C$100,$B$2),\"\",INDEX(Payments!F$2:F$100,SMALL(IF(Payments!$C$2:$C$100<>\"\",IF(Payments!$C$2:$C$100=$B$2,ROW($C$7:$C$105)-ROW($C$7)+1)),ROWS(G$5:G56))))","v":""}]
[null,{"$f":"IF(C57=\"\",\"\",MAX($B$4:B56)+1)","v":""},{"$f":"IF(ROWS(C$5:C57)>COUNTIF(Payments!$C$2:$C$100,$B$2),\"\",INDEX(Payments!B$2:B$100,SMALL(IF(Payments!$C$2:$C$100<>\"\",IF(Payments!$C$2:$C$100=$B$2,ROW($C$7:$C$105)-ROW($C$7)+1)),ROWS(C$5:C57))))","v":""},{"$f":"IF(ROWS(D$5:D57)>COUNTIF(Payments!$C$2:$C$100,$B$2),\"\",INDEX(Payments!C$2:C$100,SMALL(IF(Payments!$C$2:$C$100<>\"\",IF(Payments!$C$2:$C$100=$B$2,ROW($C$7:$C$105)-ROW($C$7)+1)),ROWS(D$5:D57))))","v":""},{"$f":"IF(ROWS(E$5:E57)>COUNTIF(Payments!$C$2:$C$100,$B$2),\"\",INDEX(Payments!D$2:D$100,SMALL(IF(Payments!$C$2:$C$100<>\"\",IF(Payments!$C$2:$C$100=$B$2,ROW($C$7:$C$105)-ROW($C$7)+1)),ROWS(E$5:E57))))","v":""},{"$f":"IF(ROWS(F$5:F57)>COUNTIF(Payments!$C$2:$C$100,$B$2),\"\",INDEX(Payments!E$2:E$100,SMALL(IF(Payments!$C$2:$C$100<>\"\",IF(Payments!$C$2:$C$100=$B$2,ROW($C$7:$C$105)-ROW($C$7)+1)),ROWS(F$5:F57))))","v":""},{"$f":"IF(ROWS(G$5:G57)>COUNTIF(Payments!$C$2:$C$100,$B$2),\"\",INDEX(Payments!F$2:F$100,SMALL(IF(Payments!$C$2:$C$100<>\"\",IF(Payments!$C$2:$C$100=$B$2,ROW($C$7:$C$105)-ROW($C$7)+1)),ROWS(G$5:G57))))","v":""}]
[null,{"$f":"IF(C58=\"\",\"\",MAX($B$4:B57)+1)","v":""},{"$f":"IF(ROWS(C$5:C58)>COUNTIF(Payments!$C$2:$C$100,$B$2),\"\",INDEX(Payments!B$2:B$100,SMALL(IF(Payments!$C$2:$C$100<>\"\",IF(Payments!$C$2:$C$100=$B$2,ROW($C$7:$C$105)-ROW($C$7)+1)),ROWS(C$5:C58))))","v":""},{"$f":"IF(ROWS(D$5:D58)>COUNTIF(Payments!$C$2:$C$100,$B$2),\"\",INDEX(Payments!C$2:C$100,SMALL(IF(Payments!$C$2:$C$100<>\"\",IF(Payments!$C$2:$C$100=$B$2,ROW($C$7:$C$105)-ROW($C$7)+1)),ROWS(D$5:D58))))","v":""},{"$f":"IF(ROWS(E$5:E58)>COUNTIF(Payments!$C$2:$C$100,$B$2),\"\",INDEX(Payments!D$2:D$100,SMALL(IF(Payments!$C$2:$C$100<>\"\",IF(Payments!$C$2:$C$100=$B$2,ROW($C$7:$C$105)-ROW($C$7)+1)),ROWS(E$5:E58))))","v":""},{"$f":"IF(ROWS(F$5:F58)>COUNTIF(Payments!$C$2:$C$100,$B$2),\"\",INDEX(Payments!E$2:E$100,SMALL(IF(Payments!$C$2:$C$100<>\"\",IF(Payments!$C$2:$C$100=$B$2,ROW($C$7:$C$105)-ROW($C$7)+1)),ROWS(F$5:F58))))","v":""},{"$f":"IF(ROWS(G$5:G58)>COUNTIF(Payments!$C$2:$C$100,$B$2),\"\",INDEX(Payments!F$2:F$100,SMALL(IF(Payments!$C$2:$C$100<>\"\",IF(Payments!$C$2:$C$100=$B$2,ROW($C$7:$C$105)-ROW($C$7)+1)),ROWS(G$5:G58))))","v":""}]
[null,{"$f":"IF(C59=\"\",\"\",MAX($B$4:B58)+1)","v":""},{"$f":"IF(ROWS(C$5:C59)>COUNTIF(Payments!$C$2:$C$100,$B$2),\"\",INDEX(Payments!B$2:B$100,SMALL(IF(Payments!$C$2:$C$100<>\"\",IF(Payments!$C$2:$C$100=$B$2,ROW($C$7:$C$105)-ROW($C$7)+1)),ROWS(C$5:C59))))","v":""},{"$f":"IF(ROWS(D$5:D59)>COUNTIF(Payments!$C$2:$C$100,$B$2),\"\",INDEX(Payments!C$2:C$100,SMALL(IF(Payments!$C$2:$C$100<>\"\",IF(Payments!$C$2:$C$100=$B$2,ROW($C$7:$C$105)-ROW($C$7)+1)),ROWS(D$5:D59))))","v":""},{"$f":"IF(ROWS(E$5:E59)>COUNTIF(Payments!$C$2:$C$100,$B$2),\"\",INDEX(Payments!D$2:D$100,SMALL(IF(Payments!$C$2:$C$100<>\"\",IF(Payments!$C$2:$C$100=$B$2,ROW($C$7:$C$105)-ROW($C$7)+1)),ROWS(E$5:E59))))","v":""},{"$f":"IF(ROWS(F$5:F59)>COUNTIF(Payments!$C$2:$C$100,$B$2),\"\",INDEX(Payments!E$2:E$100,SMALL(IF(Payments!$C$2:$C$100<>\"\",IF(Payments!$C$2:$C$100=$B$2,ROW($C$7:$C$105)-ROW($C$7)+1)),ROWS(F$5:F59))))","v":""},{"$f":"IF(ROWS(G$5:G59)>COUNTIF(Payments!$C$2:$C$100,$B$2),\"\",INDEX(Payments!F$2:F$100,SMALL(IF(Payments!$C$2:$C$100<>\"\",IF(Payments!$C$2:$C$100=$B$2,ROW($C$7:$C$105)-ROW($C$7)+1)),ROWS(G$5:G59))))","v":""}]
[null,{"$f":"IF(C60=\"\",\"\",MAX($B$4:B59)+1)","v":""},{"$f":"IF(ROWS(C$5:C60)>COUNTIF(Payments!$C$2:$C$100,$B$2),\"\",INDEX(Payments!B$2:B$100,SMALL(IF(Payments!$C$2:$C$100<>\"\",IF(Payments!$C$2:$C$100=$B$2,ROW($C$7:$C$105)-ROW($C$7)+1)),ROWS(C$5:C60))))","v":""},{"$f":"IF(ROWS(D$5:D60)>COUNTIF(Payments!$C$2:$C$100,$B$2),\"\",INDEX(Payments!C$2:C$100,SMALL(IF(Payments!$C$2:$C$100<>\"\",IF(Payments!$C$2:$C$100=$B$2,ROW($C$7:$C$105)-ROW($C$7)+1)),ROWS(D$5:D60))))","v":""},{"$f":"IF(ROWS(E$5:E60)>COUNTIF(Payments!$C$2:$C$100,$B$2),\"\",INDEX(Payments!D$2:D$100,SMALL(IF(Payments!$C$2:$C$100<>\"\",IF(Payments!$C$2:$C$100=$B$2,ROW($C$7:$C$105)-ROW($C$7)+1)),ROWS(E$5:E60))))","v":""},{"$f":"IF(ROWS(F$5:F60)>COUNTIF(Payments!$C$2:$C$100,$B$2),\"\",INDEX(Payments!E$2:E$100,SMALL(IF(Payments!$C$2:$C$100<>\"\",IF(Payments!$C$2:$C$100=$B$2,ROW($C$7:$C$105)-ROW($C$7)+1)),ROWS(F$5:F60))))","v":""},{"$f":"IF(ROWS(G$5:G60)>COUNTIF(Payments!$C$2:$C$100,$B$2),\"\",INDEX(Payments!F$2:F$100,SMALL(IF(Payments!$C$2:$C$100<>\"\",IF(Payments!$C$2:$C$100=$B$2,ROW($C$7:$C$105)-ROW($C$7)+1)),ROWS(G$5:G60))))","v":""}]
[null,{"$f":"IF(C61=\"\",\"\",MAX($B$4:B60)+1)","v":""},{"$f":"IF(ROWS(C$5:C61)>COUNTIF(Payments!$C$2:$C$100,$B$2),\"\",INDEX(Payments!B$2:B$100,SMALL(IF(Payments!$C$2:$C$100<>\"\",IF(Payments!$C$2:$C$100=$B$2,ROW($C$7:$C$105)-ROW($C$7)+1)),ROWS(C$5:C61))))","v":""},{"$f":"IF(ROWS(D$5:D61)>COUNTIF(Payments!$C$2:$C$100,$B$2),\"\",INDEX(Payments!C$2:C$100,SMALL(IF(Payments!$C$2:$C$100<>\"\",IF(Payments!$C$2:$C$100=$B$2,ROW($C$7:$C$105)-ROW($C$7)+1)),ROWS(D$5:D61))))","v":""},{"$f":"IF(ROWS(E$5:E61)>COUNTIF(Payments!$C$2:$C$100,$B$2),\"\",INDEX(Payments!D$2:D$100,SMALL(IF(Payments!$C$2:$C$100<>\"\",IF(Payments!$C$2:$C$100=$B$2,ROW($C$7:$C$105)-ROW($C$7)+1)),ROWS(E$5:E61))))","v":""},{"$f":"IF(ROWS(F$5:F61)>COUNTIF(Payments!$C$2:$C$100,$B$2),\"\",INDEX(Payments!E$2:E$100,SMALL(IF(Payments!$C$2:$C$100<>\"\",IF(Payments!$C$2:$C$100=$B$2,ROW($C$7:$C$105)-ROW($C$7)+1)),ROWS(F$5:F61))))","v":""},{"$f":"IF(ROWS(G$5:G61)>COUNTIF(Payments!$C$2:$C$100,$B$2),\"\",INDEX(Payments!F$2:F$100,SMALL(IF(Payments!$C$2:$C$100<>\"\",IF(Payments!$C$2:$C$100=$B$2,ROW($C$7:$C$105)-ROW($C$7)+1)),ROWS(G$5:G61))))","v":""}]
[null,{"$f":"IF(C62=\"\",\"\",MAX($B$4:B61)+1)","v":""},{"$f":"IF(ROWS(C$5:C62)>COUNTIF(Payments!$C$2:$C$100,$B$2),\"\",INDEX(Payments!B$2:B$100,SMALL(IF(Payments!$C$2:$C$100<>\"\",IF(Payments!$C$2:$C$100=$B$2,ROW($C$7:$C$105)-ROW($C$7)+1)),ROWS(C$5:C62))))","v":""},{"$f":"IF(ROWS(D$5:D62)>COUNTIF(Payments!$C$2:$C$100,$B$2),\"\",INDEX(Payments!C$2:C$100,SMALL(IF(Payments!$C$2:$C$100<>\"\",IF(Payments!$C$2:$C$100=$B$2,ROW($C$7:$C$105)-ROW($C$7)+1)),ROWS(D$5:D62))))","v":""},{"$f":"IF(ROWS(E$5:E62)>COUNTIF(Payments!$C$2:$C$100,$B$2),\"\",INDEX(Payments!D$2:D$100,SMALL(IF(Payments!$C$2:$C$100<>\"\",IF(Payments!$C$2:$C$100=$B$2,ROW($C$7:$C$105)-ROW($C$7)+1)),ROWS(E$5:E62))))","v":""},{"$f":"IF(ROWS(F$5:F62)>COUNTIF(Payments!$C$2:$C$100,$B$2),\"\",INDEX(Payments!E$2:E$100,SMALL(IF(Payments!$C$2:$C$100<>\"\",IF(Payments!$C$2:$C$100=$B$2,ROW($C$7:$C$105)-ROW($C$7)+1)),ROWS(F$5:F62))))","v":""},{"$f":"IF(ROWS(G$5:G62)>COUNTIF(Payments!$C$2:$C$100,$B$2),\"\",INDEX(Payments!F$2:F$100,SMALL(IF(Payments!$C$2:$C$100<>\"\",IF(Payments!$C$2:$C$100=$B$2,ROW($C$7:$C$105)-ROW($C$7)+1)),ROWS(G$5:G62))))","v":""}]
[null,{"$f":"IF(C63=\"\",\"\",MAX($B$4:B62)+1)","v":""},{"$f":"IF(ROWS(C$5:C63)>COUNTIF(Payments!$C$2:$C$100,$B$2),\"\",INDEX(Payments!B$2:B$100,SMALL(IF(Payments!$C$2:$C$100<>\"\",IF(Payments!$C$2:$C$100=$B$2,ROW($C$7:$C$105)-ROW($C$7)+1)),ROWS(C$5:C63))))","v":""},{"$f":"IF(ROWS(D$5:D63)>COUNTIF(Payments!$C$2:$C$100,$B$2),\"\",INDEX(Payments!C$2:C$100,SMALL(IF(Payments!$C$2:$C$100<>\"\",IF(Payments!$C$2:$C$100=$B$2,ROW($C$7:$C$105)-ROW($C$7)+1)),ROWS(D$5:D63))))","v":""},{"$f":"IF(ROWS(E$5:E63)>COUNTIF(Payments!$C$2:$C$100,$B$2),\"\",INDEX(Payments!D$2:D$100,SMALL(IF(Payments!$C$2:$C$100<>\"\",IF(Payments!$C$2:$C$100=$B$2,ROW($C$7:$C$105)-ROW($C$7)+1)),ROWS(E$5:E63))))","v":""},{"$f":"IF(ROWS(F$5:F63)>COUNTIF(Payments!$C$2:$C$100,$B$2),\"\",INDEX(Payments!E$2:E$100,SMALL(IF(Payments!$C$2:$C$100<>\"\",IF(Payments!$C$2:$C$100=$B$2,ROW($C$7:$C$105)-ROW($C$7)+1)),ROWS(F$5:F63))))","v":""},{"$f":"IF(ROWS(G$5:G63)>COUNTIF(Payments!$C$2:$C$100,$B$2),\"\",INDEX(Payments!F$2:F$100,SMALL(IF(Payments!$C$2:$C$100<>\"\",IF(Payments!$C$2:$C$100=$B$2,ROW($C$7:$C$105)-ROW($C$7)+1)),ROWS(G$5:G63))))","v":""}]
[null,{"$f":"IF(C64=\"\",\"\",MAX($B$4:B63)+1)","v":""},{"$f":"IF(ROWS(C$5:C64)>COUNTIF(Payments!$C$2:$C$100,$B$2),\"\",INDEX(Payments!B$2:B$100,SMALL(IF(Payments!$C$2:$C$100<>\"\",IF(Payments!$C$2:$C$100=$B$2,ROW($C$7:$C$105)-ROW($C$7)+1)),ROWS(C$5:C64))))","v":""},{"$f":"IF(ROWS(D$5:D64)>COUNTIF(Payments!$C$2:$C$100,$B$2),\"\",INDEX(Payments!C$2:C$100,SMALL(IF(Payments!$C$2:$C$100<>\"\",IF(Payments!$C$2:$C$100=$B$2,ROW($C$7:$C$105)-ROW($C$7)+1)),ROWS(D$5:D64))))","v":""},{"$f":"IF(ROWS(E$5:E64)>COUNTIF(Payments!$C$2:$C$100,$B$2),\"\",INDEX(Payments!D$2:D$100,SMALL(IF(Payments!$C$2:$C$100<>\"\",IF(Payments!$C$2:$C$100=$B$2,ROW($C$7:$C$105)-ROW($C$7)+1)),ROWS(E$5:E64))))","v":""},{"$f":"IF(ROWS(F$5:F64)>COUNTIF(Payments!$C$2:$C$100,$B$2),\"\",INDEX(Payments!E$2:E$100,SMALL(IF(Payments!$C$2:$C$100<>\"\",IF(Payments!$C$2:$C$100=$B$2,ROW($C$7:$C$105)-ROW($C$7)+1)),ROWS(F$5:F64))))","v":""},{"$f":"IF(ROWS(G$5:G64)>COUNTIF(Payments!$C$2:$C$100,$B$2),\"\",INDEX(Payments!F$2:F$100,SMALL(IF(Payments!$C$2:$C$100<>\"\",IF(Payments!$C$2:$C$100=$B$2,ROW($C$7:$C$105)-ROW($C$7)+1)),ROWS(G$5:G64))))","v":""}]
[null,{"$f":"IF(C65=\"\",\"\",MAX($B$4:B64)+1)","v":""},{"$f":"IF(ROWS(C$5:C65)>COUNTIF(Payments!$C$2:$C$100,$B$2),\"\",INDEX(Payments!B$2:B$100,SMALL(IF(Payments!$C$2:$C$100<>\"\",IF(Payments!$C$2:$C$100=$B$2,ROW($C$7:$C$105)-ROW($C$7)+1)),ROWS(C$5:C65))))","v":""},{"$f":"IF(ROWS(D$5:D65)>COUNTIF(Payments!$C$2:$C$100,$B$2),\"\",INDEX(Payments!C$2:C$100,SMALL(IF(Payments!$C$2:$C$100<>\"\",IF(Payments!$C$2:$C$100=$B$2,ROW($C$7:$C$105)-ROW($C$7)+1)),ROWS(D$5:D65))))","v":""},{"$f":"IF(ROWS(E$5:E65)>COUNTIF(Payments!$C$2:$C$100,$B$2),\"\",INDEX(Payments!D$2:D$100,SMALL(IF(Payments!$C$2:$C$100<>\"\",IF(Payments!$C$2:$C$100=$B$2,ROW($C$7:$C$105)-ROW($C$7)+1)),ROWS(E$5:E65))))","v":""},{"$f":"IF(ROWS(F$5:F65)>COUNTIF(Payments!$C$2:$C$100,$B$2),\"\",INDEX(Payments!E$2:E$100,SMALL(IF(Payments!$C$2:$C$100<>\"\",IF(Payments!$C$2:$C$100=$B$2,ROW($C$7:$C$105)-ROW($C$7)+1)),ROWS(F$5:F65))))","v":""},{"$f":"IF(ROWS(G$5:G65)>COUNTIF(Payments!$C$2:$C$100,$B$2),\"\",INDEX(Payments!F$2:F$100,SMALL(IF(Payments!$C$2:$C$100<>\"\",IF(Payments!$C$2:$C$100=$B$2,ROW($C$7:$C$105)-ROW($C$7)+1)),ROWS(G$5:G65))))","v":""}]
[null,{"$f":"IF(C66=\"\",\"\",MAX($B$4:B65)+1)","v":""},{"$f":"IF(ROWS(C$5:C66)>COUNTIF(Payments!$C$2:$C$100,$B$2),\"\",INDEX(Payments!B$2:B$100,SMALL(IF(Payments!$C$2:$C$100<>\"\",IF(Payments!$C$2:$C$100=$B$2,ROW($C$7:$C$105)-ROW($C$7)+1)),ROWS(C$5:C66))))","v":""},{"$f":"IF(ROWS(D$5:D66)>COUNTIF(Payments!$C$2:$C$100,$B$2),\"\",INDEX(Payments!C$2:C$100,SMALL(IF(Payments!$C$2:$C$100<>\"\",IF(Payments!$C$2:$C$100=$B$2,ROW($C$7:$C$105)-ROW($C$7)+1)),ROWS(D$5:D66))))","v":""},{"$f":"IF(ROWS(E$5:E66)>COUNTIF(Payments!$C$2:$C$100,$B$2),\"\",INDEX(Payments!D$2:D$100,SMALL(IF(Payments!$C$2:$C$100<>\"\",IF(Payments!$C$2:$C$100=$B$2,ROW($C$7:$C$105)-ROW($C$7)+1)),ROWS(E$5:E66))))","v":""},{"$f":"IF(ROWS(F$5:F66)>COUNTIF(Payments!$C$2:$C$100,$B$2),\"\",INDEX(Payments!E$2:E$100,SMALL(IF(Payments!$C$2:$C$100<>\"\",IF(Payments!$C$2:$C$100=$B$2,ROW($C$7:$C$105)-ROW($C$7)+1)),ROWS(F$5:F66))))","v":""},{"$f":"IF(ROWS(G$5:G66)>COUNTIF(Payments!$C$2:$C$100,$B$2),\"\",INDEX(Payments!F$2:F$100,SMALL(IF(Payments!$C$2:$C$100<>\"\",IF(Payments!$C$2:$C$100=$B$2,ROW($C$7:$C$105)-ROW($C$7)+1)),ROWS(G$5:G66))))","v":""}]
[null,{"$f":"IF(C67=\"\",\"\",MAX($B$4:B66)+1)","v":""},{"$f":"IF(ROWS(C$5:C67)>COUNTIF(Payments!$C$2:$C$100,$B$2),\"\",INDEX(Payments!B$2:B$100,SMALL(IF(Payments!$C$2:$C$100<>\"\",IF(Payments!$C$2:$C$100=$B$2,ROW($C$7:$C$105)-ROW($C$7)+1)),ROWS(C$5:C67))))","v":""},{"$f":"IF(ROWS(D$5:D67)>COUNTIF(Payments!$C$2:$C$100,$B$2),\"\",INDEX(Payments!C$2:C$100,SMALL(IF(Payments!$C$2:$C$100<>\"\",IF(Payments!$C$2:$C$100=$B$2,ROW($C$7:$C$105)-ROW($C$7)+1)),ROWS(D$5:D67))))","v":""},{"$f":"IF(ROWS(E$5:E67)>COUNTIF(Payments!$C$2:$C$100,$B$2),\"\",INDEX(Payments!D$2:D$100,SMALL(IF(Payments!$C$2:$C$100<>\"\",IF(Payments!$C$2:$C$100=$B$2,ROW($C$7:$C$105)-ROW($C$7)+1)),ROWS(E$5:E67))))","v":""},{"$f":"IF(ROWS(F$5:F67)>COUNTIF(Payments!$C$2:$C$100,$B$2),\"\",INDEX(Payments!E$2:E$100,SMALL(IF(Payments!$C$2:$C$100<>\"\",IF(Payments!$C$2:$C$100=$B$2,ROW($C$7:$C$105)-ROW($C$7)+1)),ROWS(F$5:F67))))","v":""},{"$f":"IF(ROWS(G$5:G67)>COUNTIF(Payments!$C$2:$C$100,$B$2),\"\",INDEX(Payments!F$2:F$100,SMALL(IF(Payments!$C$2:$C$100<>\"\",IF(Payments!$C$2:$C$100=$B$2,ROW($C$7:$C$105)-ROW($C$7)+1)),ROWS(G$5:G67))))","v":""}]
[]
[]
[null,null,null,null,null,null,null,null,{"$f":"SUM(I2:I69)","v":0}]

{"sheet":"نادي الفروسيه","index":1,"n_rows":70,"n_cols":10,"rows_kept":70,"cut":false,"hidden":false,"merged":[]}
[null,null,null,null,null,"Sum",null,"المستفيد","المبلغ","المشروع"]
[null,"نادي الفروسيه",null,null,null,{"$f":"SUM(F5:F67)","v":42000}]
[]
[null,"م","Date","الموقع","المستفيد","المبلغ","التفاصيل"]
[null,{"$f":"IF(C5=\"\",\"\",MAX($B$4:B4)+1)","v":1},{"$f":"IF(ROWS(C$5:C5)>COUNTIF(Payments!$C$2:$C$100,$B$2),\"\",INDEX(Payments!B$2:B$100,SMALL(IF(Payments!$C$2:$C$100<>\"\",IF(Payments!$C$2:$C$100=$B$2,ROW($C$7:$C$105)-ROW($C$7)+1)),ROWS(C$5:C5))))","v":"2020-12-13"},{"$f":"IF(ROWS(D$5:D5)>COUNTIF(Payments!$C$2:$C$100,$B$2),\"\",INDEX(Payments!C$2:C$100,SMALL(IF(Payments!$C$2:$C$100<>\"\",IF(Payments!$C$2:$C$100=$B$2,ROW($C$7:$C$105)-ROW($C$7)+1)),ROWS(D$5:D5))))","v":"نادي الفروسيه"},{"$f":"IF(ROWS(E$5:E5)>COUNTIF(Payments!$C$2:$C$100,$B$2),\"\",INDEX(Payments!D$2:D$100,SMALL(IF(Payments!$C$2:$C$100<>\"\",IF(Payments!$C$2:$C$100=$B$2,ROW($C$7:$C$105)-ROW($C$7)+1)),ROWS(E$5:E5))))","v":"محمد علي"},{"$f":"IF(ROWS(F$5:F5)>COUNTIF(Payments!$C$2:$C$100,$B$2),\"\",INDEX(Payments!E$2:E$100,SMALL(IF(Payments!$C$2:$C$100<>\"\",IF(Payments!$C$2:$C$100=$B$2,ROW($C$7:$C$105)-ROW($C$7)+1)),ROWS(F$5:F5))))","v":3000},{"$f":"IF(ROWS(G$5:G5)>COUNTIF(Payments!$C$2:$C$100,$B$2),\"\",INDEX(Payments!F$2:F$100,SMALL(IF(Payments!$C$2:$C$100<>\"\",IF(Payments!$C$2:$C$100=$B$2,ROW($C$7:$C$105)-ROW($C$7)+1)),ROWS(G$5:G5))))","v":"توصيلات كهرباء"}]
[null,{"$f":"IF(C6=\"\",\"\",MAX($B$4:B5)+1)","v":2},{"$f":"IF(ROWS(C$5:C6)>COUNTIF(Payments!$C$2:$C$100,$B$2),\"\",INDEX(Payments!B$2:B$100,SMALL(IF(Payments!$C$2:$C$100<>\"\",IF(Payments!$C$2:$C$100=$B$2,ROW($C$7:$C$105)-ROW($C$7)+1)),ROWS(C$5:C6))))","v":"2020-12-13"},{"$f":"IF(ROWS(D$5:D6)>COUNTIF(Payments!$C$2:$C$100,$B$2),\"\",INDEX(Payments!C$2:C$100,SMALL(IF(Payments!$C$2:$C$100<>\"\",IF(Payments!$C$2:$C$100=$B$2,ROW($C$7:$C$105)-ROW($C$7)+1)),ROWS(D$5:D6))))","v":"نادي الفروسيه"},{"$f":"IF(ROWS(E$5:E6)>COUNTIF(Payments!$C$2:$C$100,$B$2),\"\",INDEX(Payments!D$2:D$100,SMALL(IF(Payments!$C$2:$C$100<>\"\",IF(Payments!$C$2:$C$100=$B$2,ROW($C$7:$C$105)-ROW($C$7)+1)),ROWS(E$5:E6))))","v":"النور احمد"},{"$f":"IF(ROWS(F$5:F6)>COUNTIF(Payments!$C$2:$C$100,$B$2),\"\",INDEX(Payments!E$2:E$100,SMALL(IF(Payments!$C$2:$C$100<>\"\",IF(Payments!$C$2:$C$100=$B$2,ROW($C$7:$C$105)-ROW($C$7)+1)),ROWS(F$5:F6))))","v":10000},{"$f":"IF(ROWS(G$5:G6)>COUNTIF(Payments!$C$2:$C$100,$B$2),\"\",INDEX(Payments!F$2:F$100,SMALL(IF(Payments!$C$2:$C$100<>\"\",IF(Payments!$C$2:$C$100=$B$2,ROW($C$7:$C$105)-ROW($C$7)+1)),ROWS(G$5:G6))))","v":"تركيب طاقه شمسيه"}]
[null,{"$f":"IF(C7=\"\",\"\",MAX($B$4:B6)+1)","v":3},{"$f":"IF(ROWS(C$5:C7)>COUNTIF(Payments!$C$2:$C$100,$B$2),\"\",INDEX(Payments!B$2:B$100,SMALL(IF(Payments!$C$2:$C$100<>\"\",IF(Payments!$C$2:$C$100=$B$2,ROW($C$7:$C$105)-ROW($C$7)+1)),ROWS(C$5:C7))))","v":"2020-12-14"},{"$f":"IF(ROWS(D$5:D7)>COUNTIF(Payments!$C$2:$C$100,$B$2),\"\",INDEX(Payments!C$2:C$100,SMALL(IF(Payments!$C$2:$C$100<>\"\",IF(Payments!$C$2:$C$100=$B$2,ROW($C$7:$C$105)-ROW($C$7)+1)),ROWS(D$5:D7))))","v":"نادي الفروسيه"},{"$f":"IF(ROWS(E$5:E7)>COUNTIF(Payments!$C$2:$C$100,$B$2),\"\",INDEX(Payments!D$2:D$100,SMALL(IF(Payments!$C$2:$C$100<>\"\",IF(Payments!$C$2:$C$100=$B$2,ROW($C$7:$C$105)-ROW($C$7)+1)),ROWS(E$5:E7))))","v":"محمد علي"},{"$f":"IF(ROWS(F$5:F7)>COUNTIF(Payments!$C$2:$C$100,$B$2),\"\",INDEX(Payments!E$2:E$100,SMALL(IF(Payments!$C$2:$C$100<>\"\",IF(Payments!$C$2:$C$100=$B$2,ROW($C$7:$C$105)-ROW($C$7)+1)),ROWS(F$5:F7))))","v":1000},{"$f":"IF(ROWS(G$5:G7)>COUNTIF(Payments!$C$2:$C$100,$B$2),\"\",INDEX(Payments!F$2:F$100,SMALL(IF(Payments!$C$2:$C$100<>\"\",IF(Payments!$C$2:$C$100=$B$2,ROW($C$7:$C$105)-ROW($C$7)+1)),ROWS(G$5:G7))))","v":"المسبح"}]
[null,{"$f":"IF(C8=\"\",\"\",MAX($B$4:B7)+1)","v":4},{"$f":"IF(ROWS(C$5:C8)>COUNTIF(Payments!$C$2:$C$100,$B$2),\"\",INDEX(Payments!B$2:B$100,SMALL(IF(Payments!$C$2:$C$100<>\"\",IF(Payments!$C$2:$C$100=$B$2,ROW($C$7:$C$105)-ROW($C$7)+1)),ROWS(C$5:C8))))","v":"2020-12-13"},{"$f":"IF(ROWS(D$5:D8)>COUNTIF(Payments!$C$2:$C$100,$B$2),\"\",INDEX(Payments!C$2:C$100,SMALL(IF(Payments!$C$2:$C$100<>\"\",IF(Payments!$C$2:$C$100=$B$2,ROW($C$7:$C$105)-ROW($C$7)+1)),ROWS(D$5:D8))))","v":"نادي الفروسيه"},{"$f":"IF(ROWS(E$5:E8)>COUNTIF(Payments!$C$2:$C$100,$B$2),\"\",INDEX(Payments!D$2:D$100,SMALL(IF(Payments!$C$2:$C$100<>\"\",IF(Payments!$C$2:$C$100=$B$2,ROW($C$7:$C$105)-ROW($C$7)+1)),ROWS(E$5:E8))))","v":"محمد علي"},{"$f":"IF(ROWS(F$5:F8)>COUNTIF(Payments!$C$2:$C$100,$B$2),\"\",INDEX(Payments!E$2:E$100,SMALL(IF(Payments!$C$2:$C$100<>\"\",IF(Payments!$C$2:$C$100=$B$2,ROW($C$7:$C$105)-ROW($C$7)+1)),ROWS(F$5:F8))))","v":3000},{"$f":"IF(ROWS(G$5:G8)>COUNTIF(Payments!$C$2:$C$100,$B$2),\"\",INDEX(Payments!F$2:F$100,SMALL(IF(Payments!$C$2:$C$100<>\"\",IF(Payments!$C$2:$C$100=$B$2,ROW($C$7:$C$105)-ROW($C$7)+1)),ROWS(G$5:G8))))","v":"توصيلات كهرباء"}]
[null,{"$f":"IF(C9=\"\",\"\",MAX($B$4:B8)+1)","v":5},{"$f":"IF(ROWS(C$5:C9)>COUNTIF(Payments!$C$2:$C$100,$B$2),\"\",INDEX(Payments!B$2:B$100,SMALL(IF(Payments!$C$2:$C$100<>\"\",IF(Payments!$C$2:$C$100=$B$2,ROW($C$7:$C$105)-ROW($C$7)+1)),ROWS(C$5:C9))))","v":"2020-12-13"},{"$f":"IF(ROWS(D$5:D9)>COUNTIF(Payments!$C$2:$C$100,$B$2),\"\",INDEX(Payments!C$2:C$100,SMALL(IF(Payments!$C$2:$C$100<>\"\",IF(Payments!$C$2:$C$100=$B$2,ROW($C$7:$C$105)-ROW($C$7)+1)),ROWS(D$5:D9))))","v":"نادي الفروسيه"},{"$f":"IF(ROWS(E$5:E9)>COUNTIF(Payments!$C$2:$C$100,$B$2),\"\",INDEX(Payments!D$2:D$100,SMALL(IF(Payments!$C$2:$C$100<>\"\",IF(Payments!$C$2:$C$100=$B$2,ROW($C$7:$C$105)-ROW($C$7)+1)),ROWS(E$5:E9))))","v":"النور احمد"},{"$f":"IF(ROWS(F$5:F9)>COUNTIF(Payments!$C$2:$C$100,$B$2),\"\",INDEX(Payments!E$2:E$100,SMALL(IF(Payments!$C$2:$C$100<>\"\",IF(Payments!$C$2:$C$100=$B$2,ROW($C$7:$C$105)-ROW($C$7)+1)),ROWS(F$5:F9))))","v":10000},{"$f":"IF(ROWS(G$5:G9)>COUNTIF(Payments!$C$2:$C$100,$B$2),\"\",INDEX(Payments!F$2:F$100,SMALL(IF(Payments!$C$2:$C$100<>\"\",IF(Payments!$C$2:$C$100=$B$2,ROW($C$7:$C$105)-ROW($C$7)+1)),ROWS(G$5:G9))))","v":"تركيب طاقه شمسيه"}]
[null,{"$f":"IF(C10=\"\",\"\",MAX($B$4:B9)+1)","v":6},{"$f":"IF(ROWS(C$5:C10)>COUNTIF(Payments!$C$2:$C$100,$B$2),\"\",INDEX(Payments!B$2:B$100,SMALL(IF(Payments!$C$2:$C$100<>\"\",IF(Payments!$C$2:$C$100=$B$2,ROW($C$7:$C$105)-ROW($C$7)+1)),ROWS(C$5:C10))))","v":"2020-12-14"},{"$f":"IF(ROWS(D$5:D10)>COUNTIF(Payments!$C$2:$C$100,$B$2),\"\",INDEX(Payments!C$2:C$100,SMALL(IF(Payments!$C$2:$C$100<>\"\",IF(Payments!$C$2:$C$100=$B$2,ROW($C$7:$C$105)-ROW($C$7)+1)),ROWS(D$5:D10))))","v":"نادي الفروسيه"},{"$f":"IF(ROWS(E$5:E10)>COUNTIF(Payments!$C$2:$C$100,$B$2),\"\",INDEX(Payments!D$2:D$100,SMALL(IF(Payments!$C$2:$C$100<>\"\",IF(Payments!$C$2:$C$100=$B$2,ROW($C$7:$C$105)-ROW($C$7)+1)),ROWS(E$5:E10))))","v":"محمد علي"},{"$f":"IF(ROWS(F$5:F10)>COUNTIF(Payments!$C$2:$C$100,$B$2),\"\",INDEX(Payments!E$2:E$100,SMALL(IF(Payments!$C$2:$C$100<>\"\",IF(Payments!$C$2:$C$100=$B$2,ROW($C$7:$C$105)-ROW($C$7)+1)),ROWS(F$5:F10))))","v":1000},{"$f":"IF(ROWS(G$5:G10)>COUNTIF(Payments!$C$2:$C$100,$B$2),\"\",INDEX(Payments!F$2:F$100,SMALL(IF(Payments!$C$2:$C$100<>\"\",IF(Payments!$C$2:$C$100=$B$2,ROW($C$7:$C$105)-ROW($C$7)+1)),ROWS(G$5:G10))))","v":"المسبح"}]
[null,{"$f":"IF(C11=\"\",\"\",MAX($B$4:B10)+1)","v":7},{"$f":"IF(ROWS(C$5:C11)>COUNTIF(Payments!$C$2:$C$100,$B$2),\"\",INDEX(Payments!B$2:B$100,SMALL(IF(Payments!$C$2:$C$100<>\"\",IF(Payments!$C$2:$C$100=$B$2,ROW($C$7:$C$105)-ROW($C$7)+1)),ROWS(C$5:C11))))","v":"2020-12-13"},{"$f":"IF(ROWS(D$5:D11)>COUNTIF(Payments!$C$2:$C$100,$B$2),\"\",INDEX(Payments!C$2:C$100,SMALL(IF(Payments!$C$2:$C$100<>\"\",IF(Payments!$C$2:$C$100=$B$2,ROW($C$7:$C$105)-ROW($C$7)+1)),ROWS(D$5:D11))))","v":"نادي الفروسيه"},{"$f":"IF(ROWS(E$5:E11)>COUNTIF(Payments!$C$2:$C$100,$B$2),\"\",INDEX(Payments!D$2:D$100,SMALL(IF(Payments!$C$2:$C$100<>\"\",IF(Payments!$C$2:$C$100=$B$2,ROW($C$7:$C$105)-ROW($C$7)+1)),ROWS(E$5:E11))))","v":"Officena"},{"$f":"IF(ROWS(F$5:F11)>COUNTIF(Payments!$C$2:$C$100,$B$2),\"\",INDEX(Payments!E$2:E$100,SMALL(IF(Payments!$C$2:$C$100<>\"\",IF(Payments!$C$2:$C$100=$B$2,ROW($C$7:$C$105)-ROW($C$7)+1)),ROWS(F$5:F11))))","v":3000},{"$f":"IF(ROWS(G$5:G11)>COUNTIF(Payments!$C$2:$C$100,$B$2),\"\",INDEX(Payments!F$2:F$100,SMALL(IF(Payments!$C$2:$C$100<>\"\",IF(Payments!$C$2:$C$100=$B$2,ROW($C$7:$C$105)-ROW($C$7)+1)),ROWS(G$5:G11))))","v":"توصيلات كهرباء"}]
[null,{"$f":"IF(C12=\"\",\"\",MAX($B$4:B11)+1)","v":8},{"$f":"IF(ROWS(C$5:C12)>COUNTIF(Payments!$C$2:$C$100,$B$2),\"\",INDEX(Payments!B$2:B$100,SMALL(IF(Payments!$C$2:$C$100<>\"\",IF(Payments!$C$2:$C$100=$B$2,ROW($C$7:$C$105)-ROW($C$7)+1)),ROWS(C$5:C12))))","v":"2020-12-13"},{"$f":"IF(ROWS(D$5:D12)>COUNTIF(Payments!$C$2:$C$100,$B$2),\"\",INDEX(Payments!C$2:C$100,SMALL(IF(Payments!$C$2:$C$100<>\"\",IF(Payments!$C$2:$C$100=$B$2,ROW($C$7:$C$105)-ROW($C$7)+1)),ROWS(D$5:D12))))","v":"نادي الفروسيه"},{"$f":"IF(ROWS(E$5:E12)>COUNTIF(Payments!$C$2:$C$100,$B$2),\"\",INDEX(Payments!D$2:D$100,SMALL(IF(Payments!$C$2:$C$100<>\"\",IF(Payments!$C$2:$C$100=$B$2,ROW($C$7:$C$105)-ROW($C$7)+1)),ROWS(E$5:E12))))","v":"Officena"},{"$f":"IF(ROWS(F$5:F12)>COUNTIF(Payments!$C$2:$C$100,$B$2),\"\",INDEX(Payments!E$2:E$100,SMALL(IF(Payments!$C$2:$C$100<>\"\",IF(Payments!$C$2:$C$100=$B$2,ROW($C$7:$C$105)-ROW($C$7)+1)),ROWS(F$5:F12))))","v":10000},{"$f":"IF(ROWS(G$5:G12)>COUNTIF(Payments!$C$2:$C$100,$B$2),\"\",INDEX(Payments!F$2:F$100,SMALL(IF(Payments!$C$2:$C$100<>\"\",IF(Payments!$C$2:$C$100=$B$2,ROW($C$7:$C$105)-ROW($C$7)+1)),ROWS(G$5:G12))))","v":"تركيب طاقه شمسيه"}]
[null,{"$f":"IF(C13=\"\",\"\",MAX($B$4:B12)+1)","v":9},{"$f":"IF(ROWS(C$5:C13)>COUNTIF(Payments!$C$2:$C$100,$B$2),\"\",INDEX(Payments!B$2:B$100,SMALL(IF(Payments!$C$2:$C$100<>\"\",IF(Payments!$C$2:$C$100=$B$2,ROW($C$7:$C$105)-ROW($C$7)+1)),ROWS(C$5:C13))))","v":"2020-12-14"},{"$f":"IF(ROWS(D$5:D13)>COUNTIF(Payments!$C$2:$C$100,$B$2),\"\",INDEX(Payments!C$2:C$100,SMALL(IF(Payments!$C$2:$C$100<>\"\",IF(Payments!$C$2:$C$100=$B$2,ROW($C$7:$C$105)-ROW($C$7)+1)),ROWS(D$5:D13))))","v":"نادي الفروسيه"},{"$f":"IF(ROWS(E$5:E13)>COUNTIF(Payments!$C$2:$C$100,$B$2),\"\",INDEX(Payments!D$2:D$100,SMALL(IF(Payments!$C$2:$C$100<>\"\",IF(Payments!$C$2:$C$100=$B$2,ROW($C$7:$C$105)-ROW($C$7)+1)),ROWS(E$5:E13))))","v":"Officena"},{"$f":"IF(ROWS(F$5:F13)>COUNTIF(Payments!$C$2:$C$100,$B$2),\"\",INDEX(Payments!E$2:E$100,SMALL(IF(Payments!$C$2:$C$100<>\"\",IF(Payments!$C$2:$C$100=$B$2,ROW($C$7:$C$105)-ROW($C$7)+1)),ROWS(F$5:F13))))","v":1000},{"$f":"IF(ROWS(G$5:G13)>COUNTIF(Payments!$C$2:$C$100,$B$2),\"\",INDEX(Payments!F$2:F$100,SMALL(IF(Payments!$C$2:$C$100<>\"\",IF(Payments!$C$2:$C$100=$B$2,ROW($C$7:$C$105)-ROW($C$7)+1)),ROWS(G$5:G13))))","v":"المسبح"}]
[null,{"$f":"IF(C14=\"\",\"\",MAX($B$4:B13)+1)","v":""},{"$f":"IF(ROWS(C$5:C14)>COUNTIF(Payments!$C$2:$C$100,$B$2),\"\",INDEX(Payments!B$2:B$100,SMALL(IF(Payments!$C$2:$C$100<>\"\",IF(Payments!$C$2:$C$100=$B$2,ROW($C$7:$C$105)-ROW($C$7)+1)),ROWS(C$5:C14))))","v":""},{"$f":"IF(ROWS(D$5:D14)>COUNTIF(Payments!$C$2:$C$100,$B$2),\"\",INDEX(Payments!C$2:C$100,SMALL(IF(Payments!$C$2:$C$100<>\"\",IF(Payments!$C$2:$C$100=$B$2,ROW($C$7:$C$105)-ROW($C$7)+1)),ROWS(D$5:D14))))","v":""},{"$f":"IF(ROWS(E$5:E14)>COUNTIF(Payments!$C$2:$C$100,$B$2),\"\",INDEX(Payments!D$2:D$100,SMALL(IF(Payments!$C$2:$C$100<>\"\",IF(Payments!$C$2:$C$100=$B$2,ROW($C$7:$C$105)-ROW($C$7)+1)),ROWS(E$5:E14))))","v":""},{"$f":"IF(ROWS(F$5:F14)>COUNTIF(Payments!$C$2:$C$100,$B$2),\"\",INDEX(Payments!E$2:E$100,SMALL(IF(Payments!$C$2:$C$100<>\"\",IF(Payments!$C$2:$C$100=$B$2,ROW($C$7:$C$105)-ROW($C$7)+1)),ROWS(F$5:F14))))","v":""},{"$f":"IF(ROWS(G$5:G14)>COUNTIF(Payments!$C$2:$C$100,$B$2),\"\",INDEX(Payments!F$2:F$100,SMALL(IF(Payments!$C$2:$C$100<>\"\",IF(Payments!$C$2:$C$100=$B$2,ROW($C$7:$C$105)-ROW($C$7)+1)),ROWS(G$5:G14))))","v":""}]
[null,{"$f":"IF(C15=\"\",\"\",MAX($B$4:B14)+1)","v":""},{"$f":"IF(ROWS(C$5:C15)>COUNTIF(Payments!$C$2:$C$100,$B$2),\"\",INDEX(Payments!B$2:B$100,SMALL(IF(Payments!$C$2:$C$100<>\"\",IF(Payments!$C$2:$C$100=$B$2,ROW($C$7:$C$105)-ROW($C$7)+1)),ROWS(C$5:C15))))","v":""},{"$f":"IF(ROWS(D$5:D15)>COUNTIF(Payments!$C$2:$C$100,$B$2),\"\",INDEX(Payments!C$2:C$100,SMALL(IF(Payments!$C$2:$C$100<>\"\",IF(Payments!$C$2:$C$100=$B$2,ROW($C$7:$C$105)-ROW($C$7)+1)),ROWS(D$5:D15))))","v":""},{"$f":"IF(ROWS(E$5:E15)>COUNTIF(Payments!$C$2:$C$100,$B$2),\"\",INDEX(Payments!D$2:D$100,SMALL(IF(Payments!$C$2:$C$100<>\"\",IF(Payments!$C$2:$C$100=$B$2,ROW($C$7:$C$105)-ROW($C$7)+1)),ROWS(E$5:E15))))","v":""},{"$f":"IF(ROWS(F$5:F15)>COUNTIF(Payments!$C$2:$C$100,$B$2),\"\",INDEX(Payments!E$2:E$100,SMALL(IF(Payments!$C$2:$C$100<>\"\",IF(Payments!$C$2:$C$100=$B$2,ROW($C$7:$C$105)-ROW($C$7)+1)),ROWS(F$5:F15))))","v":""},{"$f":"IF(ROWS(G$5:G15)>COUNTIF(Payments!$C$2:$C$100,$B$2),\"\",INDEX(Payments!F$2:F$100,SMALL(IF(Payments!$C$2:$C$100<>\"\",IF(Payments!$C$2:$C$100=$B$2,ROW($C$7:$C$105)-ROW($C$7)+1)),ROWS(G$5:G15))))","v":""}]
[null,{"$f":"IF(C16=\"\",\"\",MAX($B$4:B15)+1)","v":""},{"$f":"IF(ROWS(C$5:C16)>COUNTIF(Payments!$C$2:$C$100,$B$2),\"\",INDEX(Payments!B$2:B$100,SMALL(IF(Payments!$C$2:$C$100<>\"\",IF(Payments!$C$2:$C$100=$B$2,ROW($C$7:$C$105)-ROW($C$7)+1)),ROWS(C$5:C16))))","v":""},{"$f":"IF(ROWS(D$5:D16)>COUNTIF(Payments!$C$2:$C$100,$B$2),\"\",INDEX(Payments!C$2:C$100,SMALL(IF(Payments!$C$2:$C$100<>\"\",IF(Payments!$C$2:$C$100=$B$2,ROW($C$7:$C$105)-ROW($C$7)+1)),ROWS(D$5:D16))))","v":""},{"$f":"IF(ROWS(E$5:E16)>COUNTIF(Payments!$C$2:$C$100,$B$2),\"\",INDEX(Payments!D$2:D$100,SMALL(IF(Payments!$C$2:$C$100<>\"\",IF(Payments!$C$2:$C$100=$B$2,ROW($C$7:$C$105)-ROW($C$7)+1)),ROWS(E$5:E16))))","v":""},{"$f":"IF(ROWS(F$5:F16)>COUNTIF(Payments!$C$2:$C$100,$B$2),\"\",INDEX(Payments!E$2:E$100,SMALL(IF(Payments!$C$2:$C$100<>\"\",IF(Payments!$C$2:$C$100=$B$2,ROW($C$7:$C$105)-ROW($C$7)+1)),ROWS(F$5:F16))))","v":""},{"$f":"IF(ROWS(G$5:G16)>COUNTIF(Payments!$C$2:$C$100,$B$2),\"\",INDEX(Payments!F$2:F$100,SMALL(IF(Payments!$C$2:$C$100<>\"\",IF(Payments!$C$2:$C$100=$B$2,ROW($C$7:$C$105)-ROW($C$7)+1)),ROWS(G$5:G16))))","v":""}]
[null,{"$f":"IF(C17=\"\",\"\",MAX($B$4:B16)+1)","v":""},{"$f":"IF(ROWS(C$5:C17)>COUNTIF(Payments!$C$2:$C$100,$B$2),\"\",INDEX(Payments!B$2:B$100,SMALL(IF(Payments!$C$2:$C$100<>\"\",IF(Payments!$C$2:$C$100=$B$2,ROW($C$7:$C$105)-ROW($C$7)+1)),ROWS(C$5:C17))))","v":""},{"$f":"IF(ROWS(D$5:D17)>COUNTIF(Payments!$C$2:$C$100,$B$2),\"\",INDEX(Payments!C$2:C$100,SMALL(IF(Payments!$C$2:$C$100<>\"\",IF(Payments!$C$2:$C$100=$B$2,ROW($C$7:$C$105)-ROW($C$7)+1)),ROWS(D$5:D17))))","v":""},{"$f":"IF(ROWS(E$5:E17)>COUNTIF(Payments!$C$2:$C$100,$B$2),\"\",INDEX(Payments!D$2:D$100,SMALL(IF(Payments!$C$2:$C$100<>\"\",IF(Payments!$C$2:$C$100=$B$2,ROW($C$7:$C$105)-ROW($C$7)+1)),ROWS(E$5:E17))))","v":""},{"$f":"IF(ROWS(F$5:F17)>COUNTIF(Payments!$C$2:$C$100,$B$2),\"\",INDEX(Payments!E$2:E$100,SMALL(IF(Payments!$C$2:$C$100<>\"\",IF(Payments!$C$2:$C$100=$B$2,ROW($C$7:$C$105)-ROW($C$7)+1)),ROWS(F$5:F17))))","v":""},{"$f":"IF(ROWS(G$5:G17)>COUNTIF(Payments!$C$2:$C$100,$B$2),\"\",INDEX(Payments!F$2:F$100,SMALL(IF(Payments!$C$2:$C$100<>\"\",IF(Payments!$C$2:$C$100=$B$2,ROW($C$7:$C$105)-ROW($C$7)+1)),ROWS(G$5:G17))))","v":""}]
[null,{"$f":"IF(C18=\"\",\"\",MAX($B$4:B17)+1)","v":""},{"$f":"IF(ROWS(C$5:C18)>COUNTIF(Payments!$C$2:$C$100,$B$2),\"\",INDEX(Payments!B$2:B$100,SMALL(IF(Payments!$C$2:$C$100<>\"\",IF(Payments!$C$2:$C$100=$B$2,ROW($C$7:$C$105)-ROW($C$7)+1)),ROWS(C$5:C18))))","v":""},{"$f":"IF(ROWS(D$5:D18)>COUNTIF(Payments!$C$2:$C$100,$B$2),\"\",INDEX(Payments!C$2:C$100,SMALL(IF(Payments!$C$2:$C$100<>\"\",IF(Payments!$C$2:$C$100=$B$2,ROW($C$7:$C$105)-ROW($C$7)+1)),ROWS(D$5:D18))))","v":""},{"$f":"IF(ROWS(E$5:E18)>COUNTIF(Payments!$C$2:$C$100,$B$2),\"\",INDEX(Payments!D$2:D$100,SMALL(IF(Payments!$C$2:$C$100<>\"\",IF(Payments!$C$2:$C$100=$B$2,ROW($C$7:$C$105)-ROW($C$7)+1)),ROWS(E$5:E18))))","v":""},{"$f":"IF(ROWS(F$5:F18)>COUNTIF(Payments!$C$2:$C$100,$B$2),\"\",INDEX(Payments!E$2:E$100,SMALL(IF(Payments!$C$2:$C$100<>\"\",IF(Payments!$C$2:$C$100=$B$2,ROW($C$7:$C$105)-ROW($C$7)+1)),ROWS(F$5:F18))))","v":""},{"$f":"IF(ROWS(G$5:G18)>COUNTIF(Payments!$C$2:$C$100,$B$2),\"\",INDEX(Payments!F$2:F$100,SMALL(IF(Payments!$C$2:$C$100<>\"\",IF(Payments!$C$2:$C$100=$B$2,ROW($C$7:$C$105)-ROW($C$7)+1)),ROWS(G$5:G18))))","v":""}]
[null,{"$f":"IF(C19=\"\",\"\",MAX($B$4:B18)+1)","v":""},{"$f":"IF(ROWS(C$5:C19)>COUNTIF(Payments!$C$2:$C$100,$B$2),\"\",INDEX(Payments!B$2:B$100,SMALL(IF(Payments!$C$2:$C$100<>\"\",IF(Payments!$C$2:$C$100=$B$2,ROW($C$7:$C$105)-ROW($C$7)+1)),ROWS(C$5:C19))))","v":""},{"$f":"IF(ROWS(D$5:D19)>COUNTIF(Payments!$C$2:$C$100,$B$2),\"\",INDEX(Payments!C$2:C$100,SMALL(IF(Payments!$C$2:$C$100<>\"\",IF(Payments!$C$2:$C$100=$B$2,ROW($C$7:$C$105)-ROW($C$7)+1)),ROWS(D$5:D19))))","v":""},{"$f":"IF(ROWS(E$5:E19)>COUNTIF(Payments!$C$2:$C$100,$B$2),\"\",INDEX(Payments!D$2:D$100,SMALL(IF(Payments!$C$2:$C$100<>\"\",IF(Payments!$C$2:$C$100=$B$2,ROW($C$7:$C$105)-ROW($C$7)+1)),ROWS(E$5:E19))))","v":""},{"$f":"IF(ROWS(F$5:F19)>COUNTIF(Payments!$C$2:$C$100,$B$2),\"\",INDEX(Payments!E$2:E$100,SMALL(IF(Payments!$C$2:$C$100<>\"\",IF(Payments!$C$2:$C$100=$B$2,ROW($C$7:$C$105)-ROW($C$7)+1)),ROWS(F$5:F19))))","v":""},{"$f":"IF(ROWS(G$5:G19)>COUNTIF(Payments!$C$2:$C$100,$B$2),\"\",INDEX(Payments!F$2:F$100,SMALL(IF(Payments!$C$2:$C$100<>\"\",IF(Payments!$C$2:$C$100=$B$2,ROW($C$7:$C$105)-ROW($C$7)+1)),ROWS(G$5:G19))))","v":""}]
[null,{"$f":"IF(C20=\"\",\"\",MAX($B$4:B19)+1)","v":""},{"$f":"IF(ROWS(C$5:C20)>COUNTIF(Payments!$C$2:$C$100,$B$2),\"\",INDEX(Payments!B$2:B$100,SMALL(IF(Payments!$C$2:$C$100<>\"\",IF(Payments!$C$2:$C$100=$B$2,ROW($C$7:$C$105)-ROW($C$7)+1)),ROWS(C$5:C20))))","v":""},{"$f":"IF(ROWS(D$5:D20)>COUNTIF(Payments!$C$2:$C$100,$B$2),\"\",INDEX(Payments!C$2:C$100,SMALL(IF(Payments!$C$2:$C$100<>\"\",IF(Payments!$C$2:$C$100=$B$2,ROW($C$7:$C$105)-ROW($C$7)+1)),ROWS(D$5:D20))))","v":""},{"$f":"IF(ROWS(E$5:E20)>COUNTIF(Payments!$C$2:$C$100,$B$2),\"\",INDEX(Payments!D$2:D$100,SMALL(IF(Payments!$C$2:$C$100<>\"\",IF(Payments!$C$2:$C$100=$B$2,ROW($C$7:$C$105)-ROW($C$7)+1)),ROWS(E$5:E20))))","v":""},{"$f":"IF(ROWS(F$5:F20)>COUNTIF(Payments!$C$2:$C$100,$B$2),\"\",INDEX(Payments!E$2:E$100,SMALL(IF(Payments!$C$2:$C$100<>\"\",IF(Payments!$C$2:$C$100=$B$2,ROW($C$7:$C$105)-ROW($C$7)+1)),ROWS(F$5:F20))))","v":""},{"$f":"IF(ROWS(G$5:G20)>COUNTIF(Payments!$C$2:$C$100,$B$2),\"\",INDEX(Payments!F$2:F$100,SMALL(IF(Payments!$C$2:$C$100<>\"\",IF(Payments!$C$2:$C$100=$B$2,ROW($C$7:$C$105)-ROW($C$7)+1)),ROWS(G$5:G20))))","v":""}]
[null,{"$f":"IF(C21=\"\",\"\",MAX($B$4:B20)+1)","v":""},{"$f":"IF(ROWS(C$5:C21)>COUNTIF(Payments!$C$2:$C$100,$B$2),\"\",INDEX(Payments!B$2:B$100,SMALL(IF(Payments!$C$2:$C$100<>\"\",IF(Payments!$C$2:$C$100=$B$2,ROW($C$7:$C$105)-ROW($C$7)+1)),ROWS(C$5:C21))))","v":""},{"$f":"IF(ROWS(D$5:D21)>COUNTIF(Payments!$C$2:$C$100,$B$2),\"\",INDEX(Payments!C$2:C$100,SMALL(IF(Payments!$C$2:$C$100<>\"\",IF(Payments!$C$2:$C$100=$B$2,ROW($C$7:$C$105)-ROW($C$7)+1)),ROWS(D$5:D21))))","v":""},{"$f":"IF(ROWS(E$5:E21)>COUNTIF(Payments!$C$2:$C$100,$B$2),\"\",INDEX(Payments!D$2:D$100,SMALL(IF(Payments!$C$2:$C$100<>\"\",IF(Payments!$C$2:$C$100=$B$2,ROW($C$7:$C$105)-ROW($C$7)+1)),ROWS(E$5:E21))))","v":""},{"$f":"IF(ROWS(F$5:F21)>COUNTIF(Payments!$C$2:$C$100,$B$2),\"\",INDEX(Payments!E$2:E$100,SMALL(IF(Payments!$C$2:$C$100<>\"\",IF(Payments!$C$2:$C$100=$B$2,ROW($C$7:$C$105)-ROW($C$7)+1)),ROWS(F$5:F21))))","v":""},{"$f":"IF(ROWS(G$5:G21)>COUNTIF(Payments!$C$2:$C$100,$B$2),\"\",INDEX(Payments!F$2:F$100,SMALL(IF(Payments!$C$2:$C$100<>\"\",IF(Payments!$C$2:$C$100=$B$2,ROW($C$7:$C$105)-ROW($C$7)+1)),ROWS(G$5:G21))))","v":""}]
[null,{"$f":"IF(C22=\"\",\"\",MAX($B$4:B21)+1)","v":""},{"$f":"IF(ROWS(C$5:C22)>COUNTIF(Payments!$C$2:$C$100,$B$2),\"\",INDEX(Payments!B$2:B$100,SMALL(IF(Payments!$C$2:$C$100<>\"\",IF(Payments!$C$2:$C$100=$B$2,ROW($C$7:$C$105)-ROW($C$7)+1)),ROWS(C$5:C22))))","v":""},{"$f":"IF(ROWS(D$5:D22)>COUNTIF(Payments!$C$2:$C$100,$B$2),\"\",INDEX(Payments!C$2:C$100,SMALL(IF(Payments!$C$2:$C$100<>\"\",IF(Payments!$C$2:$C$100=$B$2,ROW($C$7:$C$105)-ROW($C$7)+1)),ROWS(D$5:D22))))","v":""},{"$f":"IF(ROWS(E$5:E22)>COUNTIF(Payments!$C$2:$C$100,$B$2),\"\",INDEX(Payments!D$2:D$100,SMALL(IF(Payments!$C$2:$C$100<>\"\",IF(Payments!$C$2:$C$100=$B$2,ROW($C$7:$C$105)-ROW($C$7)+1)),ROWS(E$5:E22))))","v":""},{"$f":"IF(ROWS(F$5:F22)>COUNTIF(Payments!$C$2:$C$100,$B$2),\"\",INDEX(Payments!E$2:E$100,SMALL(IF(Payments!$C$2:$C$100<>\"\",IF(Payments!$C$2:$C$100=$B$2,ROW($C$7:$C$105)-ROW($C$7)+1)),ROWS(F$5:F22))))","v":""},{"$f":"IF(ROWS(G$5:G22)>COUNTIF(Payments!$C$2:$C$100,$B$2),\"\",INDEX(Payments!F$2:F$100,SMALL(IF(Payments!$C$2:$C$100<>\"\",IF(Payments!$C$2:$C$100=$B$2,ROW($C$7:$C$105)-ROW($C$7)+1)),ROWS(G$5:G22))))","v":""}]
[null,{"$f":"IF(C23=\"\",\"\",MAX($B$4:B22)+1)","v":""},{"$f":"IF(ROWS(C$5:C23)>COUNTIF(Payments!$C$2:$C$100,$B$2),\"\",INDEX(Payments!B$2:B$100,SMALL(IF(Payments!$C$2:$C$100<>\"\",IF(Payments!$C$2:$C$100=$B$2,ROW($C$7:$C$105)-ROW($C$7)+1)),ROWS(C$5:C23))))","v":""},{"$f":"IF(ROWS(D$5:D23)>COUNTIF(Payments!$C$2:$C$100,$B$2),\"\",INDEX(Payments!C$2:C$100,SMALL(IF(Payments!$C$2:$C$100<>\"\",IF(Payments!$C$2:$C$100=$B$2,ROW($C$7:$C$105)-ROW($C$7)+1)),ROWS(D$5:D23))))","v":""},{"$f":"IF(ROWS(E$5:E23)>COUNTIF(Payments!$C$2:$C$100,$B$2),\"\",INDEX(Payments!D$2:D$100,SMALL(IF(Payments!$C$2:$C$100<>\"\",IF(Payments!$C$2:$C$100=$B$2,ROW($C$7:$C$105)-ROW($C$7)+1)),ROWS(E$5:E23))))","v":""},{"$f":"IF(ROWS(F$5:F23)>COUNTIF(Payments!$C$2:$C$100,$B$2),\"\",INDEX(Payments!E$2:E$100,SMALL(IF(Payments!$C$2:$C$100<>\"\",IF(Payments!$C$2:$C$100=$B$2,ROW($C$7:$C$105)-ROW($C$7)+1)),ROWS(F$5:F23))))","v":""},{"$f":"IF(ROWS(G$5:G23)>COUNTIF(Payments!$C$2:$C$100,$B$2),\"\",INDEX(Payments!F$2:F$100,SMALL(IF(Payments!$C$2:$C$100<>\"\",IF(Payments!$C$2:$C$100=$B$2,ROW($C$7:$C$105)-ROW($C$7)+1)),ROWS(G$5:G23))))","v":""}]
[null,{"$f":"IF(C24=\"\",\"\",MAX($B$4:B23)+1)","v":""},{"$f":"IF(ROWS(C$5:C24)>COUNTIF(Payments!$C$2:$C$100,$B$2),\"\",INDEX(Payments!B$2:B$100,SMALL(IF(Payments!$C$2:$C$100<>\"\",IF(Payments!$C$2:$C$100=$B$2,ROW($C$7:$C$105)-ROW($C$7)+1)),ROWS(C$5:C24))))","v":""},{"$f":"IF(ROWS(D$5:D24)>COUNTIF(Payments!$C$2:$C$100,$B$2),\"\",INDEX(Payments!C$2:C$100,SMALL(IF(Payments!$C$2:$C$100<>\"\",IF(Payments!$C$2:$C$100=$B$2,ROW($C$7:$C$105)-ROW($C$7)+1)),ROWS(D$5:D24))))","v":""},{"$f":"IF(ROWS(E$5:E24)>COUNTIF(Payments!$C$2:$C$100,$B$2),\"\",INDEX(Payments!D$2:D$100,SMALL(IF(Payments!$C$2:$C$100<>\"\",IF(Payments!$C$2:$C$100=$B$2,ROW($C$7:$C$105)-ROW($C$7)+1)),ROWS(E$5:E24))))","v":""},{"$f":"IF(ROWS(F$5:F24)>COUNTIF(Payments!$C$2:$C$100,$B$2),\"\",INDEX(Payments!E$2:E$100,SMALL(IF(Payments!$C$2:$C$100<>\"\",IF(Payments!$C$2:$C$100=$B$2,ROW($C$7:$C$105)-ROW($C$7)+1)),ROWS(F$5:F24))))","v":""},{"$f":"IF(ROWS(G$5:G24)>COUNTIF(Payments!$C$2:$C$100,$B$2),\"\",INDEX(Payments!F$2:F$100,SMALL(IF(Payments!$C$2:$C$100<>\"\",IF(Payments!$C$2:$C$100=$B$2,ROW($C$7:$C$105)-ROW($C$7)+1)),ROWS(G$5:G24))))","v":""}]
[null,{"$f":"IF(C25=\"\",\"\",MAX($B$4:B24)+1)","v":""},{"$f":"IF(ROWS(C$5:C25)>COUNTIF(Payments!$C$2:$C$100,$B$2),\"\",INDEX(Payments!B$2:B$100,SMALL(IF(Payments!$C$2:$C$100<>\"\",IF(Payments!$C$2:$C$100=$B$2,ROW($C$7:$C$105)-ROW($C$7)+1)),ROWS(C$5:C25))))","v":""},{"$f":"IF(ROWS(D$5:D25)>COUNTIF(Payments!$C$2:$C$100,$B$2),\"\",INDEX(Payments!C$2:C$100,SMALL(IF(Payments!$C$2:$C$100<>\"\",IF(Payments!$C$2:$C$100=$B$2,ROW($C$7:$C$105)-ROW($C$7)+1)),ROWS(D$5:D25))))","v":""},{"$f":"IF(ROWS(E$5:E25)>COUNTIF(Payments!$C$2:$C$100,$B$2),\"\",INDEX(Payments!D$2:D$100,SMALL(IF(Payments!$C$2:$C$100<>\"\",IF(Payments!$C$2:$C$100=$B$2,ROW($C$7:$C$105)-ROW($C$7)+1)),ROWS(E$5:E25))))","v":""},{"$f":"IF(ROWS(F$5:F25)>COUNTIF(Payments!$C$2:$C$100,$B$2),\"\",INDEX(Payments!E$2:E$100,SMALL(IF(Payments!$C$2:$C$100<>\"\",IF(Payments!$C$2:$C$100=$B$2,ROW($C$7:$C$105)-ROW($C$7)+1)),ROWS(F$5:F25))))","v":""},{"$f":"IF(ROWS(G$5:G25)>COUNTIF(Payments!$C$2:$C$100,$B$2),\"\",INDEX(Payments!F$2:F$100,SMALL(IF(Payments!$C$2:$C$100<>\"\",IF(Payments!$C$2:$C$100=$B$2,ROW($C$7:$C$105)-ROW($C$7)+1)),ROWS(G$5:G25))))","v":""}]
[null,{"$f":"IF(C26=\"\",\"\",MAX($B$4:B25)+1)","v":""},{"$f":"IF(ROWS(C$5:C26)>COUNTIF(Payments!$C$2:$C$100,$B$2),\"\",INDEX(Payments!B$2:B$100,SMALL(IF(Payments!$C$2:$C$100<>\"\",IF(Payments!$C$2:$C$100=$B$2,ROW($C$7:$C$105)-ROW($C$7)+1)),ROWS(C$5:C26))))","v":""},{"$f":"IF(ROWS(D$5:D26)>COUNTIF(Payments!$C$2:$C$100,$B$2),\"\",INDEX(Payments!C$2:C$100,SMALL(IF(Payments!$C$2:$C$100<>\"\",IF(Payments!$C$2:$C$100=$B$2,ROW($C$7:$C$105)-ROW($C$7)+1)),ROWS(D$5:D26))))","v":""},{"$f":"IF(ROWS(E$5:E26)>COUNTIF(Payments!$C$2:$C$100,$B$2),\"\",INDEX(Payments!D$2:D$100,SMALL(IF(Payments!$C$2:$C$100<>\"\",IF(Payments!$C$2:$C$100=$B$2,ROW($C$7:$C$105)-ROW($C$7)+1)),ROWS(E$5:E26))))","v":""},{"$f":"IF(ROWS(F$5:F26)>COUNTIF(Payments!$C$2:$C$100,$B$2),\"\",INDEX(Payments!E$2:E$100,SMALL(IF(Payments!$C$2:$C$100<>\"\",IF(Payments!$C$2:$C$100=$B$2,ROW($C$7:$C$105)-ROW($C$7)+1)),ROWS(F$5:F26))))","v":""},{"$f":"IF(ROWS(G$5:G26)>COUNTIF(Payments!$C$2:$C$100,$B$2),\"\",INDEX(Payments!F$2:F$100,SMALL(IF(Payments!$C$2:$C$100<>\"\",IF(Payments!$C$2:$C$100=$B$2,ROW($C$7:$C$105)-ROW($C$7)+1)),ROWS(G$5:G26))))","v":""}]
[null,{"$f":"IF(C27=\"\",\"\",MAX($B$4:B26)+1)","v":""},{"$f":"IF(ROWS(C$5:C27)>COUNTIF(Payments!$C$2:$C$100,$B$2),\"\",INDEX(Payments!B$2:B$100,SMALL(IF(Payments!$C$2:$C$100<>\"\",IF(Payments!$C$2:$C$100=$B$2,ROW($C$7:$C$105)-ROW($C$7)+1)),ROWS(C$5:C27))))","v":""},{"$f":"IF(ROWS(D$5:D27)>COUNTIF(Payments!$C$2:$C$100,$B$2),\"\",INDEX(Payments!C$2:C$100,SMALL(IF(Payments!$C$2:$C$100<>\"\",IF(Payments!$C$2:$C$100=$B$2,ROW($C$7:$C$105)-ROW($C$7)+1)),ROWS(D$5:D27))))","v":""},{"$f":"IF(ROWS(E$5:E27)>COUNTIF(Payments!$C$2:$C$100,$B$2),\"\",INDEX(Payments!D$2:D$100,SMALL(IF(Payments!$C$2:$C$100<>\"\",IF(Payments!$C$2:$C$100=$B$2,ROW($C$7:$C$105)-ROW($C$7)+1)),ROWS(E$5:E27))))","v":""},{"$f":"IF(ROWS(F$5:F27)>COUNTIF(Payments!$C$2:$C$100,$B$2),\"\",INDEX(Payments!E$2:E$100,SMALL(IF(Payments!$C$2:$C$100<>\"\",IF(Payments!$C$2:$C$100=$B$2,ROW($C$7:$C$105)-ROW($C$7)+1)),ROWS(F$5:F27))))","v":""},{"$f":"IF(ROWS(G$5:G27)>COUNTIF(Payments!$C$2:$C$100,$B$2),\"\",INDEX(Payments!F$2:F$100,SMALL(IF(Payments!$C$2:$C$100<>\"\",IF(Payments!$C$2:$C$100=$B$2,ROW($C$7:$C$105)-ROW($C$7)+1)),ROWS(G$5:G27))))","v":""}]
[null,{"$f":"IF(C28=\"\",\"\",MAX($B$4:B27)+1)","v":""},{"$f":"IF(ROWS(C$5:C28)>COUNTIF(Payments!$C$2:$C$100,$B$2),\"\",INDEX(Payments!B$2:B$100,SMALL(IF(Payments!$C$2:$C$100<>\"\",IF(Payments!$C$2:$C$100=$B$2,ROW($C$7:$C$105)-ROW($C$7)+1)),ROWS(C$5:C28))))","v":""},{"$f":"IF(ROWS(D$5:D28)>COUNTIF(Payments!$C$2:$C$100,$B$2),\"\",INDEX(Payments!C$2:C$100,SMALL(IF(Payments!$C$2:$C$100<>\"\",IF(Payments!$C$2:$C$100=$B$2,ROW($C$7:$C$105)-ROW($C$7)+1)),ROWS(D$5:D28))))","v":""},{"$f":"IF(ROWS(E$5:E28)>COUNTIF(Payments!$C$2:$C$100,$B$2),\"\",INDEX(Payments!D$2:D$100,SMALL(IF(Payments!$C$2:$C$100<>\"\",IF(Payments!$C$2:$C$100=$B$2,ROW($C$7:$C$105)-ROW($C$7)+1)),ROWS(E$5:E28))))","v":""},{"$f":"IF(ROWS(F$5:F28)>COUNTIF(Payments!$C$2:$C$100,$B$2),\"\",INDEX(Payments!E$2:E$100,SMALL(IF(Payments!$C$2:$C$100<>\"\",IF(Payments!$C$2:$C$100=$B$2,ROW($C$7:$C$105)-ROW($C$7)+1)),ROWS(F$5:F28))))","v":""},{"$f":"IF(ROWS(G$5:G28)>COUNTIF(Payments!$C$2:$C$100,$B$2),\"\",INDEX(Payments!F$2:F$100,SMALL(IF(Payments!$C$2:$C$100<>\"\",IF(Payments!$C$2:$C$100=$B$2,ROW($C$7:$C$105)-ROW($C$7)+1)),ROWS(G$5:G28))))","v":""}]
[null,{"$f":"IF(C29=\"\",\"\",MAX($B$4:B28)+1)","v":""},{"$f":"IF(ROWS(C$5:C29)>COUNTIF(Payments!$C$2:$C$100,$B$2),\"\",INDEX(Payments!B$2:B$100,SMALL(IF(Payments!$C$2:$C$100<>\"\",IF(Payments!$C$2:$C$100=$B$2,ROW($C$7:$C$105)-ROW($C$7)+1)),ROWS(C$5:C29))))","v":""},{"$f":"IF(ROWS(D$5:D29)>COUNTIF(Payments!$C$2:$C$100,$B$2),\"\",INDEX(Payments!C$2:C$100,SMALL(IF(Payments!$C$2:$C$100<>\"\",IF(Payments!$C$2:$C$100=$B$2,ROW($C$7:$C$105)-ROW($C$7)+1)),ROWS(D$5:D29))))","v":""},{"$f":"IF(ROWS(E$5:E29)>COUNTIF(Payments!$C$2:$C$100,$B$2),\"\",INDEX(Payments!D$2:D$100,SMALL(IF(Payments!$C$2:$C$100<>\"\",IF(Payments!$C$2:$C$100=$B$2,ROW($C$7:$C$105)-ROW($C$7)+1)),ROWS(E$5:E29))))","v":""},{"$f":"IF(ROWS(F$5:F29)>COUNTIF(Payments!$C$2:$C$100,$B$2),\"\",INDEX(Payments!E$2:E$100,SMALL(IF(Payments!$C$2:$C$100<>\"\",IF(Payments!$C$2:$C$100=$B$2,ROW($C$7:$C$105)-ROW($C$7)+1)),ROWS(F$5:F29))))","v":""},{"$f":"IF(ROWS(G$5:G29)>COUNTIF(Payments!$C$2:$C$100,$B$2),\"\",INDEX(Payments!F$2:F$100,SMALL(IF(Payments!$C$2:$C$100<>\"\",IF(Payments!$C$2:$C$100=$B$2,ROW($C$7:$C$105)-ROW($C$7)+1)),ROWS(G$5:G29))))","v":""}]
[null,{"$f":"IF(C30=\"\",\"\",MAX($B$4:B29)+1)","v":""},{"$f":"IF(ROWS(C$5:C30)>COUNTIF(Payments!$C$2:$C$100,$B$2),\"\",INDEX(Payments!B$2:B$100,SMALL(IF(Payments!$C$2:$C$100<>\"\",IF(Payments!$C$2:$C$100=$B$2,ROW($C$7:$C$105)-ROW($C$7)+1)),ROWS(C$5:C30))))","v":""},{"$f":"IF(ROWS(D$5:D30)>COUNTIF(Payments!$C$2:$C$100,$B$2),\"\",INDEX(Payments!C$2:C$100,SMALL(IF(Payments!$C$2:$C$100<>\"\",IF(Payments!$C$2:$C$100=$B$2,ROW($C$7:$C$105)-ROW($C$7)+1)),ROWS(D$5:D30))))","v":""},{"$f":"IF(ROWS(E$5:E30)>COUNTIF(Payments!$C$2:$C$100,$B$2),\"\",INDEX(Payments!D$2:D$100,SMALL(IF(Payments!$C$2:$C$100<>\"\",IF(Payments!$C$2:$C$100=$B$2,ROW($C$7:$C$105)-ROW($C$7)+1)),ROWS(E$5:E30))))","v":""},{"$f":"IF(ROWS(F$5:F30)>COUNTIF(Payments!$C$2:$C$100,$B$2),\"\",INDEX(Payments!E$2:E$100,SMALL(IF(Payments!$C$2:$C$100<>\"\",IF(Payments!$C$2:$C$100=$B$2,ROW($C$7:$C$105)-ROW($C$7)+1)),ROWS(F$5:F30))))","v":""},{"$f":"IF(ROWS(G$5:G30)>COUNTIF(Payments!$C$2:$C$100,$B$2),\"\",INDEX(Payments!F$2:F$100,SMALL(IF(Payments!$C$2:$C$100<>\"\",IF(Payments!$C$2:$C$100=$B$2,ROW($C$7:$C$105)-ROW($C$7)+1)),ROWS(G$5:G30))))","v":""}]
[null,{"$f":"IF(C31=\"\",\"\",MAX($B$4:B30)+1)","v":""},{"$f":"IF(ROWS(C$5:C31)>COUNTIF(Payments!$C$2:$C$100,$B$2),\"\",INDEX(Payments!B$2:B$100,SMALL(IF(Payments!$C$2:$C$100<>\"\",IF(Payments!$C$2:$C$100=$B$2,ROW($C$7:$C$105)-ROW($C$7)+1)),ROWS(C$5:C31))))","v":""},{"$f":"IF(ROWS(D$5:D31)>COUNTIF(Payments!$C$2:$C$100,$B$2),\"\",INDEX(Payments!C$2:C$100,SMALL(IF(Payments!$C$2:$C$100<>\"\",IF(Payments!$C$2:$C$100=$B$2,ROW($C$7:$C$105)-ROW($C$7)+1)),ROWS(D$5:D31))))","v":""},{"$f":"IF(ROWS(E$5:E31)>COUNTIF(Payments!$C$2:$C$100,$B$2),\"\",INDEX(Payments!D$2:D$100,SMALL(IF(Payments!$C$2:$C$100<>\"\",IF(Payments!$C$2:$C$100=$B$2,ROW($C$7:$C$105)-ROW($C$7)+1)),ROWS(E$5:E31))))","v":""},{"$f":"IF(ROWS(F$5:F31)>COUNTIF(Payments!$C$2:$C$100,$B$2),\"\",INDEX(Payments!E$2:E$100,SMALL(IF(Payments!$C$2:$C$100<>\"\",IF(Payments!$C$2:$C$100=$B$2,ROW($C$7:$C$105)-ROW($C$7)+1)),ROWS(F$5:F31))))","v":""},{"$f":"IF(ROWS(G$5:G31)>COUNTIF(Payments!$C$2:$C$100,$B$2),\"\",INDEX(Payments!F$2:F$100,SMALL(IF(Payments!$C$2:$C$100<>\"\",IF(Payments!$C$2:$C$100=$B$2,ROW($C$7:$C$105)-ROW($C$7)+1)),ROWS(G$5:G31))))","v":""}]
[null,{"$f":"IF(C32=\"\",\"\",MAX($B$4:B31)+1)","v":""},{"$f":"IF(ROWS(C$5:C32)>COUNTIF(Payments!$C$2:$C$100,$B$2),\"\",INDEX(Payments!B$2:B$100,SMALL(IF(Payments!$C$2:$C$100<>\"\",IF(Payments!$C$2:$C$100=$B$2,ROW($C$7:$C$105)-ROW($C$7)+1)),ROWS(C$5:C32))))","v":""},{"$f":"IF(ROWS(D$5:D32)>COUNTIF(Payments!$C$2:$C$100,$B$2),\"\",INDEX(Payments!C$2:C$100,SMALL(IF(Payments!$C$2:$C$100<>\"\",IF(Payments!$C$2:$C$100=$B$2,ROW($C$7:$C$105)-ROW($C$7)+1)),ROWS(D$5:D32))))","v":""},{"$f":"IF(ROWS(E$5:E32)>COUNTIF(Payments!$C$2:$C$100,$B$2),\"\",INDEX(Payments!D$2:D$100,SMALL(IF(Payments!$C$2:$C$100<>\"\",IF(Payments!$C$2:$C$100=$B$2,ROW($C$7:$C$105)-ROW($C$7)+1)),ROWS(E$5:E32))))","v":""},{"$f":"IF(ROWS(F$5:F32)>COUNTIF(Payments!$C$2:$C$100,$B$2),\"\",INDEX(Payments!E$2:E$100,SMALL(IF(Payments!$C$2:$C$100<>\"\",IF(Payments!$C$2:$C$100=$B$2,ROW($C$7:$C$105)-ROW($C$7)+1)),ROWS(F$5:F32))))","v":""},{"$f":"IF(ROWS(G$5:G32)>COUNTIF(Payments!$C$2:$C$100,$B$2),\"\",INDEX(Payments!F$2:F$100,SMALL(IF(Payments!$C$2:$C$100<>\"\",IF(Payments!$C$2:$C$100=$B$2,ROW($C$7:$C$105)-ROW($C$7)+1)),ROWS(G$5:G32))))","v":""}]
[null,{"$f":"IF(C33=\"\",\"\",MAX($B$4:B32)+1)","v":""},{"$f":"IF(ROWS(C$5:C33)>COUNTIF(Payments!$C$2:$C$100,$B$2),\"\",INDEX(Payments!B$2:B$100,SMALL(IF(Payments!$C$2:$C$100<>\"\",IF(Payments!$C$2:$C$100=$B$2,ROW($C$7:$C$105)-ROW($C$7)+1)),ROWS(C$5:C33))))","v":""},{"$f":"IF(ROWS(D$5:D33)>COUNTIF(Payments!$C$2:$C$100,$B$2),\"\",INDEX(Payments!C$2:C$100,SMALL(IF(Payments!$C$2:$C$100<>\"\",IF(Payments!$C$2:$C$100=$B$2,ROW($C$7:$C$105)-ROW($C$7)+1)),ROWS(D$5:D33))))","v":""},{"$f":"IF(ROWS(E$5:E33)>COUNTIF(Payments!$C$2:$C$100,$B$2),\"\",INDEX(Payments!D$2:D$100,SMALL(IF(Payments!$C$2:$C$100<>\"\",IF(Payments!$C$2:$C$100=$B$2,ROW($C$7:$C$105)-ROW($C$7)+1)),ROWS(E$5:E33))))","v":""},{"$f":"IF(ROWS(F$5:F33)>COUNTIF(Payments!$C$2:$C$100,$B$2),\"\",INDEX(Payments!E$2:E$100,SMALL(IF(Payments!$C$2:$C$100<>\"\",IF(Payments!$C$2:$C$100=$B$2,ROW($C$7:$C$105)-ROW($C$7)+1)),ROWS(F$5:F33))))","v":""},{"$f":"IF(ROWS(G$5:G33)>COUNTIF(Payments!$C$2:$C$100,$B$2),\"\",INDEX(Payments!F$2:F$100,SMALL(IF(Payments!$C$2:$C$100<>\"\",IF(Payments!$C$2:$C$100=$B$2,ROW($C$7:$C$105)-ROW($C$7)+1)),ROWS(G$5:G33))))","v":""}]
[null,{"$f":"IF(C34=\"\",\"\",MAX($B$4:B33)+1)","v":""},{"$f":"IF(ROWS(C$5:C34)>COUNTIF(Payments!$C$2:$C$100,$B$2),\"\",INDEX(Payments!B$2:B$100,SMALL(IF(Payments!$C$2:$C$100<>\"\",IF(Payments!$C$2:$C$100=$B$2,ROW($C$7:$C$105)-ROW($C$7)+1)),ROWS(C$5:C34))))","v":""},{"$f":"IF(ROWS(D$5:D34)>COUNTIF(Payments!$C$2:$C$100,$B$2),\"\",INDEX(Payments!C$2:C$100,SMALL(IF(Payments!$C$2:$C$100<>\"\",IF(Payments!$C$2:$C$100=$B$2,ROW($C$7:$C$105)-ROW($C$7)+1)),ROWS(D$5:D34))))","v":""},{"$f":"IF(ROWS(E$5:E34)>COUNTIF(Payments!$C$2:$C$100,$B$2),\"\",INDEX(Payments!D$2:D$100,SMALL(IF(Payments!$C$2:$C$100<>\"\",IF(Payments!$C$2:$C$100=$B$2,ROW($C$7:$C$105)-ROW($C$7)+1)),ROWS(E$5:E34))))","v":""},{"$f":"IF(ROWS(F$5:F34)>COUNTIF(Payments!$C$2:$C$100,$B$2),\"\",INDEX(Payments!E$2:E$100,SMALL(IF(Payments!$C$2:$C$100<>\"\",IF(Payments!$C$2:$C$100=$B$2,ROW($C$7:$C$105)-ROW($C$7)+1)),ROWS(F$5:F34))))","v":""},{"$f":"IF(ROWS(G$5:G34)>COUNTIF(Payments!$C$2:$C$100,$B$2),\"\",INDEX(Payments!F$2:F$100,SMALL(IF(Payments!$C$2:$C$100<>\"\",IF(Payments!$C$2:$C$100=$B$2,ROW($C$7:$C$105)-ROW($C$7)+1)),ROWS(G$5:G34))))","v":""}]
[null,{"$f":"IF(C35=\"\",\"\",MAX($B$4:B34)+1)","v":""},{"$f":"IF(ROWS(C$5:C35)>COUNTIF(Payments!$C$2:$C$100,$B$2),\"\",INDEX(Payments!B$2:B$100,SMALL(IF(Payments!$C$2:$C$100<>\"\",IF(Payments!$C$2:$C$100=$B$2,ROW($C$7:$C$105)-ROW($C$7)+1)),ROWS(C$5:C35))))","v":""},{"$f":"IF(ROWS(D$5:D35)>COUNTIF(Payments!$C$2:$C$100,$B$2),\"\",INDEX(Payments!C$2:C$100,SMALL(IF(Payments!$C$2:$C$100<>\"\",IF(Payments!$C$2:$C$100=$B$2,ROW($C$7:$C$105)-ROW($C$7)+1)),ROWS(D$5:D35))))","v":""},{"$f":"IF(ROWS(E$5:E35)>COUNTIF(Payments!$C$2:$C$100,$B$2),\"\",INDEX(Payments!D$2:D$100,SMALL(IF(Payments!$C$2:$C$100<>\"\",IF(Payments!$C$2:$C$100=$B$2,ROW($C$7:$C$105)-ROW($C$7)+1)),ROWS(E$5:E35))))","v":""},{"$f":"IF(ROWS(F$5:F35)>COUNTIF(Payments!$C$2:$C$100,$B$2),\"\",INDEX(Payments!E$2:E$100,SMALL(IF(Payments!$C$2:$C$100<>\"\",IF(Payments!$C$2:$C$100=$B$2,ROW($C$7:$C$105)-ROW($C$7)+1)),ROWS(F$5:F35))))","v":""},{"$f":"IF(ROWS(G$5:G35)>COUNTIF(Payments!$C$2:$C$100,$B$2),\"\",INDEX(Payments!F$2:F$100,SMALL(IF(Payments!$C$2:$C$100<>\"\",IF(Payments!$C$2:$C$100=$B$2,ROW($C$7:$C$105)-ROW($C$7)+1)),ROWS(G$5:G35))))","v":""}]
[null,{"$f":"IF(C36=\"\",\"\",MAX($B$4:B35)+1)","v":""},{"$f":"IF(ROWS(C$5:C36)>COUNTIF(Payments!$C$2:$C$100,$B$2),\"\",INDEX(Payments!B$2:B$100,SMALL(IF(Payments!$C$2:$C$100<>\"\",IF(Payments!$C$2:$C$100=$B$2,ROW($C$7:$C$105)-ROW($C$7)+1)),ROWS(C$5:C36))))","v":""},{"$f":"IF(ROWS(D$5:D36)>COUNTIF(Payments!$C$2:$C$100,$B$2),\"\",INDEX(Payments!C$2:C$100,SMALL(IF(Payments!$C$2:$C$100<>\"\",IF(Payments!$C$2:$C$100=$B$2,ROW($C$7:$C$105)-ROW($C$7)+1)),ROWS(D$5:D36))))","v":""},{"$f":"IF(ROWS(E$5:E36)>COUNTIF(Payments!$C$2:$C$100,$B$2),\"\",INDEX(Payments!D$2:D$100,SMALL(IF(Payments!$C$2:$C$100<>\"\",IF(Payments!$C$2:$C$100=$B$2,ROW($C$7:$C$105)-ROW($C$7)+1)),ROWS(E$5:E36))))","v":""},{"$f":"IF(ROWS(F$5:F36)>COUNTIF(Payments!$C$2:$C$100,$B$2),\"\",INDEX(Payments!E$2:E$100,SMALL(IF(Payments!$C$2:$C$100<>\"\",IF(Payments!$C$2:$C$100=$B$2,ROW($C$7:$C$105)-ROW($C$7)+1)),ROWS(F$5:F36))))","v":""},{"$f":"IF(ROWS(G$5:G36)>COUNTIF(Payments!$C$2:$C$100,$B$2),\"\",INDEX(Payments!F$2:F$100,SMALL(IF(Payments!$C$2:$C$100<>\"\",IF(Payments!$C$2:$C$100=$B$2,ROW($C$7:$C$105)-ROW($C$7)+1)),ROWS(G$5:G36))))","v":""}]
[null,{"$f":"IF(C37=\"\",\"\",MAX($B$4:B36)+1)","v":""},{"$f":"IF(ROWS(C$5:C37)>COUNTIF(Payments!$C$2:$C$100,$B$2),\"\",INDEX(Payments!B$2:B$100,SMALL(IF(Payments!$C$2:$C$100<>\"\",IF(Payments!$C$2:$C$100=$B$2,ROW($C$7:$C$105)-ROW($C$7)+1)),ROWS(C$5:C37))))","v":""},{"$f":"IF(ROWS(D$5:D37)>COUNTIF(Payments!$C$2:$C$100,$B$2),\"\",INDEX(Payments!C$2:C$100,SMALL(IF(Payments!$C$2:$C$100<>\"\",IF(Payments!$C$2:$C$100=$B$2,ROW($C$7:$C$105)-ROW($C$7)+1)),ROWS(D$5:D37))))","v":""},{"$f":"IF(ROWS(E$5:E37)>COUNTIF(Payments!$C$2:$C$100,$B$2),\"\",INDEX(Payments!D$2:D$100,SMALL(IF(Payments!$C$2:$C$100<>\"\",IF(Payments!$C$2:$C$100=$B$2,ROW($C$7:$C$105)-ROW($C$7)+1)),ROWS(E$5:E37))))","v":""},{"$f":"IF(ROWS(F$5:F37)>COUNTIF(Payments!$C$2:$C$100,$B$2),\"\",INDEX(Payments!E$2:E$100,SMALL(IF(Payments!$C$2:$C$100<>\"\",IF(Payments!$C$2:$C$100=$B$2,ROW($C$7:$C$105)-ROW($C$7)+1)),ROWS(F$5:F37))))","v":""},{"$f":"IF(ROWS(G$5:G37)>COUNTIF(Payments!$C$2:$C$100,$B$2),\"\",INDEX(Payments!F$2:F$100,SMALL(IF(Payments!$C$2:$C$100<>\"\",IF(Payments!$C$2:$C$100=$B$2,ROW($C$7:$C$105)-ROW($C$7)+1)),ROWS(G$5:G37))))","v":""}]
[null,{"$f":"IF(C38=\"\",\"\",MAX($B$4:B37)+1)","v":""},{"$f":"IF(ROWS(C$5:C38)>COUNTIF(Payments!$C$2:$C$100,$B$2),\"\",INDEX(Payments!B$2:B$100,SMALL(IF(Payments!$C$2:$C$100<>\"\",IF(Payments!$C$2:$C$100=$B$2,ROW($C$7:$C$105)-ROW($C$7)+1)),ROWS(C$5:C38))))","v":""},{"$f":"IF(ROWS(D$5:D38)>COUNTIF(Payments!$C$2:$C$100,$B$2),\"\",INDEX(Payments!C$2:C$100,SMALL(IF(Payments!$C$2:$C$100<>\"\",IF(Payments!$C$2:$C$100=$B$2,ROW($C$7:$C$105)-ROW($C$7)+1)),ROWS(D$5:D38))))","v":""},{"$f":"IF(ROWS(E$5:E38)>COUNTIF(Payments!$C$2:$C$100,$B$2),\"\",INDEX(Payments!D$2:D$100,SMALL(IF(Payments!$C$2:$C$100<>\"\",IF(Payments!$C$2:$C$100=$B$2,ROW($C$7:$C$105)-ROW($C$7)+1)),ROWS(E$5:E38))))","v":""},{"$f":"IF(ROWS(F$5:F38)>COUNTIF(Payments!$C$2:$C$100,$B$2),\"\",INDEX(Payments!E$2:E$100,SMALL(IF(Payments!$C$2:$C$100<>\"\",IF(Payments!$C$2:$C$100=$B$2,ROW($C$7:$C$105)-ROW($C$7)+1)),ROWS(F$5:F38))))","v":""},{"$f":"IF(ROWS(G$5:G38)>COUNTIF(Payments!$C$2:$C$100,$B$2),\"\",INDEX(Payments!F$2:F$100,SMALL(IF(Payments!$C$2:$C$100<>\"\",IF(Payments!$C$2:$C$100=$B$2,ROW($C$7:$C$105)-ROW($C$7)+1)),ROWS(G$5:G38))))","v":""}]
[null,{"$f":"IF(C39=\"\",\"\",MAX($B$4:B38)+1)","v":""},{"$f":"IF(ROWS(C$5:C39)>COUNTIF(Payments!$C$2:$C$100,$B$2),\"\",INDEX(Payments!B$2:B$100,SMALL(IF(Payments!$C$2:$C$100<>\"\",IF(Payments!$C$2:$C$100=$B$2,ROW($C$7:$C$105)-ROW($C$7)+1)),ROWS(C$5:C39))))","v":""},{"$f":"IF(ROWS(D$5:D39)>COUNTIF(Payments!$C$2:$C$100,$B$2),\"\",INDEX(Payments!C$2:C$100,SMALL(IF(Payments!$C$2:$C$100<>\"\",IF(Payments!$C$2:$C$100=$B$2,ROW($C$7:$C$105)-ROW($C$7)+1)),ROWS(D$5:D39))))","v":""},{"$f":"IF(ROWS(E$5:E39)>COUNTIF(Payments!$C$2:$C$100,$B$2),\"\",INDEX(Payments!D$2:D$100,SMALL(IF(Payments!$C$2:$C$100<>\"\",IF(Payments!$C$2:$C$100=$B$2,ROW($C$7:$C$105)-ROW($C$7)+1)),ROWS(E$5:E39))))","v":""},{"$f":"IF(ROWS(F$5:F39)>COUNTIF(Payments!$C$2:$C$100,$B$2),\"\",INDEX(Payments!E$2:E$100,SMALL(IF(Payments!$C$2:$C$100<>\"\",IF(Payments!$C$2:$C$100=$B$2,ROW($C$7:$C$105)-ROW($C$7)+1)),ROWS(F$5:F39))))","v":""},{"$f":"IF(ROWS(G$5:G39)>COUNTIF(Payments!$C$2:$C$100,$B$2),\"\",INDEX(Payments!F$2:F$100,SMALL(IF(Payments!$C$2:$C$100<>\"\",IF(Payments!$C$2:$C$100=$B$2,ROW($C$7:$C$105)-ROW($C$7)+1)),ROWS(G$5:G39))))","v":""}]
[null,{"$f":"IF(C40=\"\",\"\",MAX($B$4:B39)+1)","v":""},{"$f":"IF(ROWS(C$5:C40)>COUNTIF(Payments!$C$2:$C$100,$B$2),\"\",INDEX(Payments!B$2:B$100,SMALL(IF(Payments!$C$2:$C$100<>\"\",IF(Payments!$C$2:$C$100=$B$2,ROW($C$7:$C$105)-ROW($C$7)+1)),ROWS(C$5:C40))))","v":""},{"$f":"IF(ROWS(D$5:D40)>COUNTIF(Payments!$C$2:$C$100,$B$2),\"\",INDEX(Payments!C$2:C$100,SMALL(IF(Payments!$C$2:$C$100<>\"\",IF(Payments!$C$2:$C$100=$B$2,ROW($C$7:$C$105)-ROW($C$7)+1)),ROWS(D$5:D40))))","v":""},{"$f":"IF(ROWS(E$5:E40)>COUNTIF(Payments!$C$2:$C$100,$B$2),\"\",INDEX(Payments!D$2:D$100,SMALL(IF(Payments!$C$2:$C$100<>\"\",IF(Payments!$C$2:$C$100=$B$2,ROW($C$7:$C$105)-ROW($C$7)+1)),ROWS(E$5:E40))))","v":""},{"$f":"IF(ROWS(F$5:F40)>COUNTIF(Payments!$C$2:$C$100,$B$2),\"\",INDEX(Payments!E$2:E$100,SMALL(IF(Payments!$C$2:$C$100<>\"\",IF(Payments!$C$2:$C$100=$B$2,ROW($C$7:$C$105)-ROW($C$7)+1)),ROWS(F$5:F40))))","v":""},{"$f":"IF(ROWS(G$5:G40)>COUNTIF(Payments!$C$2:$C$100,$B$2),\"\",INDEX(Payments!F$2:F$100,SMALL(IF(Payments!$C$2:$C$100<>\"\",IF(Payments!$C$2:$C$100=$B$2,ROW($C$7:$C$105)-ROW($C$7)+1)),ROWS(G$5:G40))))","v":""}]
[null,{"$f":"IF(C41=\"\",\"\",MAX($B$4:B40)+1)","v":""},{"$f":"IF(ROWS(C$5:C41)>COUNTIF(Payments!$C$2:$C$100,$B$2),\"\",INDEX(Payments!B$2:B$100,SMALL(IF(Payments!$C$2:$C$100<>\"\",IF(Payments!$C$2:$C$100=$B$2,ROW($C$7:$C$105)-ROW($C$7)+1)),ROWS(C$5:C41))))","v":""},{"$f":"IF(ROWS(D$5:D41)>COUNTIF(Payments!$C$2:$C$100,$B$2),\"\",INDEX(Payments!C$2:C$100,SMALL(IF(Payments!$C$2:$C$100<>\"\",IF(Payments!$C$2:$C$100=$B$2,ROW($C$7:$C$105)-ROW($C$7)+1)),ROWS(D$5:D41))))","v":""},{"$f":"IF(ROWS(E$5:E41)>COUNTIF(Payments!$C$2:$C$100,$B$2),\"\",INDEX(Payments!D$2:D$100,SMALL(IF(Payments!$C$2:$C$100<>\"\",IF(Payments!$C$2:$C$100=$B$2,ROW($C$7:$C$105)-ROW($C$7)+1)),ROWS(E$5:E41))))","v":""},{"$f":"IF(ROWS(F$5:F41)>COUNTIF(Payments!$C$2:$C$100,$B$2),\"\",INDEX(Payments!E$2:E$100,SMALL(IF(Payments!$C$2:$C$100<>\"\",IF(Payments!$C$2:$C$100=$B$2,ROW($C$7:$C$105)-ROW($C$7)+1)),ROWS(F$5:F41))))","v":""},{"$f":"IF(ROWS(G$5:G41)>COUNTIF(Payments!$C$2:$C$100,$B$2),\"\",INDEX(Payments!F$2:F$100,SMALL(IF(Payments!$C$2:$C$100<>\"\",IF(Payments!$C$2:$C$100=$B$2,ROW($C$7:$C$105)-ROW($C$7)+1)),ROWS(G$5:G41))))","v":""}]
[null,{"$f":"IF(C42=\"\",\"\",MAX($B$4:B41)+1)","v":""},{"$f":"IF(ROWS(C$5:C42)>COUNTIF(Payments!$C$2:$C$100,$B$2),\"\",INDEX(Payments!B$2:B$100,SMALL(IF(Payments!$C$2:$C$100<>\"\",IF(Payments!$C$2:$C$100=$B$2,ROW($C$7:$C$105)-ROW($C$7)+1)),ROWS(C$5:C42))))","v":""},{"$f":"IF(ROWS(D$5:D42)>COUNTIF(Payments!$C$2:$C$100,$B$2),\"\",INDEX(Payments!C$2:C$100,SMALL(IF(Payments!$C$2:$C$100<>\"\",IF(Payments!$C$2:$C$100=$B$2,ROW($C$7:$C$105)-ROW($C$7)+1)),ROWS(D$5:D42))))","v":""},{"$f":"IF(ROWS(E$5:E42)>COUNTIF(Payments!$C$2:$C$100,$B$2),\"\",INDEX(Payments!D$2:D$100,SMALL(IF(Payments!$C$2:$C$100<>\"\",IF(Payments!$C$2:$C$100=$B$2,ROW($C$7:$C$105)-ROW($C$7)+1)),ROWS(E$5:E42))))","v":""},{"$f":"IF(ROWS(F$5:F42)>COUNTIF(Payments!$C$2:$C$100,$B$2),\"\",INDEX(Payments!E$2:E$100,SMALL(IF(Payments!$C$2:$C$100<>\"\",IF(Payments!$C$2:$C$100=$B$2,ROW($C$7:$C$105)-ROW($C$7)+1)),ROWS(F$5:F42))))","v":""},{"$f":"IF(ROWS(G$5:G42)>COUNTIF(Payments!$C$2:$C$100,$B$2),\"\",INDEX(Payments!F$2:F$100,SMALL(IF(Payments!$C$2:$C$100<>\"\",IF(Payments!$C$2:$C$100=$B$2,ROW($C$7:$C$105)-ROW($C$7)+1)),ROWS(G$5:G42))))","v":""}]
[null,{"$f":"IF(C43=\"\",\"\",MAX($B$4:B42)+1)","v":""},{"$f":"IF(ROWS(C$5:C43)>COUNTIF(Payments!$C$2:$C$100,$B$2),\"\",INDEX(Payments!B$2:B$100,SMALL(IF(Payments!$C$2:$C$100<>\"\",IF(Payments!$C$2:$C$100=$B$2,ROW($C$7:$C$105)-ROW($C$7)+1)),ROWS(C$5:C43))))","v":""},{"$f":"IF(ROWS(D$5:D43)>COUNTIF(Payments!$C$2:$C$100,$B$2),\"\",INDEX(Payments!C$2:C$100,SMALL(IF(Payments!$C$2:$C$100<>\"\",IF(Payments!$C$2:$C$100=$B$2,ROW($C$7:$C$105)-ROW($C$7)+1)),ROWS(D$5:D43))))","v":""},{"$f":"IF(ROWS(E$5:E43)>COUNTIF(Payments!$C$2:$C$100,$B$2),\"\",INDEX(Payments!D$2:D$100,SMALL(IF(Payments!$C$2:$C$100<>\"\",IF(Payments!$C$2:$C$100=$B$2,ROW($C$7:$C$105)-ROW($C$7)+1)),ROWS(E$5:E43))))","v":""},{"$f":"IF(ROWS(F$5:F43)>COUNTIF(Payments!$C$2:$C$100,$B$2),\"\",INDEX(Payments!E$2:E$100,SMALL(IF(Payments!$C$2:$C$100<>\"\",IF(Payments!$C$2:$C$100=$B$2,ROW($C$7:$C$105)-ROW($C$7)+1)),ROWS(F$5:F43))))","v":""},{"$f":"IF(ROWS(G$5:G43)>COUNTIF(Payments!$C$2:$C$100,$B$2),\"\",INDEX(Payments!F$2:F$100,SMALL(IF(Payments!$C$2:$C$100<>\"\",IF(Payments!$C$2:$C$100=$B$2,ROW($C$7:$C$105)-ROW($C$7)+1)),ROWS(G$5:G43))))","v":""}]
[null,{"$f":"IF(C44=\"\",\"\",MAX($B$4:B43)+1)","v":""},{"$f":"IF(ROWS(C$5:C44)>COUNTIF(Payments!$C$2:$C$100,$B$2),\"\",INDEX(Payments!B$2:B$100,SMALL(IF(Payments!$C$2:$C$100<>\"\",IF(Payments!$C$2:$C$100=$B$2,ROW($C$7:$C$105)-ROW($C$7)+1)),ROWS(C$5:C44))))","v":""},{"$f":"IF(ROWS(D$5:D44)>COUNTIF(Payments!$C$2:$C$100,$B$2),\"\",INDEX(Payments!C$2:C$100,SMALL(IF(Payments!$C$2:$C$100<>\"\",IF(Payments!$C$2:$C$100=$B$2,ROW($C$7:$C$105)-ROW($C$7)+1)),ROWS(D$5:D44))))","v":""},{"$f":"IF(ROWS(E$5:E44)>COUNTIF(Payments!$C$2:$C$100,$B$2),\"\",INDEX(Payments!D$2:D$100,SMALL(IF(Payments!$C$2:$C$100<>\"\",IF(Payments!$C$2:$C$100=$B$2,ROW($C$7:$C$105)-ROW($C$7)+1)),ROWS(E$5:E44))))","v":""},{"$f":"IF(ROWS(F$5:F44)>COUNTIF(Payments!$C$2:$C$100,$B$2),\"\",INDEX(Payments!E$2:E$100,SMALL(IF(Payments!$C$2:$C$100<>\"\",IF(Payments!$C$2:$C$100=$B$2,ROW($C$7:$C$105)-ROW($C$7)+1)),ROWS(F$5:F44))))","v":""},{"$f":"IF(ROWS(G$5:G44)>COUNTIF(Payments!$C$2:$C$100,$B$2),\"\",INDEX(Payments!F$2:F$100,SMALL(IF(Payments!$C$2:$C$100<>\"\",IF(Payments!$C$2:$C$100=$B$2,ROW($C$7:$C$105)-ROW($C$7)+1)),ROWS(G$5:G44))))","v":""}]
[null,{"$f":"IF(C45=\"\",\"\",MAX($B$4:B44)+1)","v":""},{"$f":"IF(ROWS(C$5:C45)>COUNTIF(Payments!$C$2:$C$100,$B$2),\"\",INDEX(Payments!B$2:B$100,SMALL(IF(Payments!$C$2:$C$100<>\"\",IF(Payments!$C$2:$C$100=$B$2,ROW($C$7:$C$105)-ROW($C$7)+1)),ROWS(C$5:C45))))","v":""},{"$f":"IF(ROWS(D$5:D45)>COUNTIF(Payments!$C$2:$C$100,$B$2),\"\",INDEX(Payments!C$2:C$100,SMALL(IF(Payments!$C$2:$C$100<>\"\",IF(Payments!$C$2:$C$100=$B$2,ROW($C$7:$C$105)-ROW($C$7)+1)),ROWS(D$5:D45))))","v":""},{"$f":"IF(ROWS(E$5:E45)>COUNTIF(Payments!$C$2:$C$100,$B$2),\"\",INDEX(Payments!D$2:D$100,SMALL(IF(Payments!$C$2:$C$100<>\"\",IF(Payments!$C$2:$C$100=$B$2,ROW($C$7:$C$105)-ROW($C$7)+1)),ROWS(E$5:E45))))","v":""},{"$f":"IF(ROWS(F$5:F45)>COUNTIF(Payments!$C$2:$C$100,$B$2),\"\",INDEX(Payments!E$2:E$100,SMALL(IF(Payments!$C$2:$C$100<>\"\",IF(Payments!$C$2:$C$100=$B$2,ROW($C$7:$C$105)-ROW($C$7)+1)),ROWS(F$5:F45))))","v":""},{"$f":"IF(ROWS(G$5:G45)>COUNTIF(Payments!$C$2:$C$100,$B$2),\"\",INDEX(Payments!F$2:F$100,SMALL(IF(Payments!$C$2:$C$100<>\"\",IF(Payments!$C$2:$C$100=$B$2,ROW($C$7:$C$105)-ROW($C$7)+1)),ROWS(G$5:G45))))","v":""}]
[null,{"$f":"IF(C46=\"\",\"\",MAX($B$4:B45)+1)","v":""},{"$f":"IF(ROWS(C$5:C46)>COUNTIF(Payments!$C$2:$C$100,$B$2),\"\",INDEX(Payments!B$2:B$100,SMALL(IF(Payments!$C$2:$C$100<>\"\",IF(Payments!$C$2:$C$100=$B$2,ROW($C$7:$C$105)-ROW($C$7)+1)),ROWS(C$5:C46))))","v":""},{"$f":"IF(ROWS(D$5:D46)>COUNTIF(Payments!$C$2:$C$100,$B$2),\"\",INDEX(Payments!C$2:C$100,SMALL(IF(Payments!$C$2:$C$100<>\"\",IF(Payments!$C$2:$C$100=$B$2,ROW($C$7:$C$105)-ROW($C$7)+1)),ROWS(D$5:D46))))","v":""},{"$f":"IF(ROWS(E$5:E46)>COUNTIF(Payments!$C$2:$C$100,$B$2),\"\",INDEX(Payments!D$2:D$100,SMALL(IF(Payments!$C$2:$C$100<>\"\",IF(Payments!$C$2:$C$100=$B$2,ROW($C$7:$C$105)-ROW($C$7)+1)),ROWS(E$5:E46))))","v":""},{"$f":"IF(ROWS(F$5:F46)>COUNTIF(Payments!$C$2:$C$100,$B$2),\"\",INDEX(Payments!E$2:E$100,SMALL(IF(Payments!$C$2:$C$100<>\"\",IF(Payments!$C$2:$C$100=$B$2,ROW($C$7:$C$105)-ROW($C$7)+1)),ROWS(F$5:F46))))","v":""},{"$f":"IF(ROWS(G$5:G46)>COUNTIF(Payments!$C$2:$C$100,$B$2),\"\",INDEX(Payments!F$2:F$100,SMALL(IF(Payments!$C$2:$C$100<>\"\",IF(Payments!$C$2:$C$100=$B$2,ROW($C$7:$C$105)-ROW($C$7)+1)),ROWS(G$5:G46))))","v":""}]
[null,{"$f":"IF(C47=\"\",\"\",MAX($B$4:B46)+1)","v":""},{"$f":"IF(ROWS(C$5:C47)>COUNTIF(Payments!$C$2:$C$100,$B$2),\"\",INDEX(Payments!B$2:B$100,SMALL(IF(Payments!$C$2:$C$100<>\"\",IF(Payments!$C$2:$C$100=$B$2,ROW($C$7:$C$105)-ROW($C$7)+1)),ROWS(C$5:C47))))","v":""},{"$f":"IF(ROWS(D$5:D47)>COUNTIF(Payments!$C$2:$C$100,$B$2),\"\",INDEX(Payments!C$2:C$100,SMALL(IF(Payments!$C$2:$C$100<>\"\",IF(Payments!$C$2:$C$100=$B$2,ROW($C$7:$C$105)-ROW($C$7)+1)),ROWS(D$5:D47))))","v":""},{"$f":"IF(ROWS(E$5:E47)>COUNTIF(Payments!$C$2:$C$100,$B$2),\"\",INDEX(Payments!D$2:D$100,SMALL(IF(Payments!$C$2:$C$100<>\"\",IF(Payments!$C$2:$C$100=$B$2,ROW($C$7:$C$105)-ROW($C$7)+1)),ROWS(E$5:E47))))","v":""},{"$f":"IF(ROWS(F$5:F47)>COUNTIF(Payments!$C$2:$C$100,$B$2),\"\",INDEX(Payments!E$2:E$100,SMALL(IF(Payments!$C$2:$C$100<>\"\",IF(Payments!$C$2:$C$100=$B$2,ROW($C$7:$C$105)-ROW($C$7)+1)),ROWS(F$5:F47))))","v":""},{"$f":"IF(ROWS(G$5:G47)>COUNTIF(Payments!$C$2:$C$100,$B$2),\"\",INDEX(Payments!F$2:F$100,SMALL(IF(Payments!$C$2:$C$100<>\"\",IF(Payments!$C$2:$C$100=$B$2,ROW($C$7:$C$105)-ROW($C$7)+1)),ROWS(G$5:G47))))","v":""}]
[null,{"$f":"IF(C48=\"\",\"\",MAX($B$4:B47)+1)","v":""},{"$f":"IF(ROWS(C$5:C48)>COUNTIF(Payments!$C$2:$C$100,$B$2),\"\",INDEX(Payments!B$2:B$100,SMALL(IF(Payments!$C$2:$C$100<>\"\",IF(Payments!$C$2:$C$100=$B$2,ROW($C$7:$C$105)-ROW($C$7)+1)),ROWS(C$5:C48))))","v":""},{"$f":"IF(ROWS(D$5:D48)>COUNTIF(Payments!$C$2:$C$100,$B$2),\"\",INDEX(Payments!C$2:C$100,SMALL(IF(Payments!$C$2:$C$100<>\"\",IF(Payments!$C$2:$C$100=$B$2,ROW($C$7:$C$105)-ROW($C$7)+1)),ROWS(D$5:D48))))","v":""},{"$f":"IF(ROWS(E$5:E48)>COUNTIF(Payments!$C$2:$C$100,$B$2),\"\",INDEX(Payments!D$2:D$100,SMALL(IF(Payments!$C$2:$C$100<>\"\",IF(Payments!$C$2:$C$100=$B$2,ROW($C$7:$C$105)-ROW($C$7)+1)),ROWS(E$5:E48))))","v":""},{"$f":"IF(ROWS(F$5:F48)>COUNTIF(Payments!$C$2:$C$100,$B$2),\"\",INDEX(Payments!E$2:E$100,SMALL(IF(Payments!$C$2:$C$100<>\"\",IF(Payments!$C$2:$C$100=$B$2,ROW($C$7:$C$105)-ROW($C$7)+1)),ROWS(F$5:F48))))","v":""},{"$f":"IF(ROWS(G$5:G48)>COUNTIF(Payments!$C$2:$C$100,$B$2),\"\",INDEX(Payments!F$2:F$100,SMALL(IF(Payments!$C$2:$C$100<>\"\",IF(Payments!$C$2:$C$100=$B$2,ROW($C$7:$C$105)-ROW($C$7)+1)),ROWS(G$5:G48))))","v":""}]
[null,{"$f":"IF(C49=\"\",\"\",MAX($B$4:B48)+1)","v":""},{"$f":"IF(ROWS(C$5:C49)>COUNTIF(Payments!$C$2:$C$100,$B$2),\"\",INDEX(Payments!B$2:B$100,SMALL(IF(Payments!$C$2:$C$100<>\"\",IF(Payments!$C$2:$C$100=$B$2,ROW($C$7:$C$105)-ROW($C$7)+1)),ROWS(C$5:C49))))","v":""},{"$f":"IF(ROWS(D$5:D49)>COUNTIF(Payments!$C$2:$C$100,$B$2),\"\",INDEX(Payments!C$2:C$100,SMALL(IF(Payments!$C$2:$C$100<>\"\",IF(Payments!$C$2:$C$100=$B$2,ROW($C$7:$C$105)-ROW($C$7)+1)),ROWS(D$5:D49))))","v":""},{"$f":"IF(ROWS(E$5:E49)>COUNTIF(Payments!$C$2:$C$100,$B$2),\"\",INDEX(Payments!D$2:D$100,SMALL(IF(Payments!$C$2:$C$100<>\"\",IF(Payments!$C$2:$C$100=$B$2,ROW($C$7:$C$105)-ROW($C$7)+1)),ROWS(E$5:E49))))","v":""},{"$f":"IF(ROWS(F$5:F49)>COUNTIF(Payments!$C$2:$C$100,$B$2),\"\",INDEX(Payments!E$2:E$100,SMALL(IF(Payments!$C$2:$C$100<>\"\",IF(Payments!$C$2:$C$100=$B$2,ROW($C$7:$C$105)-ROW($C$7)+1)),ROWS(F$5:F49))))","v":""},{"$f":"IF(ROWS(G$5:G49)>COUNTIF(Payments!$C$2:$C$100,$B$2),\"\",INDEX(Payments!F$2:F$100,SMALL(IF(Payments!$C$2:$C$100<>\"\",IF(Payments!$C$2:$C$100=$B$2,ROW($C$7:$C$105)-ROW($C$7)+1)),ROWS(G$5:G49))))","v":""}]
[null,{"$f":"IF(C50=\"\",\"\",MAX($B$4:B49)+1)","v":""},{"$f":"IF(ROWS(C$5:C50)>COUNTIF(Payments!$C$2:$C$100,$B$2),\"\",INDEX(Payments!B$2:B$100,SMALL(IF(Payments!$C$2:$C$100<>\"\",IF(Payments!$C$2:$C$100=$B$2,ROW($C$7:$C$105)-ROW($C$7)+1)),ROWS(C$5:C50))))","v":""},{"$f":"IF(ROWS(D$5:D50)>COUNTIF(Payments!$C$2:$C$100,$B$2),\"\",INDEX(Payments!C$2:C$100,SMALL(IF(Payments!$C$2:$C$100<>\"\",IF(Payments!$C$2:$C$100=$B$2,ROW($C$7:$C$105)-ROW($C$7)+1)),ROWS(D$5:D50))))","v":""},{"$f":"IF(ROWS(E$5:E50)>COUNTIF(Payments!$C$2:$C$100,$B$2),\"\",INDEX(Payments!D$2:D$100,SMALL(IF(Payments!$C$2:$C$100<>\"\",IF(Payments!$C$2:$C$100=$B$2,ROW($C$7:$C$105)-ROW($C$7)+1)),ROWS(E$5:E50))))","v":""},{"$f":"IF(ROWS(F$5:F50)>COUNTIF(Payments!$C$2:$C$100,$B$2),\"\",INDEX(Payments!E$2:E$100,SMALL(IF(Payments!$C$2:$C$100<>\"\",IF(Payments!$C$2:$C$100=$B$2,ROW($C$7:$C$105)-ROW($C$7)+1)),ROWS(F$5:F50))))","v":""},{"$f":"IF(ROWS(G$5:G50)>COUNTIF(Payments!$C$2:$C$100,$B$2),\"\",INDEX(Payments!F$2:F$100,SMALL(IF(Payments!$C$2:$C$100<>\"\",IF(Payments!$C$2:$C$100=$B$2,ROW($C$7:$C$105)-ROW($C$7)+1)),ROWS(G$5:G50))))","v":""}]
[null,{"$f":"IF(C51=\"\",\"\",MAX($B$4:B50)+1)","v":""},{"$f":"IF(ROWS(C$5:C51)>COUNTIF(Payments!$C$2:$C$100,$B$2),\"\",INDEX(Payments!B$2:B$100,SMALL(IF(Payments!$C$2:$C$100<>\"\",IF(Payments!$C$2:$C$100=$B$2,ROW($C$7:$C$105)-ROW($C$7)+1)),ROWS(C$5:C51))))","v":""},{"$f":"IF(ROWS(D$5:D51)>COUNTIF(Payments!$C$2:$C$100,$B$2),\"\",INDEX(Payments!C$2:C$100,SMALL(IF(Payments!$C$2:$C$100<>\"\",IF(Payments!$C$2:$C$100=$B$2,ROW($C$7:$C$105)-ROW($C$7)+1)),ROWS(D$5:D51))))","v":""},{"$f":"IF(ROWS(E$5:E51)>COUNTIF(Payments!$C$2:$C$100,$B$2),\"\",INDEX(Payments!D$2:D$100,SMALL(IF(Payments!$C$2:$C$100<>\"\",IF(Payments!$C$2:$C$100=$B$2,ROW($C$7:$C$105)-ROW($C$7)+1)),ROWS(E$5:E51))))","v":""},{"$f":"IF(ROWS(F$5:F51)>COUNTIF(Payments!$C$2:$C$100,$B$2),\"\",INDEX(Payments!E$2:E$100,SMALL(IF(Payments!$C$2:$C$100<>\"\",IF(Payments!$C$2:$C$100=$B$2,ROW($C$7:$C$105)-ROW($C$7)+1)),ROWS(F$5:F51))))","v":""},{"$f":"IF(ROWS(G$5:G51)>COUNTIF(Payments!$C$2:$C$100,$B$2),\"\",INDEX(Payments!F$2:F$100,SMALL(IF(Payments!$C$2:$C$100<>\"\",IF(Payments!$C$2:$C$100=$B$2,ROW($C$7:$C$105)-ROW($C$7)+1)),ROWS(G$5:G51))))","v":""}]
[null,{"$f":"IF(C52=\"\",\"\",MAX($B$4:B51)+1)","v":""},{"$f":"IF(ROWS(C$5:C52)>COUNTIF(Payments!$C$2:$C$100,$B$2),\"\",INDEX(Payments!B$2:B$100,SMALL(IF(Payments!$C$2:$C$100<>\"\",IF(Payments!$C$2:$C$100=$B$2,ROW($C$7:$C$105)-ROW($C$7)+1)),ROWS(C$5:C52))))","v":""},{"$f":"IF(ROWS(D$5:D52)>COUNTIF(Payments!$C$2:$C$100,$B$2),\"\",INDEX(Payments!C$2:C$100,SMALL(IF(Payments!$C$2:$C$100<>\"\",IF(Payments!$C$2:$C$100=$B$2,ROW($C$7:$C$105)-ROW($C$7)+1)),ROWS(D$5:D52))))","v":""},{"$f":"IF(ROWS(E$5:E52)>COUNTIF(Payments!$C$2:$C$100,$B$2),\"\",INDEX(Payments!D$2:D$100,SMALL(IF(Payments!$C$2:$C$100<>\"\",IF(Payments!$C$2:$C$100=$B$2,ROW($C$7:$C$105)-ROW($C$7)+1)),ROWS(E$5:E52))))","v":""},{"$f":"IF(ROWS(F$5:F52)>COUNTIF(Payments!$C$2:$C$100,$B$2),\"\",INDEX(Payments!E$2:E$100,SMALL(IF(Payments!$C$2:$C$100<>\"\",IF(Payments!$C$2:$C$100=$B$2,ROW($C$7:$C$105)-ROW($C$7)+1)),ROWS(F$5:F52))))","v":""},{"$f":"IF(ROWS(G$5:G52)>COUNTIF(Payments!$C$2:$C$100,$B$2),\"\",INDEX(Payments!F$2:F$100,SMALL(IF(Payments!$C$2:$C$100<>\"\",IF(Payments!$C$2:$C$100=$B$2,ROW($C$7:$C$105)-ROW($C$7)+1)),ROWS(G$5:G52))))","v":""}]
[null,{"$f":"IF(C53=\"\",\"\",MAX($B$4:B52)+1)","v":""},{"$f":"IF(ROWS(C$5:C53)>COUNTIF(Payments!$C$2:$C$100,$B$2),\"\",INDEX(Payments!B$2:B$100,SMALL(IF(Payments!$C$2:$C$100<>\"\",IF(Payments!$C$2:$C$100=$B$2,ROW($C$7:$C$105)-ROW($C$7)+1)),ROWS(C$5:C53))))","v":""},{"$f":"IF(ROWS(D$5:D53)>COUNTIF(Payments!$C$2:$C$100,$B$2),\"\",INDEX(Payments!C$2:C$100,SMALL(IF(Payments!$C$2:$C$100<>\"\",IF(Payments!$C$2:$C$100=$B$2,ROW($C$7:$C$105)-ROW($C$7)+1)),ROWS(D$5:D53))))","v":""},{"$f":"IF(ROWS(E$5:E53)>COUNTIF(Payments!$C$2:$C$100,$B$2),\"\",INDEX(Payments!D$2:D$100,SMALL(IF(Payments!$C$2:$C$100<>\"\",IF(Payments!$C$2:$C$100=$B$2,ROW($C$7:$C$105)-ROW($C$7)+1)),ROWS(E$5:E53))))","v":""},{"$f":"IF(ROWS(F$5:F53)>COUNTIF(Payments!$C$2:$C$100,$B$2),\"\",INDEX(Payments!E$2:E$100,SMALL(IF(Payments!$C$2:$C$100<>\"\",IF(Payments!$C$2:$C$100=$B$2,ROW($C$7:$C$105)-ROW($C$7)+1)),ROWS(F$5:F53))))","v":""},{"$f":"IF(ROWS(G$5:G53)>COUNTIF(Payments!$C$2:$C$100,$B$2),\"\",INDEX(Payments!F$2:F$100,SMALL(IF(Payments!$C$2:$C$100<>\"\",IF(Payments!$C$2:$C$100=$B$2,ROW($C$7:$C$105)-ROW($C$7)+1)),ROWS(G$5:G53))))","v":""}]
[null,{"$f":"IF(C54=\"\",\"\",MAX($B$4:B53)+1)","v":""},{"$f":"IF(ROWS(C$5:C54)>COUNTIF(Payments!$C$2:$C$100,$B$2),\"\",INDEX(Payments!B$2:B$100,SMALL(IF(Payments!$C$2:$C$100<>\"\",IF(Payments!$C$2:$C$100=$B$2,ROW($C$7:$C$105)-ROW($C$7)+1)),ROWS(C$5:C54))))","v":""},{"$f":"IF(ROWS(D$5:D54)>COUNTIF(Payments!$C$2:$C$100,$B$2),\"\",INDEX(Payments!C$2:C$100,SMALL(IF(Payments!$C$2:$C$100<>\"\",IF(Payments!$C$2:$C$100=$B$2,ROW($C$7:$C$105)-ROW($C$7)+1)),ROWS(D$5:D54))))","v":""},{"$f":"IF(ROWS(E$5:E54)>COUNTIF(Payments!$C$2:$C$100,$B$2),\"\",INDEX(Payments!D$2:D$100,SMALL(IF(Payments!$C$2:$C$100<>\"\",IF(Payments!$C$2:$C$100=$B$2,ROW($C$7:$C$105)-ROW($C$7)+1)),ROWS(E$5:E54))))","v":""},{"$f":"IF(ROWS(F$5:F54)>COUNTIF(Payments!$C$2:$C$100,$B$2),\"\",INDEX(Payments!E$2:E$100,SMALL(IF(Payments!$C$2:$C$100<>\"\",IF(Payments!$C$2:$C$100=$B$2,ROW($C$7:$C$105)-ROW($C$7)+1)),ROWS(F$5:F54))))","v":""},{"$f":"IF(ROWS(G$5:G54)>COUNTIF(Payments!$C$2:$C$100,$B$2),\"\",INDEX(Payments!F$2:F$100,SMALL(IF(Payments!$C$2:$C$100<>\"\",IF(Payments!$C$2:$C$100=$B$2,ROW($C$7:$C$105)-ROW($C$7)+1)),ROWS(G$5:G54))))","v":""}]
[null,{"$f":"IF(C55=\"\",\"\",MAX($B$4:B54)+1)","v":""},{"$f":"IF(ROWS(C$5:C55)>COUNTIF(Payments!$C$2:$C$100,$B$2),\"\",INDEX(Payments!B$2:B$100,SMALL(IF(Payments!$C$2:$C$100<>\"\",IF(Payments!$C$2:$C$100=$B$2,ROW($C$7:$C$105)-ROW($C$7)+1)),ROWS(C$5:C55))))","v":""},{"$f":"IF(ROWS(D$5:D55)>COUNTIF(Payments!$C$2:$C$100,$B$2),\"\",INDEX(Payments!C$2:C$100,SMALL(IF(Payments!$C$2:$C$100<>\"\",IF(Payments!$C$2:$C$100=$B$2,ROW($C$7:$C$105)-ROW($C$7)+1)),ROWS(D$5:D55))))","v":""},{"$f":"IF(ROWS(E$5:E55)>COUNTIF(Payments!$C$2:$C$100,$B$2),\"\",INDEX(Payments!D$2:D$100,SMALL(IF(Payments!$C$2:$C$100<>\"\",IF(Payments!$C$2:$C$100=$B$2,ROW($C$7:$C$105)-ROW($C$7)+1)),ROWS(E$5:E55))))","v":""},{"$f":"IF(ROWS(F$5:F55)>COUNTIF(Payments!$C$2:$C$100,$B$2),\"\",INDEX(Payments!E$2:E$100,SMALL(IF(Payments!$C$2:$C$100<>\"\",IF(Payments!$C$2:$C$100=$B$2,ROW($C$7:$C$105)-ROW($C$7)+1)),ROWS(F$5:F55))))","v":""},{"$f":"IF(ROWS(G$5:G55)>COUNTIF(Payments!$C$2:$C$100,$B$2),\"\",INDEX(Payments!F$2:F$100,SMALL(IF(Payments!$C$2:$C$100<>\"\",IF(Payments!$C$2:$C$100=$B$2,ROW($C$7:$C$105)-ROW($C$7)+1)),ROWS(G$5:G55))))","v":""}]
[null,{"$f":"IF(C56=\"\",\"\",MAX($B$4:B55)+1)","v":""},{"$f":"IF(ROWS(C$5:C56)>COUNTIF(Payments!$C$2:$C$100,$B$2),\"\",INDEX(Payments!B$2:B$100,SMALL(IF(Payments!$C$2:$C$100<>\"\",IF(Payments!$C$2:$C$100=$B$2,ROW($C$7:$C$105)-ROW($C$7)+1)),ROWS(C$5:C56))))","v":""},{"$f":"IF(ROWS(D$5:D56)>COUNTIF(Payments!$C$2:$C$100,$B$2),\"\",INDEX(Payments!C$2:C$100,SMALL(IF(Payments!$C$2:$C$100<>\"\",IF(Payments!$C$2:$C$100=$B$2,ROW($C$7:$C$105)-ROW($C$7)+1)),ROWS(D$5:D56))))","v":""},{"$f":"IF(ROWS(E$5:E56)>COUNTIF(Payments!$C$2:$C$100,$B$2),\"\",INDEX(Payments!D$2:D$100,SMALL(IF(Payments!$C$2:$C$100<>\"\",IF(Payments!$C$2:$C$100=$B$2,ROW($C$7:$C$105)-ROW($C$7)+1)),ROWS(E$5:E56))))","v":""},{"$f":"IF(ROWS(F$5:F56)>COUNTIF(Payments!$C$2:$C$100,$B$2),\"\",INDEX(Payments!E$2:E$100,SMALL(IF(Payments!$C$2:$C$100<>\"\",IF(Payments!$C$2:$C$100=$B$2,ROW($C$7:$C$105)-ROW($C$7)+1)),ROWS(F$5:F56))))","v":""},{"$f":"IF(ROWS(G$5:G56)>COUNTIF(Payments!$C$2:$C$100,$B$2),\"\",INDEX(Payments!F$2:F$100,SMALL(IF(Payments!$C$2:$C$100<>\"\",IF(Payments!$C$2:$C$100=$B$2,ROW($C$7:$C$105)-ROW($C$7)+1)),ROWS(G$5:G56))))","v":""}]
[null,{"$f":"IF(C57=\"\",\"\",MAX($B$4:B56)+1)","v":""},{"$f":"IF(ROWS(C$5:C57)>COUNTIF(Payments!$C$2:$C$100,$B$2),\"\",INDEX(Payments!B$2:B$100,SMALL(IF(Payments!$C$2:$C$100<>\"\",IF(Payments!$C$2:$C$100=$B$2,ROW($C$7:$C$105)-ROW($C$7)+1)),ROWS(C$5:C57))))","v":""},{"$f":"IF(ROWS(D$5:D57)>COUNTIF(Payments!$C$2:$C$100,$B$2),\"\",INDEX(Payments!C$2:C$100,SMALL(IF(Payments!$C$2:$C$100<>\"\",IF(Payments!$C$2:$C$100=$B$2,ROW($C$7:$C$105)-ROW($C$7)+1)),ROWS(D$5:D57))))","v":""},{"$f":"IF(ROWS(E$5:E57)>COUNTIF(Payments!$C$2:$C$100,$B$2),\"\",INDEX(Payments!D$2:D$100,SMALL(IF(Payments!$C$2:$C$100<>\"\",IF(Payments!$C$2:$C$100=$B$2,ROW($C$7:$C$105)-ROW($C$7)+1)),ROWS(E$5:E57))))","v":""},{"$f":"IF(ROWS(F$5:F57)>COUNTIF(Payments!$C$2:$C$100,$B$2),\"\",INDEX(Payments!E$2:E$100,SMALL(IF(Payments!$C$2:$C$100<>\"\",IF(Payments!$C$2:$C$100=$B$2,ROW($C$7:$C$105)-ROW($C$7)+1)),ROWS(F$5:F57))))","v":""},{"$f":"IF(ROWS(G$5:G57)>COUNTIF(Payments!$C$2:$C$100,$B$2),\"\",INDEX(Payments!F$2:F$100,SMALL(IF(Payments!$C$2:$C$100<>\"\",IF(Payments!$C$2:$C$100=$B$2,ROW($C$7:$C$105)-ROW($C$7)+1)),ROWS(G$5:G57))))","v":""}]
[null,{"$f":"IF(C58=\"\",\"\",MAX($B$4:B57)+1)","v":""},{"$f":"IF(ROWS(C$5:C58)>COUNTIF(Payments!$C$2:$C$100,$B$2),\"\",INDEX(Payments!B$2:B$100,SMALL(IF(Payments!$C$2:$C$100<>\"\",IF(Payments!$C$2:$C$100=$B$2,ROW($C$7:$C$105)-ROW($C$7)+1)),ROWS(C$5:C58))))","v":""},{"$f":"IF(ROWS(D$5:D58)>COUNTIF(Payments!$C$2:$C$100,$B$2),\"\",INDEX(Payments!C$2:C$100,SMALL(IF(Payments!$C$2:$C$100<>\"\",IF(Payments!$C$2:$C$100=$B$2,ROW($C$7:$C$105)-ROW($C$7)+1)),ROWS(D$5:D58))))","v":""},{"$f":"IF(ROWS(E$5:E58)>COUNTIF(Payments!$C$2:$C$100,$B$2),\"\",INDEX(Payments!D$2:D$100,SMALL(IF(Payments!$C$2:$C$100<>\"\",IF(Payments!$C$2:$C$100=$B$2,ROW($C$7:$C$105)-ROW($C$7)+1)),ROWS(E$5:E58))))","v":""},{"$f":"IF(ROWS(F$5:F58)>COUNTIF(Payments!$C$2:$C$100,$B$2),\"\",INDEX(Payments!E$2:E$100,SMALL(IF(Payments!$C$2:$C$100<>\"\",IF(Payments!$C$2:$C$100=$B$2,ROW($C$7:$C$105)-ROW($C$7)+1)),ROWS(F$5:F58))))","v":""},{"$f":"IF(ROWS(G$5:G58)>COUNTIF(Payments!$C$2:$C$100,$B$2),\"\",INDEX(Payments!F$2:F$100,SMALL(IF(Payments!$C$2:$C$100<>\"\",IF(Payments!$C$2:$C$100=$B$2,ROW($C$7:$C$105)-ROW($C$7)+1)),ROWS(G$5:G58))))","v":""}]
[null,{"$f":"IF(C59=\"\",\"\",MAX($B$4:B58)+1)","v":""},{"$f":"IF(ROWS(C$5:C59)>COUNTIF(Payments!$C$2:$C$100,$B$2),\"\",INDEX(Payments!B$2:B$100,SMALL(IF(Payments!$C$2:$C$100<>\"\",IF(Payments!$C$2:$C$100=$B$2,ROW($C$7:$C$105)-ROW($C$7)+1)),ROWS(C$5:C59))))","v":""},{"$f":"IF(ROWS(D$5:D59)>COUNTIF(Payments!$C$2:$C$100,$B$2),\"\",INDEX(Payments!C$2:C$100,SMALL(IF(Payments!$C$2:$C$100<>\"\",IF(Payments!$C$2:$C$100=$B$2,ROW($C$7:$C$105)-ROW($C$7)+1)),ROWS(D$5:D59))))","v":""},{"$f":"IF(ROWS(E$5:E59)>COUNTIF(Payments!$C$2:$C$100,$B$2),\"\",INDEX(Payments!D$2:D$100,SMALL(IF(Payments!$C$2:$C$100<>\"\",IF(Payments!$C$2:$C$100=$B$2,ROW($C$7:$C$105)-ROW($C$7)+1)),ROWS(E$5:E59))))","v":""},{"$f":"IF(ROWS(F$5:F59)>COUNTIF(Payments!$C$2:$C$100,$B$2),\"\",INDEX(Payments!E$2:E$100,SMALL(IF(Payments!$C$2:$C$100<>\"\",IF(Payments!$C$2:$C$100=$B$2,ROW($C$7:$C$105)-ROW($C$7)+1)),ROWS(F$5:F59))))","v":""},{"$f":"IF(ROWS(G$5:G59)>COUNTIF(Payments!$C$2:$C$100,$B$2),\"\",INDEX(Payments!F$2:F$100,SMALL(IF(Payments!$C$2:$C$100<>\"\",IF(Payments!$C$2:$C$100=$B$2,ROW($C$7:$C$105)-ROW($C$7)+1)),ROWS(G$5:G59))))","v":""}]
[null,{"$f":"IF(C60=\"\",\"\",MAX($B$4:B59)+1)","v":""},{"$f":"IF(ROWS(C$5:C60)>COUNTIF(Payments!$C$2:$C$100,$B$2),\"\",INDEX(Payments!B$2:B$100,SMALL(IF(Payments!$C$2:$C$100<>\"\",IF(Payments!$C$2:$C$100=$B$2,ROW($C$7:$C$105)-ROW($C$7)+1)),ROWS(C$5:C60))))","v":""},{"$f":"IF(ROWS(D$5:D60)>COUNTIF(Payments!$C$2:$C$100,$B$2),\"\",INDEX(Payments!C$2:C$100,SMALL(IF(Payments!$C$2:$C$100<>\"\",IF(Payments!$C$2:$C$100=$B$2,ROW($C$7:$C$105)-ROW($C$7)+1)),ROWS(D$5:D60))))","v":""},{"$f":"IF(ROWS(E$5:E60)>COUNTIF(Payments!$C$2:$C$100,$B$2),\"\",INDEX(Payments!D$2:D$100,SMALL(IF(Payments!$C$2:$C$100<>\"\",IF(Payments!$C$2:$C$100=$B$2,ROW($C$7:$C$105)-ROW($C$7)+1)),ROWS(E$5:E60))))","v":""},{"$f":"IF(ROWS(F$5:F60)>COUNTIF(Payments!$C$2:$C$100,$B$2),\"\",INDEX(Payments!E$2:E$100,SMALL(IF(Payments!$C$2:$C$100<>\"\",IF(Payments!$C$2:$C$100=$B$2,ROW($C$7:$C$105)-ROW($C$7)+1)),ROWS(F$5:F60))))","v":""},{"$f":"IF(ROWS(G$5:G60)>COUNTIF(Payments!$C$2:$C$100,$B$2),\"\",INDEX(Payments!F$2:F$100,SMALL(IF(Payments!$C$2:$C$100<>\"\",IF(Payments!$C$2:$C$100=$B$2,ROW($C$7:$C$105)-ROW($C$7)+1)),ROWS(G$5:G60))))","v":""}]
[null,{"$f":"IF(C61=\"\",\"\",MAX($B$4:B60)+1)","v":""},{"$f":"IF(ROWS(C$5:C61)>COUNTIF(Payments!$C$2:$C$100,$B$2),\"\",INDEX(Payments!B$2:B$100,SMALL(IF(Payments!$C$2:$C$100<>\"\",IF(Payments!$C$2:$C$100=$B$2,ROW($C$7:$C$105)-ROW($C$7)+1)),ROWS(C$5:C61))))","v":""},{"$f":"IF(ROWS(D$5:D61)>COUNTIF(Payments!$C$2:$C$100,$B$2),\"\",INDEX(Payments!C$2:C$100,SMALL(IF(Payments!$C$2:$C$100<>\"\",IF(Payments!$C$2:$C$100=$B$2,ROW($C$7:$C$105)-ROW($C$7)+1)),ROWS(D$5:D61))))","v":""},{"$f":"IF(ROWS(E$5:E61)>COUNTIF(Payments!$C$2:$C$100,$B$2),\"\",INDEX(Payments!D$2:D$100,SMALL(IF(Payments!$C$2:$C$100<>\"\",IF(Payments!$C$2:$C$100=$B$2,ROW($C$7:$C$105)-ROW($C$7)+1)),ROWS(E$5:E61))))","v":""},{"$f":"IF(ROWS(F$5:F61)>COUNTIF(Payments!$C$2:$C$100,$B$2),\"\",INDEX(Payments!E$2:E$100,SMALL(IF(Payments!$C$2:$C$100<>\"\",IF(Payments!$C$2:$C$100=$B$2,ROW($C$7:$C$105)-ROW($C$7)+1)),ROWS(F$5:F61))))","v":""},{"$f":"IF(ROWS(G$5:G61)>COUNTIF(Payments!$C$2:$C$100,$B$2),\"\",INDEX(Payments!F$2:F$100,SMALL(IF(Payments!$C$2:$C$100<>\"\",IF(Payments!$C$2:$C$100=$B$2,ROW($C$7:$C$105)-ROW($C$7)+1)),ROWS(G$5:G61))))","v":""}]
[null,{"$f":"IF(C62=\"\",\"\",MAX($B$4:B61)+1)","v":""},{"$f":"IF(ROWS(C$5:C62)>COUNTIF(Payments!$C$2:$C$100,$B$2),\"\",INDEX(Payments!B$2:B$100,SMALL(IF(Payments!$C$2:$C$100<>\"\",IF(Payments!$C$2:$C$100=$B$2,ROW($C$7:$C$105)-ROW($C$7)+1)),ROWS(C$5:C62))))","v":""},{"$f":"IF(ROWS(D$5:D62)>COUNTIF(Payments!$C$2:$C$100,$B$2),\"\",INDEX(Payments!C$2:C$100,SMALL(IF(Payments!$C$2:$C$100<>\"\",IF(Payments!$C$2:$C$100=$B$2,ROW($C$7:$C$105)-ROW($C$7)+1)),ROWS(D$5:D62))))","v":""},{"$f":"IF(ROWS(E$5:E62)>COUNTIF(Payments!$C$2:$C$100,$B$2),\"\",INDEX(Payments!D$2:D$100,SMALL(IF(Payments!$C$2:$C$100<>\"\",IF(Payments!$C$2:$C$100=$B$2,ROW($C$7:$C$105)-ROW($C$7)+1)),ROWS(E$5:E62))))","v":""},{"$f":"IF(ROWS(F$5:F62)>COUNTIF(Payments!$C$2:$C$100,$B$2),\"\",INDEX(Payments!E$2:E$100,SMALL(IF(Payments!$C$2:$C$100<>\"\",IF(Payments!$C$2:$C$100=$B$2,ROW($C$7:$C$105)-ROW($C$7)+1)),ROWS(F$5:F62))))","v":""},{"$f":"IF(ROWS(G$5:G62)>COUNTIF(Payments!$C$2:$C$100,$B$2),\"\",INDEX(Payments!F$2:F$100,SMALL(IF(Payments!$C$2:$C$100<>\"\",IF(Payments!$C$2:$C$100=$B$2,ROW($C$7:$C$105)-ROW($C$7)+1)),ROWS(G$5:G62))))","v":""}]
[null,{"$f":"IF(C63=\"\",\"\",MAX($B$4:B62)+1)","v":""},{"$f":"IF(ROWS(C$5:C63)>COUNTIF(Payments!$C$2:$C$100,$B$2),\"\",INDEX(Payments!B$2:B$100,SMALL(IF(Payments!$C$2:$C$100<>\"\",IF(Payments!$C$2:$C$100=$B$2,ROW($C$7:$C$105)-ROW($C$7)+1)),ROWS(C$5:C63))))","v":""},{"$f":"IF(ROWS(D$5:D63)>COUNTIF(Payments!$C$2:$C$100,$B$2),\"\",INDEX(Payments!C$2:C$100,SMALL(IF(Payments!$C$2:$C$100<>\"\",IF(Payments!$C$2:$C$100=$B$2,ROW($C$7:$C$105)-ROW($C$7)+1)),ROWS(D$5:D63))))","v":""},{"$f":"IF(ROWS(E$5:E63)>COUNTIF(Payments!$C$2:$C$100,$B$2),\"\",INDEX(Payments!D$2:D$100,SMALL(IF(Payments!$C$2:$C$100<>\"\",IF(Payments!$C$2:$C$100=$B$2,ROW($C$7:$C$105)-ROW($C$7)+1)),ROWS(E$5:E63))))","v":""},{"$f":"IF(ROWS(F$5:F63)>COUNTIF(Payments!$C$2:$C$100,$B$2),\"\",INDEX(Payments!E$2:E$100,SMALL(IF(Payments!$C$2:$C$100<>\"\",IF(Payments!$C$2:$C$100=$B$2,ROW($C$7:$C$105)-ROW($C$7)+1)),ROWS(F$5:F63))))","v":""},{"$f":"IF(ROWS(G$5:G63)>COUNTIF(Payments!$C$2:$C$100,$B$2),\"\",INDEX(Payments!F$2:F$100,SMALL(IF(Payments!$C$2:$C$100<>\"\",IF(Payments!$C$2:$C$100=$B$2,ROW($C$7:$C$105)-ROW($C$7)+1)),ROWS(G$5:G63))))","v":""}]
[null,{"$f":"IF(C64=\"\",\"\",MAX($B$4:B63)+1)","v":""},{"$f":"IF(ROWS(C$5:C64)>COUNTIF(Payments!$C$2:$C$100,$B$2),\"\",INDEX(Payments!B$2:B$100,SMALL(IF(Payments!$C$2:$C$100<>\"\",IF(Payments!$C$2:$C$100=$B$2,ROW($C$7:$C$105)-ROW($C$7)+1)),ROWS(C$5:C64))))","v":""},{"$f":"IF(ROWS(D$5:D64)>COUNTIF(Payments!$C$2:$C$100,$B$2),\"\",INDEX(Payments!C$2:C$100,SMALL(IF(Payments!$C$2:$C$100<>\"\",IF(Payments!$C$2:$C$100=$B$2,ROW($C$7:$C$105)-ROW($C$7)+1)),ROWS(D$5:D64))))","v":""},{"$f":"IF(ROWS(E$5:E64)>COUNTIF(Payments!$C$2:$C$100,$B$2),\"\",INDEX(Payments!D$2:D$100,SMALL(IF(Payments!$C$2:$C$100<>\"\",IF(Payments!$C$2:$C$100=$B$2,ROW($C$7:$C$105)-ROW($C$7)+1)),ROWS(E$5:E64))))","v":""},{"$f":"IF(ROWS(F$5:F64)>COUNTIF(Payments!$C$2:$C$100,$B$2),\"\",INDEX(Payments!E$2:E$100,SMALL(IF(Payments!$C$2:$C$100<>\"\",IF(Payments!$C$2:$C$100=$B$2,ROW($C$7:$C$105)-ROW($C$7)+1)),ROWS(F$5:F64))))","v":""},{"$f":"IF(ROWS(G$5:G64)>COUNTIF(Payments!$C$2:$C$100,$B$2),\"\",INDEX(Payments!F$2:F$100,SMALL(IF(Payments!$C$2:$C$100<>\"\",IF(Payments!$C$2:$C$100=$B$2,ROW($C$7:$C$105)-ROW($C$7)+1)),ROWS(G$5:G64))))","v":""}]
[null,{"$f":"IF(C65=\"\",\"\",MAX($B$4:B64)+1)","v":""},{"$f":"IF(ROWS(C$5:C65)>COUNTIF(Payments!$C$2:$C$100,$B$2),\"\",INDEX(Payments!B$2:B$100,SMALL(IF(Payments!$C$2:$C$100<>\"\",IF(Payments!$C$2:$C$100=$B$2,ROW($C$7:$C$105)-ROW($C$7)+1)),ROWS(C$5:C65))))","v":""},{"$f":"IF(ROWS(D$5:D65)>COUNTIF(Payments!$C$2:$C$100,$B$2),\"\",INDEX(Payments!C$2:C$100,SMALL(IF(Payments!$C$2:$C$100<>\"\",IF(Payments!$C$2:$C$100=$B$2,ROW($C$7:$C$105)-ROW($C$7)+1)),ROWS(D$5:D65))))","v":""},{"$f":"IF(ROWS(E$5:E65)>COUNTIF(Payments!$C$2:$C$100,$B$2),\"\",INDEX(Payments!D$2:D$100,SMALL(IF(Payments!$C$2:$C$100<>\"\",IF(Payments!$C$2:$C$100=$B$2,ROW($C$7:$C$105)-ROW($C$7)+1)),ROWS(E$5:E65))))","v":""},{"$f":"IF(ROWS(F$5:F65)>COUNTIF(Payments!$C$2:$C$100,$B$2),\"\",INDEX(Payments!E$2:E$100,SMALL(IF(Payments!$C$2:$C$100<>\"\",IF(Payments!$C$2:$C$100=$B$2,ROW($C$7:$C$105)-ROW($C$7)+1)),ROWS(F$5:F65))))","v":""},{"$f":"IF(ROWS(G$5:G65)>COUNTIF(Payments!$C$2:$C$100,$B$2),\"\",INDEX(Payments!F$2:F$100,SMALL(IF(Payments!$C$2:$C$100<>\"\",IF(Payments!$C$2:$C$100=$B$2,ROW($C$7:$C$105)-ROW($C$7)+1)),ROWS(G$5:G65))))","v":""}]
[null,{"$f":"IF(C66=\"\",\"\",MAX($B$4:B65)+1)","v":""},{"$f":"IF(ROWS(C$5:C66)>COUNTIF(Payments!$C$2:$C$100,$B$2),\"\",INDEX(Payments!B$2:B$100,SMALL(IF(Payments!$C$2:$C$100<>\"\",IF(Payments!$C$2:$C$100=$B$2,ROW($C$7:$C$105)-ROW($C$7)+1)),ROWS(C$5:C66))))","v":""},{"$f":"IF(ROWS(D$5:D66)>COUNTIF(Payments!$C$2:$C$100,$B$2),\"\",INDEX(Payments!C$2:C$100,SMALL(IF(Payments!$C$2:$C$100<>\"\",IF(Payments!$C$2:$C$100=$B$2,ROW($C$7:$C$105)-ROW($C$7)+1)),ROWS(D$5:D66))))","v":""},{"$f":"IF(ROWS(E$5:E66)>COUNTIF(Payments!$C$2:$C$100,$B$2),\"\",INDEX(Payments!D$2:D$100,SMALL(IF(Payments!$C$2:$C$100<>\"\",IF(Payments!$C$2:$C$100=$B$2,ROW($C$7:$C$105)-ROW($C$7)+1)),ROWS(E$5:E66))))","v":""},{"$f":"IF(ROWS(F$5:F66)>COUNTIF(Payments!$C$2:$C$100,$B$2),\"\",INDEX(Payments!E$2:E$100,SMALL(IF(Payments!$C$2:$C$100<>\"\",IF(Payments!$C$2:$C$100=$B$2,ROW($C$7:$C$105)-ROW($C$7)+1)),ROWS(F$5:F66))))","v":""},{"$f":"IF(ROWS(G$5:G66)>COUNTIF(Payments!$C$2:$C$100,$B$2),\"\",INDEX(Payments!F$2:F$100,SMALL(IF(Payments!$C$2:$C$100<>\"\",IF(Payments!$C$2:$C$100=$B$2,ROW($C$7:$C$105)-ROW($C$7)+1)),ROWS(G$5:G66))))","v":""}]
[null,{"$f":"IF(C67=\"\",\"\",MAX($B$4:B66)+1)","v":""},{"$f":"IF(ROWS(C$5:C67)>COUNTIF(Payments!$C$2:$C$100,$B$2),\"\",INDEX(Payments!B$2:B$100,SMALL(IF(Payments!$C$2:$C$100<>\"\",IF(Payments!$C$2:$C$100=$B$2,ROW($C$7:$C$105)-ROW($C$7)+1)),ROWS(C$5:C67))))","v":""},{"$f":"IF(ROWS(D$5:D67)>COUNTIF(Payments!$C$2:$C$100,$B$2),\"\",INDEX(Payments!C$2:C$100,SMALL(IF(Payments!$C$2:$C$100<>\"\",IF(Payments!$C$2:$C$100=$B$2,ROW($C$7:$C$105)-ROW($C$7)+1)),ROWS(D$5:D67))))","v":""},{"$f":"IF(ROWS(E$5:E67)>COUNTIF(Payments!$C$2:$C$100,$B$2),\"\",INDEX(Payments!D$2:D$100,SMALL(IF(Payments!$C$2:$C$100<>\"\",IF(Payments!$C$2:$C$100=$B$2,ROW($C$7:$C$105)-ROW($C$7)+1)),ROWS(E$5:E67))))","v":""},{"$f":"IF(ROWS(F$5:F67)>COUNTIF(Payments!$C$2:$C$100,$B$2),\"\",INDEX(Payments!E$2:E$100,SMALL(IF(Payments!$C$2:$C$100<>\"\",IF(Payments!$C$2:$C$100=$B$2,ROW($C$7:$C$105)-ROW($C$7)+1)),ROWS(F$5:F67))))","v":""},{"$f":"IF(ROWS(G$5:G67)>COUNTIF(Payments!$C$2:$C$100,$B$2),\"\",INDEX(Payments!F$2:F$100,SMALL(IF(Payments!$C$2:$C$100<>\"\",IF(Payments!$C$2:$C$100=$B$2,ROW($C$7:$C$105)-ROW($C$7)+1)),ROWS(G$5:G67))))","v":""}]
[]
[]
[null,null,null,null,null,null,null,null,{"$f":"SUM(I2:I69)","v":0}]

{"sheet":"مدرسه السلامه","index":2,"n_rows":70,"n_cols":10,"rows_kept":70,"cut":false,"hidden":false,"merged":[]}
[null,null,null,null,null,"Sum",null,"المستفيد","المبلغ","المشروع"]
[null,"مدرسه السلامه",null,null,null,{"$f":"SUM(F5:F67)","v":180000}]
[]
[null,"م","Date","الموقع","المستفيد","المبلغ","التفاصيل"]
[null,{"$f":"IF(C5=\"\",\"\",MAX($B$4:B4)+1)","v":1},{"$f":"IF(ROWS(C$5:C5)>COUNTIF(Payments!$C$2:$C$100,$B$2),\"\",INDEX(Payments!B$2:B$100,SMALL(IF(Payments!$C$2:$C$100<>\"\",IF(Payments!$C$2:$C$100=$B$2,ROW($C$7:$C$105)-ROW($C$7)+1)),ROWS(C$5:C5))))","v":"2020-12-13"},{"$f":"IF(ROWS(D$5:D5)>COUNTIF(Payments!$C$2:$C$100,$B$2),\"\",INDEX(Payments!C$2:C$100,SMALL(IF(Payments!$C$2:$C$100<>\"\",IF(Payments!$C$2:$C$100=$B$2,ROW($C$7:$C$105)-ROW($C$7)+1)),ROWS(D$5:D5))))","v":"مدرسه السلامه"},{"$f":"IF(ROWS(E$5:E5)>COUNTIF(Payments!$C$2:$C$100,$B$2),\"\",INDEX(Payments!D$2:D$100,SMALL(IF(Payments!$C$2:$C$100<>\"\",IF(Payments!$C$2:$C$100=$B$2,ROW($C$7:$C$105)-ROW($C$7)+1)),ROWS(E$5:E5))))","v":"محمد علي"},{"$f":"IF(ROWS(F$5:F5)>COUNTIF(Payments!$C$2:$C$100,$B$2),\"\",INDEX(Payments!E$2:E$100,SMALL(IF(Payments!$C$2:$C$100<>\"\",IF(Payments!$C$2:$C$100=$B$2,ROW($C$7:$C$105)-ROW($C$7)+1)),ROWS(F$5:F5))))","v":60000},{"$f":"IF(ROWS(G$5:G5)>COUNTIF(Payments!$C$2:$C$100,$B$2),\"\",INDEX(Payments!F$2:F$100,SMALL(IF(Payments!$C$2:$C$100<>\"\",IF(Payments!$C$2:$C$100=$B$2,ROW($C$7:$C$105)-ROW($C$7)+1)),ROWS(G$5:G5))))","v":"اناره الميدان"}]
[null,{"$f":"IF(C6=\"\",\"\",MAX($B$4:B5)+1)","v":2},{"$f":"IF(ROWS(C$5:C6)>COUNTIF(Payments!$C$2:$C$100,$B$2),\"\",INDEX(Payments!B$2:B$100,SMALL(IF(Payments!$C$2:$C$100<>\"\",IF(Payments!$C$2:$C$100=$B$2,ROW($C$7:$C$105)-ROW($C$7)+1)),ROWS(C$5:C6))))","v":"2020-12-13"},{"$f":"IF(ROWS(D$5:D6)>COUNTIF(Payments!$C$2:$C$100,$B$2),\"\",INDEX(Payments!C$2:C$100,SMALL(IF(Payments!$C$2:$C$100<>\"\",IF(Payments!$C$2:$C$100=$B$2,ROW($C$7:$C$105)-ROW($C$7)+1)),ROWS(D$5:D6))))","v":"مدرسه السلامه"},{"$f":"IF(ROWS(E$5:E6)>COUNTIF(Payments!$C$2:$C$100,$B$2),\"\",INDEX(Payments!D$2:D$100,SMALL(IF(Payments!$C$2:$C$100<>\"\",IF(Payments!$C$2:$C$100=$B$2,ROW($C$7:$C$105)-ROW($C$7)+1)),ROWS(E$5:E6))))","v":"محمد علي"},{"$f":"IF(ROWS(F$5:F6)>COUNTIF(Payments!$C$2:$C$100,$B$2),\"\",INDEX(Payments!E$2:E$100,SMALL(IF(Payments!$C$2:$C$100<>\"\",IF(Payments!$C$2:$C$100=$B$2,ROW($C$7:$C$105)-ROW($C$7)+1)),ROWS(F$5:F6))))","v":60000},{"$f":"IF(ROWS(G$5:G6)>COUNTIF(Payments!$C$2:$C$100,$B$2),\"\",INDEX(Payments!F$2:F$100,SMALL(IF(Payments!$C$2:$C$100<>\"\",IF(Payments!$C$2:$C$100=$B$2,ROW($C$7:$C$105)-ROW($C$7)+1)),ROWS(G$5:G6))))","v":"اناره الميدان"}]
[null,{"$f":"IF(C7=\"\",\"\",MAX($B$4:B6)+1)","v":3},{"$f":"IF(ROWS(C$5:C7)>COUNTIF(Payments!$C$2:$C$100,$B$2),\"\",INDEX(Payments!B$2:B$100,SMALL(IF(Payments!$C$2:$C$100<>\"\",IF(Payments!$C$2:$C$100=$B$2,ROW($C$7:$C$105)-ROW($C$7)+1)),ROWS(C$5:C7))))","v":"2020-12-13"},{"$f":"IF(ROWS(D$5:D7)>COUNTIF(Payments!$C$2:$C$100,$B$2),\"\",INDEX(Payments!C$2:C$100,SMALL(IF(Payments!$C$2:$C$100<>\"\",IF(Payments!$C$2:$C$100=$B$2,ROW($C$7:$C$105)-ROW($C$7)+1)),ROWS(D$5:D7))))","v":"مدرسه السلامه"},{"$f":"IF(ROWS(E$5:E7)>COUNTIF(Payments!$C$2:$C$100,$B$2),\"\",INDEX(Payments!D$2:D$100,SMALL(IF(Payments!$C$2:$C$100<>\"\",IF(Payments!$C$2:$C$100=$B$2,ROW($C$7:$C$105)-ROW($C$7)+1)),ROWS(E$5:E7))))","v":"Officena"},{"$f":"IF(ROWS(F$5:F7)>COUNTIF(Payments!$C$2:$C$100,$B$2),\"\",INDEX(Payments!E$2:E$100,SMALL(IF(Payments!$C$2:$C$100<>\"\",IF(Payments!$C$2:$C$100=$B$2,ROW($C$7:$C$105)-ROW($C$7)+1)),ROWS(F$5:F7))))","v":60000},{"$f":"IF(ROWS(G$5:G7)>COUNTIF(Payments!$C$2:$C$100,$B$2),\"\",INDEX(Payments!F$2:F$100,SMALL(IF(Payments!$C$2:$C$100<>\"\",IF(Payments!$C$2:$C$100=$B$2,ROW($C$7:$C$105)-ROW($C$7)+1)),ROWS(G$5:G7))))","v":"اناره الميدان"}]
[null,{"$f":"IF(C8=\"\",\"\",MAX($B$4:B7)+1)","v":""},{"$f":"IF(ROWS(C$5:C8)>COUNTIF(Payments!$C$2:$C$100,$B$2),\"\",INDEX(Payments!B$2:B$100,SMALL(IF(Payments!$C$2:$C$100<>\"\",IF(Payments!$C$2:$C$100=$B$2,ROW($C$7:$C$105)-ROW($C$7)+1)),ROWS(C$5:C8))))","v":""},{"$f":"IF(ROWS(D$5:D8)>COUNTIF(Payments!$C$2:$C$100,$B$2),\"\",INDEX(Payments!C$2:C$100,SMALL(IF(Payments!$C$2:$C$100<>\"\",IF(Payments!$C$2:$C$100=$B$2,ROW($C$7:$C$105)-ROW($C$7)+1)),ROWS(D$5:D8))))","v":""},{"$f":"IF(ROWS(E$5:E8)>COUNTIF(Payments!$C$2:$C$100,$B$2),\"\",INDEX(Payments!D$2:D$100,SMALL(IF(Payments!$C$2:$C$100<>\"\",IF(Payments!$C$2:$C$100=$B$2,ROW($C$7:$C$105)-ROW($C$7)+1)),ROWS(E$5:E8))))","v":""},{"$f":"IF(ROWS(F$5:F8)>COUNTIF(Payments!$C$2:$C$100,$B$2),\"\",INDEX(Payments!E$2:E$100,SMALL(IF(Payments!$C$2:$C$100<>\"\",IF(Payments!$C$2:$C$100=$B$2,ROW($C$7:$C$105)-ROW($C$7)+1)),ROWS(F$5:F8))))","v":""},{"$f":"IF(ROWS(G$5:G8)>COUNTIF(Payments!$C$2:$C$100,$B$2),\"\",INDEX(Payments!F$2:F$100,SMALL(IF(Payments!$C$2:$C$100<>\"\",IF(Payments!$C$2:$C$100=$B$2,ROW($C$7:$C$105)-ROW($C$7)+1)),ROWS(G$5:G8))))","v":""}]
[null,{"$f":"IF(C9=\"\",\"\",MAX($B$4:B8)+1)","v":""},{"$f":"IF(ROWS(C$5:C9)>COUNTIF(Payments!$C$2:$C$100,$B$2),\"\",INDEX(Payments!B$2:B$100,SMALL(IF(Payments!$C$2:$C$100<>\"\",IF(Payments!$C$2:$C$100=$B$2,ROW($C$7:$C$105)-ROW($C$7)+1)),ROWS(C$5:C9))))","v":""},{"$f":"IF(ROWS(D$5:D9)>COUNTIF(Payments!$C$2:$C$100,$B$2),\"\",INDEX(Payments!C$2:C$100,SMALL(IF(Payments!$C$2:$C$100<>\"\",IF(Payments!$C$2:$C$100=$B$2,ROW($C$7:$C$105)-ROW($C$7)+1)),ROWS(D$5:D9))))","v":""},{"$f":"IF(ROWS(E$5:E9)>COUNTIF(Payments!$C$2:$C$100,$B$2),\"\",INDEX(Payments!D$2:D$100,SMALL(IF(Payments!$C$2:$C$100<>\"\",IF(Payments!$C$2:$C$100=$B$2,ROW($C$7:$C$105)-ROW($C$7)+1)),ROWS(E$5:E9))))","v":""},{"$f":"IF(ROWS(F$5:F9)>COUNTIF(Payments!$C$2:$C$100,$B$2),\"\",INDEX(Payments!E$2:E$100,SMALL(IF(Payments!$C$2:$C$100<>\"\",IF(Payments!$C$2:$C$100=$B$2,ROW($C$7:$C$105)-ROW($C$7)+1)),ROWS(F$5:F9))))","v":""},{"$f":"IF(ROWS(G$5:G9)>COUNTIF(Payments!$C$2:$C$100,$B$2),\"\",INDEX(Payments!F$2:F$100,SMALL(IF(Payments!$C$2:$C$100<>\"\",IF(Payments!$C$2:$C$100=$B$2,ROW($C$7:$C$105)-ROW($C$7)+1)),ROWS(G$5:G9))))","v":""}]
[null,{"$f":"IF(C10=\"\",\"\",MAX($B$4:B9)+1)","v":""},{"$f":"IF(ROWS(C$5:C10)>COUNTIF(Payments!$C$2:$C$100,$B$2),\"\",INDEX(Payments!B$2:B$100,SMALL(IF(Payments!$C$2:$C$100<>\"\",IF(Payments!$C$2:$C$100=$B$2,ROW($C$7:$C$105)-ROW($C$7)+1)),ROWS(C$5:C10))))","v":""},{"$f":"IF(ROWS(D$5:D10)>COUNTIF(Payments!$C$2:$C$100,$B$2),\"\",INDEX(Payments!C$2:C$100,SMALL(IF(Payments!$C$2:$C$100<>\"\",IF(Payments!$C$2:$C$100=$B$2,ROW($C$7:$C$105)-ROW($C$7)+1)),ROWS(D$5:D10))))","v":""},{"$f":"IF(ROWS(E$5:E10)>COUNTIF(Payments!$C$2:$C$100,$B$2),\"\",INDEX(Payments!D$2:D$100,SMALL(IF(Payments!$C$2:$C$100<>\"\",IF(Payments!$C$2:$C$100=$B$2,ROW($C$7:$C$105)-ROW($C$7)+1)),ROWS(E$5:E10))))","v":""},{"$f":"IF(ROWS(F$5:F10)>COUNTIF(Payments!$C$2:$C$100,$B$2),\"\",INDEX(Payments!E$2:E$100,SMALL(IF(Payments!$C$2:$C$100<>\"\",IF(Payments!$C$2:$C$100=$B$2,ROW($C$7:$C$105)-ROW($C$7)+1)),ROWS(F$5:F10))))","v":""},{"$f":"IF(ROWS(G$5:G10)>COUNTIF(Payments!$C$2:$C$100,$B$2),\"\",INDEX(Payments!F$2:F$100,SMALL(IF(Payments!$C$2:$C$100<>\"\",IF(Payments!$C$2:$C$100=$B$2,ROW($C$7:$C$105)-ROW($C$7)+1)),ROWS(G$5:G10))))","v":""}]
[null,{"$f":"IF(C11=\"\",\"\",MAX($B$4:B10)+1)","v":""},{"$f":"IF(ROWS(C$5:C11)>COUNTIF(Payments!$C$2:$C$100,$B$2),\"\",INDEX(Payments!B$2:B$100,SMALL(IF(Payments!$C$2:$C$100<>\"\",IF(Payments!$C$2:$C$100=$B$2,ROW($C$7:$C$105)-ROW($C$7)+1)),ROWS(C$5:C11))))","v":""},{"$f":"IF(ROWS(D$5:D11)>COUNTIF(Payments!$C$2:$C$100,$B$2),\"\",INDEX(Payments!C$2:C$100,SMALL(IF(Payments!$C$2:$C$100<>\"\",IF(Payments!$C$2:$C$100=$B$2,ROW($C$7:$C$105)-ROW($C$7)+1)),ROWS(D$5:D11))))","v":""},{"$f":"IF(ROWS(E$5:E11)>COUNTIF(Payments!$C$2:$C$100,$B$2),\"\",INDEX(Payments!D$2:D$100,SMALL(IF(Payments!$C$2:$C$100<>\"\",IF(Payments!$C$2:$C$100=$B$2,ROW($C$7:$C$105)-ROW($C$7)+1)),ROWS(E$5:E11))))","v":""},{"$f":"IF(ROWS(F$5:F11)>COUNTIF(Payments!$C$2:$C$100,$B$2),\"\",INDEX(Payments!E$2:E$100,SMALL(IF(Payments!$C$2:$C$100<>\"\",IF(Payments!$C$2:$C$100=$B$2,ROW($C$7:$C$105)-ROW($C$7)+1)),ROWS(F$5:F11))))","v":""},{"$f":"IF(ROWS(G$5:G11)>COUNTIF(Payments!$C$2:$C$100,$B$2),\"\",INDEX(Payments!F$2:F$100,SMALL(IF(Payments!$C$2:$C$100<>\"\",IF(Payments!$C$2:$C$100=$B$2,ROW($C$7:$C$105)-ROW($C$7)+1)),ROWS(G$5:G11))))","v":""}]
[null,{"$f":"IF(C12=\"\",\"\",MAX($B$4:B11)+1)","v":""},{"$f":"IF(ROWS(C$5:C12)>COUNTIF(Payments!$C$2:$C$100,$B$2),\"\",INDEX(Payments!B$2:B$100,SMALL(IF(Payments!$C$2:$C$100<>\"\",IF(Payments!$C$2:$C$100=$B$2,ROW($C$7:$C$105)-ROW($C$7)+1)),ROWS(C$5:C12))))","v":""},{"$f":"IF(ROWS(D$5:D12)>COUNTIF(Payments!$C$2:$C$100,$B$2),\"\",INDEX(Payments!C$2:C$100,SMALL(IF(Payments!$C$2:$C$100<>\"\",IF(Payments!$C$2:$C$100=$B$2,ROW($C$7:$C$105)-ROW($C$7)+1)),ROWS(D$5:D12))))","v":""},{"$f":"IF(ROWS(E$5:E12)>COUNTIF(Payments!$C$2:$C$100,$B$2),\"\",INDEX(Payments!D$2:D$100,SMALL(IF(Payments!$C$2:$C$100<>\"\",IF(Payments!$C$2:$C$100=$B$2,ROW($C$7:$C$105)-ROW($C$7)+1)),ROWS(E$5:E12))))","v":""},{"$f":"IF(ROWS(F$5:F12)>COUNTIF(Payments!$C$2:$C$100,$B$2),\"\",INDEX(Payments!E$2:E$100,SMALL(IF(Payments!$C$2:$C$100<>\"\",IF(Payments!$C$2:$C$100=$B$2,ROW($C$7:$C$105)-ROW($C$7)+1)),ROWS(F$5:F12))))","v":""},{"$f":"IF(ROWS(G$5:G12)>COUNTIF(Payments!$C$2:$C$100,$B$2),\"\",INDEX(Payments!F$2:F$100,SMALL(IF(Payments!$C$2:$C$100<>\"\",IF(Payments!$C$2:$C$100=$B$2,ROW($C$7:$C$105)-ROW($C$7)+1)),ROWS(G$5:G12))))","v":""}]
[null,{"$f":"IF(C13=\"\",\"\",MAX($B$4:B12)+1)","v":""},{"$f":"IF(ROWS(C$5:C13)>COUNTIF(Payments!$C$2:$C$100,$B$2),\"\",INDEX(Payments!B$2:B$100,SMALL(IF(Payments!$C$2:$C$100<>\"\",IF(Payments!$C$2:$C$100=$B$2,ROW($C$7:$C$105)-ROW($C$7)+1)),ROWS(C$5:C13))))","v":""},{"$f":"IF(ROWS(D$5:D13)>COUNTIF(Payments!$C$2:$C$100,$B$2),\"\",INDEX(Payments!C$2:C$100,SMALL(IF(Payments!$C$2:$C$100<>\"\",IF(Payments!$C$2:$C$100=$B$2,ROW($C$7:$C$105)-ROW($C$7)+1)),ROWS(D$5:D13))))","v":""},{"$f":"IF(ROWS(E$5:E13)>COUNTIF(Payments!$C$2:$C$100,$B$2),\"\",INDEX(Payments!D$2:D$100,SMALL(IF(Payments!$C$2:$C$100<>\"\",IF(Payments!$C$2:$C$100=$B$2,ROW($C$7:$C$105)-ROW($C$7)+1)),ROWS(E$5:E13))))","v":""},{"$f":"IF(ROWS(F$5:F13)>COUNTIF(Payments!$C$2:$C$100,$B$2),\"\",INDEX(Payments!E$2:E$100,SMALL(IF(Payments!$C$2:$C$100<>\"\",IF(Payments!$C$2:$C$100=$B$2,ROW($C$7:$C$105)-ROW($C$7)+1)),ROWS(F$5:F13))))","v":""},{"$f":"IF(ROWS(G$5:G13)>COUNTIF(Payments!$C$2:$C$100,$B$2),\"\",INDEX(Payments!F$2:F$100,SMALL(IF(Payments!$C$2:$C$100<>\"\",IF(Payments!$C$2:$C$100=$B$2,ROW($C$7:$C$105)-ROW($C$7)+1)),ROWS(G$5:G13))))","v":""}]
[null,{"$f":"IF(C14=\"\",\"\",MAX($B$4:B13)+1)","v":""},{"$f":"IF(ROWS(C$5:C14)>COUNTIF(Payments!$C$2:$C$100,$B$2),\"\",INDEX(Payments!B$2:B$100,SMALL(IF(Payments!$C$2:$C$100<>\"\",IF(Payments!$C$2:$C$100=$B$2,ROW($C$7:$C$105)-ROW($C$7)+1)),ROWS(C$5:C14))))","v":""},{"$f":"IF(ROWS(D$5:D14)>COUNTIF(Payments!$C$2:$C$100,$B$2),\"\",INDEX(Payments!C$2:C$100,SMALL(IF(Payments!$C$2:$C$100<>\"\",IF(Payments!$C$2:$C$100=$B$2,ROW($C$7:$C$105)-ROW($C$7)+1)),ROWS(D$5:D14))))","v":""},{"$f":"IF(ROWS(E$5:E14)>COUNTIF(Payments!$C$2:$C$100,$B$2),\"\",INDEX(Payments!D$2:D$100,SMALL(IF(Payments!$C$2:$C$100<>\"\",IF(Payments!$C$2:$C$100=$B$2,ROW($C$7:$C$105)-ROW($C$7)+1)),ROWS(E$5:E14))))","v":""},{"$f":"IF(ROWS(F$5:F14)>COUNTIF(Payments!$C$2:$C$100,$B$2),\"\",INDEX(Payments!E$2:E$100,SMALL(IF(Payments!$C$2:$C$100<>\"\",IF(Payments!$C$2:$C$100=$B$2,ROW($C$7:$C$105)-ROW($C$7)+1)),ROWS(F$5:F14))))","v":""},{"$f":"IF(ROWS(G$5:G14)>COUNTIF(Payments!$C$2:$C$100,$B$2),\"\",INDEX(Payments!F$2:F$100,SMALL(IF(Payments!$C$2:$C$100<>\"\",IF(Payments!$C$2:$C$100=$B$2,ROW($C$7:$C$105)-ROW($C$7)+1)),ROWS(G$5:G14))))","v":""}]
[null,{"$f":"IF(C15=\"\",\"\",MAX($B$4:B14)+1)","v":""},{"$f":"IF(ROWS(C$5:C15)>COUNTIF(Payments!$C$2:$C$100,$B$2),\"\",INDEX(Payments!B$2:B$100,SMALL(IF(Payments!$C$2:$C$100<>\"\",IF(Payments!$C$2:$C$100=$B$2,ROW($C$7:$C$105)-ROW($C$7)+1)),ROWS(C$5:C15))))","v":""},{"$f":"IF(ROWS(D$5:D15)>COUNTIF(Payments!$C$2:$C$100,$B$2),\"\",INDEX(Payments!C$2:C$100,SMALL(IF(Payments!$C$2:$C$100<>\"\",IF(Payments!$C$2:$C$100=$B$2,ROW($C$7:$C$105)-ROW($C$7)+1)),ROWS(D$5:D15))))","v":""},{"$f":"IF(ROWS(E$5:E15)>COUNTIF(Payments!$C$2:$C$100,$B$2),\"\",INDEX(Payments!D$2:D$100,SMALL(IF(Payments!$C$2:$C$100<>\"\",IF(Payments!$C$2:$C$100=$B$2,ROW($C$7:$C$105)-ROW($C$7)+1)),ROWS(E$5:E15))))","v":""},{"$f":"IF(ROWS(F$5:F15)>COUNTIF(Payments!$C$2:$C$100,$B$2),\"\",INDEX(Payments!E$2:E$100,SMALL(IF(Payments!$C$2:$C$100<>\"\",IF(Payments!$C$2:$C$100=$B$2,ROW($C$7:$C$105)-ROW($C$7)+1)),ROWS(F$5:F15))))","v":""},{"$f":"IF(ROWS(G$5:G15)>COUNTIF(Payments!$C$2:$C$100,$B$2),\"\",INDEX(Payments!F$2:F$100,SMALL(IF(Payments!$C$2:$C$100<>\"\",IF(Payments!$C$2:$C$100=$B$2,ROW($C$7:$C$105)-ROW($C$7)+1)),ROWS(G$5:G15))))","v":""}]
[null,{"$f":"IF(C16=\"\",\"\",MAX($B$4:B15)+1)","v":""},{"$f":"IF(ROWS(C$5:C16)>COUNTIF(Payments!$C$2:$C$100,$B$2),\"\",INDEX(Payments!B$2:B$100,SMALL(IF(Payments!$C$2:$C$100<>\"\",IF(Payments!$C$2:$C$100=$B$2,ROW($C$7:$C$105)-ROW($C$7)+1)),ROWS(C$5:C16))))","v":""},{"$f":"IF(ROWS(D$5:D16)>COUNTIF(Payments!$C$2:$C$100,$B$2),\"\",INDEX(Payments!C$2:C$100,SMALL(IF(Payments!$C$2:$C$100<>\"\",IF(Payments!$C$2:$C$100=$B$2,ROW($C$7:$C$105)-ROW($C$7)+1)),ROWS(D$5:D16))))","v":""},{"$f":"IF(ROWS(E$5:E16)>COUNTIF(Payments!$C$2:$C$100,$B$2),\"\",INDEX(Payments!D$2:D$100,SMALL(IF(Payments!$C$2:$C$100<>\"\",IF(Payments!$C$2:$C$100=$B$2,ROW($C$7:$C$105)-ROW($C$7)+1)),ROWS(E$5:E16))))","v":""},{"$f":"IF(ROWS(F$5:F16)>COUNTIF(Payments!$C$2:$C$100,$B$2),\"\",INDEX(Payments!E$2:E$100,SMALL(IF(Payments!$C$2:$C$100<>\"\",IF(Payments!$C$2:$C$100=$B$2,ROW($C$7:$C$105)-ROW($C$7)+1)),ROWS(F$5:F16))))","v":""},{"$f":"IF(ROWS(G$5:G16)>COUNTIF(Payments!$C$2:$C$100,$B$2),\"\",INDEX(Payments!F$2:F$100,SMALL(IF(Payments!$C$2:$C$100<>\"\",IF(Payments!$C$2:$C$100=$B$2,ROW($C$7:$C$105)-ROW($C$7)+1)),ROWS(G$5:G16))))","v":""}]
[null,{"$f":"IF(C17=\"\",\"\",MAX($B$4:B16)+1)","v":""},{"$f":"IF(ROWS(C$5:C17)>COUNTIF(Payments!$C$2:$C$100,$B$2),\"\",INDEX(Payments!B$2:B$100,SMALL(IF(Payments!$C$2:$C$100<>\"\",IF(Payments!$C$2:$C$100=$B$2,ROW($C$7:$C$105)-ROW($C$7)+1)),ROWS(C$5:C17))))","v":""},{"$f":"IF(ROWS(D$5:D17)>COUNTIF(Payments!$C$2:$C$100,$B$2),\"\",INDEX(Payments!C$2:C$100,SMALL(IF(Payments!$C$2:$C$100<>\"\",IF(Payments!$C$2:$C$100=$B$2,ROW($C$7:$C$105)-ROW($C$7)+1)),ROWS(D$5:D17))))","v":""},{"$f":"IF(ROWS(E$5:E17)>COUNTIF(Payments!$C$2:$C$100,$B$2),\"\",INDEX(Payments!D$2:D$100,SMALL(IF(Payments!$C$2:$C$100<>\"\",IF(Payments!$C$2:$C$100=$B$2,ROW($C$7:$C$105)-ROW($C$7)+1)),ROWS(E$5:E17))))","v":""},{"$f":"IF(ROWS(F$5:F17)>COUNTIF(Payments!$C$2:$C$100,$B$2),\"\",INDEX(Payments!E$2:E$100,SMALL(IF(Payments!$C$2:$C$100<>\"\",IF(Payments!$C$2:$C$100=$B$2,ROW($C$7:$C$105)-ROW($C$7)+1)),ROWS(F$5:F17))))","v":""},{"$f":"IF(ROWS(G$5:G17)>COUNTIF(Payments!$C$2:$C$100,$B$2),\"\",INDEX(Payments!F$2:F$100,SMALL(IF(Payments!$C$2:$C$100<>\"\",IF(Payments!$C$2:$C$100=$B$2,ROW($C$7:$C$105)-ROW($C$7)+1)),ROWS(G$5:G17))))","v":""}]
[null,{"$f":"IF(C18=\"\",\"\",MAX($B$4:B17)+1)","v":""},{"$f":"IF(ROWS(C$5:C18)>COUNTIF(Payments!$C$2:$C$100,$B$2),\"\",INDEX(Payments!B$2:B$100,SMALL(IF(Payments!$C$2:$C$100<>\"\",IF(Payments!$C$2:$C$100=$B$2,ROW($C$7:$C$105)-ROW($C$7)+1)),ROWS(C$5:C18))))","v":""},{"$f":"IF(ROWS(D$5:D18)>COUNTIF(Payments!$C$2:$C$100,$B$2),\"\",INDEX(Payments!C$2:C$100,SMALL(IF(Payments!$C$2:$C$100<>\"\",IF(Payments!$C$2:$C$100=$B$2,ROW($C$7:$C$105)-ROW($C$7)+1)),ROWS(D$5:D18))))","v":""},{"$f":"IF(ROWS(E$5:E18)>COUNTIF(Payments!$C$2:$C$100,$B$2),\"\",INDEX(Payments!D$2:D$100,SMALL(IF(Payments!$C$2:$C$100<>\"\",IF(Payments!$C$2:$C$100=$B$2,ROW($C$7:$C$105)-ROW($C$7)+1)),ROWS(E$5:E18))))","v":""},{"$f":"IF(ROWS(F$5:F18)>COUNTIF(Payments!$C$2:$C$100,$B$2),\"\",INDEX(Payments!E$2:E$100,SMALL(IF(Payments!$C$2:$C$100<>\"\",IF(Payments!$C$2:$C$100=$B$2,ROW($C$7:$C$105)-ROW($C$7)+1)),ROWS(F$5:F18))))","v":""},{"$f":"IF(ROWS(G$5:G18)>COUNTIF(Payments!$C$2:$C$100,$B$2),\"\",INDEX(Payments!F$2:F$100,SMALL(IF(Payments!$C$2:$C$100<>\"\",IF(Payments!$C$2:$C$100=$B$2,ROW($C$7:$C$105)-ROW($C$7)+1)),ROWS(G$5:G18))))","v":""}]
[null,{"$f":"IF(C19=\"\",\"\",MAX($B$4:B18)+1)","v":""},{"$f":"IF(ROWS(C$5:C19)>COUNTIF(Payments!$C$2:$C$100,$B$2),\"\",INDEX(Payments!B$2:B$100,SMALL(IF(Payments!$C$2:$C$100<>\"\",IF(Payments!$C$2:$C$100=$B$2,ROW($C$7:$C$105)-ROW($C$7)+1)),ROWS(C$5:C19))))","v":""},{"$f":"IF(ROWS(D$5:D19)>COUNTIF(Payments!$C$2:$C$100,$B$2),\"\",INDEX(Payments!C$2:C$100,SMALL(IF(Payments!$C$2:$C$100<>\"\",IF(Payments!$C$2:$C$100=$B$2,ROW($C$7:$C$105)-ROW($C$7)+1)),ROWS(D$5:D19))))","v":""},{"$f":"IF(ROWS(E$5:E19)>COUNTIF(Payments!$C$2:$C$100,$B$2),\"\",INDEX(Payments!D$2:D$100,SMALL(IF(Payments!$C$2:$C$100<>\"\",IF(Payments!$C$2:$C$100=$B$2,ROW($C$7:$C$105)-ROW($C$7)+1)),ROWS(E$5:E19))))","v":""},{"$f":"IF(ROWS(F$5:F19)>COUNTIF(Payments!$C$2:$C$100,$B$2),\"\",INDEX(Payments!E$2:E$100,SMALL(IF(Payments!$C$2:$C$100<>\"\",IF(Payments!$C$2:$C$100=$B$2,ROW($C$7:$C$105)-ROW($C$7)+1)),ROWS(F$5:F19))))","v":""},{"$f":"IF(ROWS(G$5:G19)>COUNTIF(Payments!$C$2:$C$100,$B$2),\"\",INDEX(Payments!F$2:F$100,SMALL(IF(Payments!$C$2:$C$100<>\"\",IF(Payments!$C$2:$C$100=$B$2,ROW($C$7:$C$105)-ROW($C$7)+1)),ROWS(G$5:G19))))","v":""}]
[null,{"$f":"IF(C20=\"\",\"\",MAX($B$4:B19)+1)","v":""},{"$f":"IF(ROWS(C$5:C20)>COUNTIF(Payments!$C$2:$C$100,$B$2),\"\",INDEX(Payments!B$2:B$100,SMALL(IF(Payments!$C$2:$C$100<>\"\",IF(Payments!$C$2:$C$100=$B$2,ROW($C$7:$C$105)-ROW($C$7)+1)),ROWS(C$5:C20))))","v":""},{"$f":"IF(ROWS(D$5:D20)>COUNTIF(Payments!$C$2:$C$100,$B$2),\"\",INDEX(Payments!C$2:C$100,SMALL(IF(Payments!$C$2:$C$100<>\"\",IF(Payments!$C$2:$C$100=$B$2,ROW($C$7:$C$105)-ROW($C$7)+1)),ROWS(D$5:D20))))","v":""},{"$f":"IF(ROWS(E$5:E20)>COUNTIF(Payments!$C$2:$C$100,$B$2),\"\",INDEX(Payments!D$2:D$100,SMALL(IF(Payments!$C$2:$C$100<>\"\",IF(Payments!$C$2:$C$100=$B$2,ROW($C$7:$C$105)-ROW($C$7)+1)),ROWS(E$5:E20))))","v":""},{"$f":"IF(ROWS(F$5:F20)>COUNTIF(Payments!$C$2:$C$100,$B$2),\"\",INDEX(Payments!E$2:E$100,SMALL(IF(Payments!$C$2:$C$100<>\"\",IF(Payments!$C$2:$C$100=$B$2,ROW($C$7:$C$105)-ROW($C$7)+1)),ROWS(F$5:F20))))","v":""},{"$f":"IF(ROWS(G$5:G20)>COUNTIF(Payments!$C$2:$C$100,$B$2),\"\",INDEX(Payments!F$2:F$100,SMALL(IF(Payments!$C$2:$C$100<>\"\",IF(Payments!$C$2:$C$100=$B$2,ROW($C$7:$C$105)-ROW($C$7)+1)),ROWS(G$5:G20))))","v":""}]
[null,{"$f":"IF(C21=\"\",\"\",MAX($B$4:B20)+1)","v":""},{"$f":"IF(ROWS(C$5:C21)>COUNTIF(Payments!$C$2:$C$100,$B$2),\"\",INDEX(Payments!B$2:B$100,SMALL(IF(Payments!$C$2:$C$100<>\"\",IF(Payments!$C$2:$C$100=$B$2,ROW($C$7:$C$105)-ROW($C$7)+1)),ROWS(C$5:C21))))","v":""},{"$f":"IF(ROWS(D$5:D21)>COUNTIF(Payments!$C$2:$C$100,$B$2),\"\",INDEX(Payments!C$2:C$100,SMALL(IF(Payments!$C$2:$C$100<>\"\",IF(Payments!$C$2:$C$100=$B$2,ROW($C$7:$C$105)-ROW($C$7)+1)),ROWS(D$5:D21))))","v":""},{"$f":"IF(ROWS(E$5:E21)>COUNTIF(Payments!$C$2:$C$100,$B$2),\"\",INDEX(Payments!D$2:D$100,SMALL(IF(Payments!$C$2:$C$100<>\"\",IF(Payments!$C$2:$C$100=$B$2,ROW($C$7:$C$105)-ROW($C$7)+1)),ROWS(E$5:E21))))","v":""},{"$f":"IF(ROWS(F$5:F21)>COUNTIF(Payments!$C$2:$C$100,$B$2),\"\",INDEX(Payments!E$2:E$100,SMALL(IF(Payments!$C$2:$C$100<>\"\",IF(Payments!$C$2:$C$100=$B$2,ROW($C$7:$C$105)-ROW($C$7)+1)),ROWS(F$5:F21))))","v":""},{"$f":"IF(ROWS(G$5:G21)>COUNTIF(Payments!$C$2:$C$100,$B$2),\"\",INDEX(Payments!F$2:F$100,SMALL(IF(Payments!$C$2:$C$100<>\"\",IF(Payments!$C$2:$C$100=$B$2,ROW($C$7:$C$105)-ROW($C$7)+1)),ROWS(G$5:G21))))","v":""}]
[null,{"$f":"IF(C22=\"\",\"\",MAX($B$4:B21)+1)","v":""},{"$f":"IF(ROWS(C$5:C22)>COUNTIF(Payments!$C$2:$C$100,$B$2),\"\",INDEX(Payments!B$2:B$100,SMALL(IF(Payments!$C$2:$C$100<>\"\",IF(Payments!$C$2:$C$100=$B$2,ROW($C$7:$C$105)-ROW($C$7)+1)),ROWS(C$5:C22))))","v":""},{"$f":"IF(ROWS(D$5:D22)>COUNTIF(Payments!$C$2:$C$100,$B$2),\"\",INDEX(Payments!C$2:C$100,SMALL(IF(Payments!$C$2:$C$100<>\"\",IF(Payments!$C$2:$C$100=$B$2,ROW($C$7:$C$105)-ROW($C$7)+1)),ROWS(D$5:D22))))","v":""},{"$f":"IF(ROWS(E$5:E22)>COUNTIF(Payments!$C$2:$C$100,$B$2),\"\",INDEX(Payments!D$2:D$100,SMALL(IF(Payments!$C$2:$C$100<>\"\",IF(Payments!$C$2:$C$100=$B$2,ROW($C$7:$C$105)-ROW($C$7)+1)),ROWS(E$5:E22))))","v":""},{"$f":"IF(ROWS(F$5:F22)>COUNTIF(Payments!$C$2:$C$100,$B$2),\"\",INDEX(Payments!E$2:E$100,SMALL(IF(Payments!$C$2:$C$100<>\"\",IF(Payments!$C$2:$C$100=$B$2,ROW($C$7:$C$105)-ROW($C$7)+1)),ROWS(F$5:F22))))","v":""},{"$f":"IF(ROWS(G$5:G22)>COUNTIF(Payments!$C$2:$C$100,$B$2),\"\",INDEX(Payments!F$2:F$100,SMALL(IF(Payments!$C$2:$C$100<>\"\",IF(Payments!$C$2:$C$100=$B$2,ROW($C$7:$C$105)-ROW($C$7)+1)),ROWS(G$5:G22))))","v":""}]
[null,{"$f":"IF(C23=\"\",\"\",MAX($B$4:B22)+1)","v":""},{"$f":"IF(ROWS(C$5:C23)>COUNTIF(Payments!$C$2:$C$100,$B$2),\"\",INDEX(Payments!B$2:B$100,SMALL(IF(Payments!$C$2:$C$100<>\"\",IF(Payments!$C$2:$C$100=$B$2,ROW($C$7:$C$105)-ROW($C$7)+1)),ROWS(C$5:C23))))","v":""},{"$f":"IF(ROWS(D$5:D23)>COUNTIF(Payments!$C$2:$C$100,$B$2),\"\",INDEX(Payments!C$2:C$100,SMALL(IF(Payments!$C$2:$C$100<>\"\",IF(Payments!$C$2:$C$100=$B$2,ROW($C$7:$C$105)-ROW($C$7)+1)),ROWS(D$5:D23))))","v":""},{"$f":"IF(ROWS(E$5:E23)>COUNTIF(Payments!$C$2:$C$100,$B$2),\"\",INDEX(Payments!D$2:D$100,SMALL(IF(Payments!$C$2:$C$100<>\"\",IF(Payments!$C$2:$C$100=$B$2,ROW($C$7:$C$105)-ROW($C$7)+1)),ROWS(E$5:E23))))","v":""},{"$f":"IF(ROWS(F$5:F23)>COUNTIF(Payments!$C$2:$C$100,$B$2),\"\",INDEX(Payments!E$2:E$100,SMALL(IF(Payments!$C$2:$C$100<>\"\",IF(Payments!$C$2:$C$100=$B$2,ROW($C$7:$C$105)-ROW($C$7)+1)),ROWS(F$5:F23))))","v":""},{"$f":"IF(ROWS(G$5:G23)>COUNTIF(Payments!$C$2:$C$100,$B$2),\"\",INDEX(Payments!F$2:F$100,SMALL(IF(Payments!$C$2:$C$100<>\"\",IF(Payments!$C$2:$C$100=$B$2,ROW($C$7:$C$105)-ROW($C$7)+1)),ROWS(G$5:G23))))","v":""}]
[null,{"$f":"IF(C24=\"\",\"\",MAX($B$4:B23)+1)","v":""},{"$f":"IF(ROWS(C$5:C24)>COUNTIF(Payments!$C$2:$C$100,$B$2),\"\",INDEX(Payments!B$2:B$100,SMALL(IF(Payments!$C$2:$C$100<>\"\",IF(Payments!$C$2:$C$100=$B$2,ROW($C$7:$C$105)-ROW($C$7)+1)),ROWS(C$5:C24))))","v":""},{"$f":"IF(ROWS(D$5:D24)>COUNTIF(Payments!$C$2:$C$100,$B$2),\"\",INDEX(Payments!C$2:C$100,SMALL(IF(Payments!$C$2:$C$100<>\"\",IF(Payments!$C$2:$C$100=$B$2,ROW($C$7:$C$105)-ROW($C$7)+1)),ROWS(D$5:D24))))","v":""},{"$f":"IF(ROWS(E$5:E24)>COUNTIF(Payments!$C$2:$C$100,$B$2),\"\",INDEX(Payments!D$2:D$100,SMALL(IF(Payments!$C$2:$C$100<>\"\",IF(Payments!$C$2:$C$100=$B$2,ROW($C$7:$C$105)-ROW($C$7)+1)),ROWS(E$5:E24))))","v":""},{"$f":"IF(ROWS(F$5:F24)>COUNTIF(Payments!$C$2:$C$100,$B$2),\"\",INDEX(Payments!E$2:E$100,SMALL(IF(Payments!$C$2:$C$100<>\"\",IF(Payments!$C$2:$C$100=$B$2,ROW($C$7:$C$105)-ROW($C$7)+1)),ROWS(F$5:F24))))","v":""},{"$f":"IF(ROWS(G$5:G24)>COUNTIF(Payments!$C$2:$C$100,$B$2),\"\",INDEX(Payments!F$2:F$100,SMALL(IF(Payments!$C$2:$C$100<>\"\",IF(Payments!$C$2:$C$100=$B$2,ROW($C$7:$C$105)-ROW($C$7)+1)),ROWS(G$5:G24))))","v":""}]
[null,{"$f":"IF(C25=\"\",\"\",MAX($B$4:B24)+1)","v":""},{"$f":"IF(ROWS(C$5:C25)>COUNTIF(Payments!$C$2:$C$100,$B$2),\"\",INDEX(Payments!B$2:B$100,SMALL(IF(Payments!$C$2:$C$100<>\"\",IF(Payments!$C$2:$C$100=$B$2,ROW($C$7:$C$105)-ROW($C$7)+1)),ROWS(C$5:C25))))","v":""},{"$f":"IF(ROWS(D$5:D25)>COUNTIF(Payments!$C$2:$C$100,$B$2),\"\",INDEX(Payments!C$2:C$100,SMALL(IF(Payments!$C$2:$C$100<>\"\",IF(Payments!$C$2:$C$100=$B$2,ROW($C$7:$C$105)-ROW($C$7)+1)),ROWS(D$5:D25))))","v":""},{"$f":"IF(ROWS(E$5:E25)>COUNTIF(Payments!$C$2:$C$100,$B$2),\"\",INDEX(Payments!D$2:D$100,SMALL(IF(Payments!$C$2:$C$100<>\"\",IF(Payments!$C$2:$C$100=$B$2,ROW($C$7:$C$105)-ROW($C$7)+1)),ROWS(E$5:E25))))","v":""},{"$f":"IF(ROWS(F$5:F25)>COUNTIF(Payments!$C$2:$C$100,$B$2),\"\",INDEX(Payments!E$2:E$100,SMALL(IF(Payments!$C$2:$C$100<>\"\",IF(Payments!$C$2:$C$100=$B$2,ROW($C$7:$C$105)-ROW($C$7)+1)),ROWS(F$5:F25))))","v":""},{"$f":"IF(ROWS(G$5:G25)>COUNTIF(Payments!$C$2:$C$100,$B$2),\"\",INDEX(Payments!F$2:F$100,SMALL(IF(Payments!$C$2:$C$100<>\"\",IF(Payments!$C$2:$C$100=$B$2,ROW($C$7:$C$105)-ROW($C$7)+1)),ROWS(G$5:G25))))","v":""}]
[null,{"$f":"IF(C26=\"\",\"\",MAX($B$4:B25)+1)","v":""},{"$f":"IF(ROWS(C$5:C26)>COUNTIF(Payments!$C$2:$C$100,$B$2),\"\",INDEX(Payments!B$2:B$100,SMALL(IF(Payments!$C$2:$C$100<>\"\",IF(Payments!$C$2:$C$100=$B$2,ROW($C$7:$C$105)-ROW($C$7)+1)),ROWS(C$5:C26))))","v":""},{"$f":"IF(ROWS(D$5:D26)>COUNTIF(Payments!$C$2:$C$100,$B$2),\"\",INDEX(Payments!C$2:C$100,SMALL(IF(Payments!$C$2:$C$100<>\"\",IF(Payments!$C$2:$C$100=$B$2,ROW($C$7:$C$105)-ROW($C$7)+1)),ROWS(D$5:D26))))","v":""},{"$f":"IF(ROWS(E$5:E26)>COUNTIF(Payments!$C$2:$C$100,$B$2),\"\",INDEX(Payments!D$2:D$100,SMALL(IF(Payments!$C$2:$C$100<>\"\",IF(Payments!$C$2:$C$100=$B$2,ROW($C$7:$C$105)-ROW($C$7)+1)),ROWS(E$5:E26))))","v":""},{"$f":"IF(ROWS(F$5:F26)>COUNTIF(Payments!$C$2:$C$100,$B$2),\"\",INDEX(Payments!E$2:E$100,SMALL(IF(Payments!$C$2:$C$100<>\"\",IF(Payments!$C$2:$C$100=$B$2,ROW($C$7:$C$105)-ROW($C$7)+1)),ROWS(F$5:F26))))","v":""},{"$f":"IF(ROWS(G$5:G26)>COUNTIF(Payments!$C$2:$C$100,$B$2),\"\",INDEX(Payments!F$2:F$100,SMALL(IF(Payments!$C$2:$C$100<>\"\",IF(Payments!$C$2:$C$100=$B$2,ROW($C$7:$C$105)-ROW($C$7)+1)),ROWS(G$5:G26))))","v":""}]
[null,{"$f":"IF(C27=\"\",\"\",MAX($B$4:B26)+1)","v":""},{"$f":"IF(ROWS(C$5:C27)>COUNTIF(Payments!$C$2:$C$100,$B$2),\"\",INDEX(Payments!B$2:B$100,SMALL(IF(Payments!$C$2:$C$100<>\"\",IF(Payments!$C$2:$C$100=$B$2,ROW($C$7:$C$105)-ROW($C$7)+1)),ROWS(C$5:C27))))","v":""},{"$f":"IF(ROWS(D$5:D27)>COUNTIF(Payments!$C$2:$C$100,$B$2),\"\",INDEX(Payments!C$2:C$100,SMALL(IF(Payments!$C$2:$C$100<>\"\",IF(Payments!$C$2:$C$100=$B$2,ROW($C$7:$C$105)-ROW($C$7)+1)),ROWS(D$5:D27))))","v":""},{"$f":"IF(ROWS(E$5:E27)>COUNTIF(Payments!$C$2:$C$100,$B$2),\"\",INDEX(Payments!D$2:D$100,SMALL(IF(Payments!$C$2:$C$100<>\"\",IF(Payments!$C$2:$C$100=$B$2,ROW($C$7:$C$105)-ROW($C$7)+1)),ROWS(E$5:E27))))","v":""},{"$f":"IF(ROWS(F$5:F27)>COUNTIF(Payments!$C$2:$C$100,$B$2),\"\",INDEX(Payments!E$2:E$100,SMALL(IF(Payments!$C$2:$C$100<>\"\",IF(Payments!$C$2:$C$100=$B$2,ROW($C$7:$C$105)-ROW($C$7)+1)),ROWS(F$5:F27))))","v":""},{"$f":"IF(ROWS(G$5:G27)>COUNTIF(Payments!$C$2:$C$100,$B$2),\"\",INDEX(Payments!F$2:F$100,SMALL(IF(Payments!$C$2:$C$100<>\"\",IF(Payments!$C$2:$C$100=$B$2,ROW($C$7:$C$105)-ROW($C$7)+1)),ROWS(G$5:G27))))","v":""}]
[null,{"$f":"IF(C28=\"\",\"\",MAX($B$4:B27)+1)","v":""},{"$f":"IF(ROWS(C$5:C28)>COUNTIF(Payments!$C$2:$C$100,$B$2),\"\",INDEX(Payments!B$2:B$100,SMALL(IF(Payments!$C$2:$C$100<>\"\",IF(Payments!$C$2:$C$100=$B$2,ROW($C$7:$C$105)-ROW($C$7)+1)),ROWS(C$5:C28))))","v":""},{"$f":"IF(ROWS(D$5:D28)>COUNTIF(Payments!$C$2:$C$100,$B$2),\"\",INDEX(Payments!C$2:C$100,SMALL(IF(Payments!$C$2:$C$100<>\"\",IF(Payments!$C$2:$C$100=$B$2,ROW($C$7:$C$105)-ROW($C$7)+1)),ROWS(D$5:D28))))","v":""},{"$f":"IF(ROWS(E$5:E28)>COUNTIF(Payments!$C$2:$C$100,$B$2),\"\",INDEX(Payments!D$2:D$100,SMALL(IF(Payments!$C$2:$C$100<>\"\",IF(Payments!$C$2:$C$100=$B$2,ROW($C$7:$C$105)-ROW($C$7)+1)),ROWS(E$5:E28))))","v":""},{"$f":"IF(ROWS(F$5:F28)>COUNTIF(Payments!$C$2:$C$100,$B$2),\"\",INDEX(Payments!E$2:E$100,SMALL(IF(Payments!$C$2:$C$100<>\"\",IF(Payments!$C$2:$C$100=$B$2,ROW($C$7:$C$105)-ROW($C$7)+1)),ROWS(F$5:F28))))","v":""},{"$f":"IF(ROWS(G$5:G28)>COUNTIF(Payments!$C$2:$C$100,$B$2),\"\",INDEX(Payments!F$2:F$100,SMALL(IF(Payments!$C$2:$C$100<>\"\",IF(Payments!$C$2:$C$100=$B$2,ROW($C$7:$C$105)-ROW($C$7)+1)),ROWS(G$5:G28))))","v":""}]
[null,{"$f":"IF(C29=\"\",\"\",MAX($B$4:B28)+1)","v":""},{"$f":"IF(ROWS(C$5:C29)>COUNTIF(Payments!$C$2:$C$100,$B$2),\"\",INDEX(Payments!B$2:B$100,SMALL(IF(Payments!$C$2:$C$100<>\"\",IF(Payments!$C$2:$C$100=$B$2,ROW($C$7:$C$105)-ROW($C$7)+1)),ROWS(C$5:C29))))","v":""},{"$f":"IF(ROWS(D$5:D29)>COUNTIF(Payments!$C$2:$C$100,$B$2),\"\",INDEX(Payments!C$2:C$100,SMALL(IF(Payments!$C$2:$C$100<>\"\",IF(Payments!$C$2:$C$100=$B$2,ROW($C$7:$C$105)-ROW($C$7)+1)),ROWS(D$5:D29))))","v":""},{"$f":"IF(ROWS(E$5:E29)>COUNTIF(Payments!$C$2:$C$100,$B$2),\"\",INDEX(Payments!D$2:D$100,SMALL(IF(Payments!$C$2:$C$100<>\"\",IF(Payments!$C$2:$C$100=$B$2,ROW($C$7:$C$105)-ROW($C$7)+1)),ROWS(E$5:E29))))","v":""},{"$f":"IF(ROWS(F$5:F29)>COUNTIF(Payments!$C$2:$C$100,$B$2),\"\",INDEX(Payments!E$2:E$100,SMALL(IF(Payments!$C$2:$C$100<>\"\",IF(Payments!$C$2:$C$100=$B$2,ROW($C$7:$C$105)-ROW($C$7)+1)),ROWS(F$5:F29))))","v":""},{"$f":"IF(ROWS(G$5:G29)>COUNTIF(Payments!$C$2:$C$100,$B$2),\"\",INDEX(Payments!F$2:F$100,SMALL(IF(Payments!$C$2:$C$100<>\"\",IF(Payments!$C$2:$C$100=$B$2,ROW($C$7:$C$105)-ROW($C$7)+1)),ROWS(G$5:G29))))","v":""}]
[null,{"$f":"IF(C30=\"\",\"\",MAX($B$4:B29)+1)","v":""},{"$f":"IF(ROWS(C$5:C30)>COUNTIF(Payments!$C$2:$C$100,$B$2),\"\",INDEX(Payments!B$2:B$100,SMALL(IF(Payments!$C$2:$C$100<>\"\",IF(Payments!$C$2:$C$100=$B$2,ROW($C$7:$C$105)-ROW($C$7)+1)),ROWS(C$5:C30))))","v":""},{"$f":"IF(ROWS(D$5:D30)>COUNTIF(Payments!$C$2:$C$100,$B$2),\"\",INDEX(Payments!C$2:C$100,SMALL(IF(Payments!$C$2:$C$100<>\"\",IF(Payments!$C$2:$C$100=$B$2,ROW($C$7:$C$105)-ROW($C$7)+1)),ROWS(D$5:D30))))","v":""},{"$f":"IF(ROWS(E$5:E30)>COUNTIF(Payments!$C$2:$C$100,$B$2),\"\",INDEX(Payments!D$2:D$100,SMALL(IF(Payments!$C$2:$C$100<>\"\",IF(Payments!$C$2:$C$100=$B$2,ROW($C$7:$C$105)-ROW($C$7)+1)),ROWS(E$5:E30))))","v":""},{"$f":"IF(ROWS(F$5:F30)>COUNTIF(Payments!$C$2:$C$100,$B$2),\"\",INDEX(Payments!E$2:E$100,SMALL(IF(Payments!$C$2:$C$100<>\"\",IF(Payments!$C$2:$C$100=$B$2,ROW($C$7:$C$105)-ROW($C$7)+1)),ROWS(F$5:F30))))","v":""},{"$f":"IF(ROWS(G$5:G30)>COUNTIF(Payments!$C$2:$C$100,$B$2),\"\",INDEX(Payments!F$2:F$100,SMALL(IF(Payments!$C$2:$C$100<>\"\",IF(Payments!$C$2:$C$100=$B$2,ROW($C$7:$C$105)-ROW($C$7)+1)),ROWS(G$5:G30))))","v":""}]
[null,{"$f":"IF(C31=\"\",\"\",MAX($B$4:B30)+1)","v":""},{"$f":"IF(ROWS(C$5:C31)>COUNTIF(Payments!$C$2:$C$100,$B$2),\"\",INDEX(Payments!B$2:B$100,SMALL(IF(Payments!$C$2:$C$100<>\"\",IF(Payments!$C$2:$C$100=$B$2,ROW($C$7:$C$105)-ROW($C$7)+1)),ROWS(C$5:C31))))","v":""},{"$f":"IF(ROWS(D$5:D31)>COUNTIF(Payments!$C$2:$C$100,$B$2),\"\",INDEX(Payments!C$2:C$100,SMALL(IF(Payments!$C$2:$C$100<>\"\",IF(Payments!$C$2:$C$100=$B$2,ROW($C$7:$C$105)-ROW($C$7)+1)),ROWS(D$5:D31))))","v":""},{"$f":"IF(ROWS(E$5:E31)>COUNTIF(Payments!$C$2:$C$100,$B$2),\"\",INDEX(Payments!D$2:D$100,SMALL(IF(Payments!$C$2:$C$100<>\"\",IF(Payments!$C$2:$C$100=$B$2,ROW($C$7:$C$105)-ROW($C$7)+1)),ROWS(E$5:E31))))","v":""},{"$f":"IF(ROWS(F$5:F31)>COUNTIF(Payments!$C$2:$C$100,$B$2),\"\",INDEX(Payments!E$2:E$100,SMALL(IF(Payments!$C$2:$C$100<>\"\",IF(Payments!$C$2:$C$100=$B$2,ROW($C$7:$C$105)-ROW($C$7)+1)),ROWS(F$5:F31))))","v":""},{"$f":"IF(ROWS(G$5:G31)>COUNTIF(Payments!$C$2:$C$100,$B$2),\"\",INDEX(Payments!F$2:F$100,SMALL(IF(Payments!$C$2:$C$100<>\"\",IF(Payments!$C$2:$C$100=$B$2,ROW($C$7:$C$105)-ROW($C$7)+1)),ROWS(G$5:G31))))","v":""}]
[null,{"$f":"IF(C32=\"\",\"\",MAX($B$4:B31)+1)","v":""},{"$f":"IF(ROWS(C$5:C32)>COUNTIF(Payments!$C$2:$C$100,$B$2),\"\",INDEX(Payments!B$2:B$100,SMALL(IF(Payments!$C$2:$C$100<>\"\",IF(Payments!$C$2:$C$100=$B$2,ROW($C$7:$C$105)-ROW($C$7)+1)),ROWS(C$5:C32))))","v":""},{"$f":"IF(ROWS(D$5:D32)>COUNTIF(Payments!$C$2:$C$100,$B$2),\"\",INDEX(Payments!C$2:C$100,SMALL(IF(Payments!$C$2:$C$100<>\"\",IF(Payments!$C$2:$C$100=$B$2,ROW($C$7:$C$105)-ROW($C$7)+1)),ROWS(D$5:D32))))","v":""},{"$f":"IF(ROWS(E$5:E32)>COUNTIF(Payments!$C$2:$C$100,$B$2),\"\",INDEX(Payments!D$2:D$100,SMALL(IF(Payments!$C$2:$C$100<>\"\",IF(Payments!$C$2:$C$100=$B$2,ROW($C$7:$C$105)-ROW($C$7)+1)),ROWS(E$5:E32))))","v":""},{"$f":"IF(ROWS(F$5:F32)>COUNTIF(Payments!$C$2:$C$100,$B$2),\"\",INDEX(Payments!E$2:E$100,SMALL(IF(Payments!$C$2:$C$100<>\"\",IF(Payments!$C$2:$C$100=$B$2,ROW($C$7:$C$105)-ROW($C$7)+1)),ROWS(F$5:F32))))","v":""},{"$f":"IF(ROWS(G$5:G32)>COUNTIF(Payments!$C$2:$C$100,$B$2),\"\",INDEX(Payments!F$2:F$100,SMALL(IF(Payments!$C$2:$C$100<>\"\",IF(Payments!$C$2:$C$100=$B$2,ROW($C$7:$C$105)-ROW($C$7)+1)),ROWS(G$5:G32))))","v":""}]
[null,{"$f":"IF(C33=\"\",\"\",MAX($B$4:B32)+1)","v":""},{"$f":"IF(ROWS(C$5:C33)>COUNTIF(Payments!$C$2:$C$100,$B$2),\"\",INDEX(Payments!B$2:B$100,SMALL(IF(Payments!$C$2:$C$100<>\"\",IF(Payments!$C$2:$C$100=$B$2,ROW($C$7:$C$105)-ROW($C$7)+1)),ROWS(C$5:C33))))","v":""},{"$f":"IF(ROWS(D$5:D33)>COUNTIF(Payments!$C$2:$C$100,$B$2),\"\",INDEX(Payments!C$2:C$100,SMALL(IF(Payments!$C$2:$C$100<>\"\",IF(Payments!$C$2:$C$100=$B$2,ROW($C$7:$C$105)-ROW($C$7)+1)),ROWS(D$5:D33))))","v":""},{"$f":"IF(ROWS(E$5:E33)>COUNTIF(Payments!$C$2:$C$100,$B$2),\"\",INDEX(Payments!D$2:D$100,SMALL(IF(Payments!$C$2:$C$100<>\"\",IF(Payments!$C$2:$C$100=$B$2,ROW($C$7:$C$105)-ROW($C$7)+1)),ROWS(E$5:E33))))","v":""},{"$f":"IF(ROWS(F$5:F33)>COUNTIF(Payments!$C$2:$C$100,$B$2),\"\",INDEX(Payments!E$2:E$100,SMALL(IF(Payments!$C$2:$C$100<>\"\",IF(Payments!$C$2:$C$100=$B$2,ROW($C$7:$C$105)-ROW($C$7)+1)),ROWS(F$5:F33))))","v":""},{"$f":"IF(ROWS(G$5:G33)>COUNTIF(Payments!$C$2:$C$100,$B$2),\"\",INDEX(Payments!F$2:F$100,SMALL(IF(Payments!$C$2:$C$100<>\"\",IF(Payments!$C$2:$C$100=$B$2,ROW($C$7:$C$105)-ROW($C$7)+1)),ROWS(G$5:G33))))","v":""}]
[null,{"$f":"IF(C34=\"\",\"\",MAX($B$4:B33)+1)","v":""},{"$f":"IF(ROWS(C$5:C34)>COUNTIF(Payments!$C$2:$C$100,$B$2),\"\",INDEX(Payments!B$2:B$100,SMALL(IF(Payments!$C$2:$C$100<>\"\",IF(Payments!$C$2:$C$100=$B$2,ROW($C$7:$C$105)-ROW($C$7)+1)),ROWS(C$5:C34))))","v":""},{"$f":"IF(ROWS(D$5:D34)>COUNTIF(Payments!$C$2:$C$100,$B$2),\"\",INDEX(Payments!C$2:C$100,SMALL(IF(Payments!$C$2:$C$100<>\"\",IF(Payments!$C$2:$C$100=$B$2,ROW($C$7:$C$105)-ROW($C$7)+1)),ROWS(D$5:D34))))","v":""},{"$f":"IF(ROWS(E$5:E34)>COUNTIF(Payments!$C$2:$C$100,$B$2),\"\",INDEX(Payments!D$2:D$100,SMALL(IF(Payments!$C$2:$C$100<>\"\",IF(Payments!$C$2:$C$100=$B$2,ROW($C$7:$C$105)-ROW($C$7)+1)),ROWS(E$5:E34))))","v":""},{"$f":"IF(ROWS(F$5:F34)>COUNTIF(Payments!$C$2:$C$100,$B$2),\"\",INDEX(Payments!E$2:E$100,SMALL(IF(Payments!$C$2:$C$100<>\"\",IF(Payments!$C$2:$C$100=$B$2,ROW($C$7:$C$105)-ROW($C$7)+1)),ROWS(F$5:F34))))","v":""},{"$f":"IF(ROWS(G$5:G34)>COUNTIF(Payments!$C$2:$C$100,$B$2),\"\",INDEX(Payments!F$2:F$100,SMALL(IF(Payments!$C$2:$C$100<>\"\",IF(Payments!$C$2:$C$100=$B$2,ROW($C$7:$C$105)-ROW($C$7)+1)),ROWS(G$5:G34))))","v":""}]
[null,{"$f":"IF(C35=\"\",\"\",MAX($B$4:B34)+1)","v":""},{"$f":"IF(ROWS(C$5:C35)>COUNTIF(Payments!$C$2:$C$100,$B$2),\"\",INDEX(Payments!B$2:B$100,SMALL(IF(Payments!$C$2:$C$100<>\"\",IF(Payments!$C$2:$C$100=$B$2,ROW($C$7:$C$105)-ROW($C$7)+1)),ROWS(C$5:C35))))","v":""},{"$f":"IF(ROWS(D$5:D35)>COUNTIF(Payments!$C$2:$C$100,$B$2),\"\",INDEX(Payments!C$2:C$100,SMALL(IF(Payments!$C$2:$C$100<>\"\",IF(Payments!$C$2:$C$100=$B$2,ROW($C$7:$C$105)-ROW($C$7)+1)),ROWS(D$5:D35))))","v":""},{"$f":"IF(ROWS(E$5:E35)>COUNTIF(Payments!$C$2:$C$100,$B$2),\"\",INDEX(Payments!D$2:D$100,SMALL(IF(Payments!$C$2:$C$100<>\"\",IF(Payments!$C$2:$C$100=$B$2,ROW($C$7:$C$105)-ROW($C$7)+1)),ROWS(E$5:E35))))","v":""},{"$f":"IF(ROWS(F$5:F35)>COUNTIF(Payments!$C$2:$C$100,$B$2),\"\",INDEX(Payments!E$2:E$100,SMALL(IF(Payments!$C$2:$C$100<>\"\",IF(Payments!$C$2:$C$100=$B$2,ROW($C$7:$C$105)-ROW($C$7)+1)),ROWS(F$5:F35))))","v":""},{"$f":"IF(ROWS(G$5:G35)>COUNTIF(Payments!$C$2:$C$100,$B$2),\"\",INDEX(Payments!F$2:F$100,SMALL(IF(Payments!$C$2:$C$100<>\"\",IF(Payments!$C$2:$C$100=$B$2,ROW($C$7:$C$105)-ROW($C$7)+1)),ROWS(G$5:G35))))","v":""}]
[null,{"$f":"IF(C36=\"\",\"\",MAX($B$4:B35)+1)","v":""},{"$f":"IF(ROWS(C$5:C36)>COUNTIF(Payments!$C$2:$C$100,$B$2),\"\",INDEX(Payments!B$2:B$100,SMALL(IF(Payments!$C$2:$C$100<>\"\",IF(Payments!$C$2:$C$100=$B$2,ROW($C$7:$C$105)-ROW($C$7)+1)),ROWS(C$5:C36))))","v":""},{"$f":"IF(ROWS(D$5:D36)>COUNTIF(Payments!$C$2:$C$100,$B$2),\"\",INDEX(Payments!C$2:C$100,SMALL(IF(Payments!$C$2:$C$100<>\"\",IF(Payments!$C$2:$C$100=$B$2,ROW($C$7:$C$105)-ROW($C$7)+1)),ROWS(D$5:D36))))","v":""},{"$f":"IF(ROWS(E$5:E36)>COUNTIF(Payments!$C$2:$C$100,$B$2),\"\",INDEX(Payments!D$2:D$100,SMALL(IF(Payments!$C$2:$C$100<>\"\",IF(Payments!$C$2:$C$100=$B$2,ROW($C$7:$C$105)-ROW($C$7)+1)),ROWS(E$5:E36))))","v":""},{"$f":"IF(ROWS(F$5:F36)>COUNTIF(Payments!$C$2:$C$100,$B$2),\"\",INDEX(Payments!E$2:E$100,SMALL(IF(Payments!$C$2:$C$100<>\"\",IF(Payments!$C$2:$C$100=$B$2,ROW($C$7:$C$105)-ROW($C$7)+1)),ROWS(F$5:F36))))","v":""},{"$f":"IF(ROWS(G$5:G36)>COUNTIF(Payments!$C$2:$C$100,$B$2),\"\",INDEX(Payments!F$2:F$100,SMALL(IF(Payments!$C$2:$C$100<>\"\",IF(Payments!$C$2:$C$100=$B$2,ROW($C$7:$C$105)-ROW($C$7)+1)),ROWS(G$5:G36))))","v":""}]
[null,{"$f":"IF(C37=\"\",\"\",MAX($B$4:B36)+1)","v":""},{"$f":"IF(ROWS(C$5:C37)>COUNTIF(Payments!$C$2:$C$100,$B$2),\"\",INDEX(Payments!B$2:B$100,SMALL(IF(Payments!$C$2:$C$100<>\"\",IF(Payments!$C$2:$C$100=$B$2,ROW($C$7:$C$105)-ROW($C$7)+1)),ROWS(C$5:C37))))","v":""},{"$f":"IF(ROWS(D$5:D37)>COUNTIF(Payments!$C$2:$C$100,$B$2),\"\",INDEX(Payments!C$2:C$100,SMALL(IF(Payments!$C$2:$C$100<>\"\",IF(Payments!$C$2:$C$100=$B$2,ROW($C$7:$C$105)-ROW($C$7)+1)),ROWS(D$5:D37))))","v":""},{"$f":"IF(ROWS(E$5:E37)>COUNTIF(Payments!$C$2:$C$100,$B$2),\"\",INDEX(Payments!D$2:D$100,SMALL(IF(Payments!$C$2:$C$100<>\"\",IF(Payments!$C$2:$C$100=$B$2,ROW($C$7:$C$105)-ROW($C$7)+1)),ROWS(E$5:E37))))","v":""},{"$f":"IF(ROWS(F$5:F37)>COUNTIF(Payments!$C$2:$C$100,$B$2),\"\",INDEX(Payments!E$2:E$100,SMALL(IF(Payments!$C$2:$C$100<>\"\",IF(Payments!$C$2:$C$100=$B$2,ROW($C$7:$C$105)-ROW($C$7)+1)),ROWS(F$5:F37))))","v":""},{"$f":"IF(ROWS(G$5:G37)>COUNTIF(Payments!$C$2:$C$100,$B$2),\"\",INDEX(Payments!F$2:F$100,SMALL(IF(Payments!$C$2:$C$100<>\"\",IF(Payments!$C$2:$C$100=$B$2,ROW($C$7:$C$105)-ROW($C$7)+1)),ROWS(G$5:G37))))","v":""}]
[null,{"$f":"IF(C38=\"\",\"\",MAX($B$4:B37)+1)","v":""},{"$f":"IF(ROWS(C$5:C38)>COUNTIF(Payments!$C$2:$C$100,$B$2),\"\",INDEX(Payments!B$2:B$100,SMALL(IF(Payments!$C$2:$C$100<>\"\",IF(Payments!$C$2:$C$100=$B$2,ROW($C$7:$C$105)-ROW($C$7)+1)),ROWS(C$5:C38))))","v":""},{"$f":"IF(ROWS(D$5:D38)>COUNTIF(Payments!$C$2:$C$100,$B$2),\"\",INDEX(Payments!C$2:C$100,SMALL(IF(Payments!$C$2:$C$100<>\"\",IF(Payments!$C$2:$C$100=$B$2,ROW($C$7:$C$105)-ROW($C$7)+1)),ROWS(D$5:D38))))","v":""},{"$f":"IF(ROWS(E$5:E38)>COUNTIF(Payments!$C$2:$C$100,$B$2),\"\",INDEX(Payments!D$2:D$100,SMALL(IF(Payments!$C$2:$C$100<>\"\",IF(Payments!$C$2:$C$100=$B$2,ROW($C$7:$C$105)-ROW($C$7)+1)),ROWS(E$5:E38))))","v":""},{"$f":"IF(ROWS(F$5:F38)>COUNTIF(Payments!$C$2:$C$100,$B$2),\"\",INDEX(Payments!E$2:E$100,SMALL(IF(Payments!$C$2:$C$100<>\"\",IF(Payments!$C$2:$C$100=$B$2,ROW($C$7:$C$105)-ROW($C$7)+1)),ROWS(F$5:F38))))","v":""},{"$f":"IF(ROWS(G$5:G38)>COUNTIF(Payments!$C$2:$C$100,$B$2),\"\",INDEX(Payments!F$2:F$100,SMALL(IF(Payments!$C$2:$C$100<>\"\",IF(Payments!$C$2:$C$100=$B$2,ROW($C$7:$C$105)-ROW($C$7)+1)),ROWS(G$5:G38))))","v":""}]
[null,{"$f":"IF(C39=\"\",\"\",MAX($B$4:B38)+1)","v":""},{"$f":"IF(ROWS(C$5:C39)>COUNTIF(Payments!$C$2:$C$100,$B$2),\"\",INDEX(Payments!B$2:B$100,SMALL(IF(Payments!$C$2:$C$100<>\"\",IF(Payments!$C$2:$C$100=$B$2,ROW($C$7:$C$105)-ROW($C$7)+1)),ROWS(C$5:C39))))","v":""},{"$f":"IF(ROWS(D$5:D39)>COUNTIF(Payments!$C$2:$C$100,$B$2),\"\",INDEX(Payments!C$2:C$100,SMALL(IF(Payments!$C$2:$C$100<>\"\",IF(Payments!$C$2:$C$100=$B$2,ROW($C$7:$C$105)-ROW($C$7)+1)),ROWS(D$5:D39))))","v":""},{"$f":"IF(ROWS(E$5:E39)>COUNTIF(Payments!$C$2:$C$100,$B$2),\"\",INDEX(Payments!D$2:D$100,SMALL(IF(Payments!$C$2:$C$100<>\"\",IF(Payments!$C$2:$C$100=$B$2,ROW($C$7:$C$105)-ROW($C$7)+1)),ROWS(E$5:E39))))","v":""},{"$f":"IF(ROWS(F$5:F39)>COUNTIF(Payments!$C$2:$C$100,$B$2),\"\",INDEX(Payments!E$2:E$100,SMALL(IF(Payments!$C$2:$C$100<>\"\",IF(Payments!$C$2:$C$100=$B$2,ROW($C$7:$C$105)-ROW($C$7)+1)),ROWS(F$5:F39))))","v":""},{"$f":"IF(ROWS(G$5:G39)>COUNTIF(Payments!$C$2:$C$100,$B$2),\"\",INDEX(Payments!F$2:F$100,SMALL(IF(Payments!$C$2:$C$100<>\"\",IF(Payments!$C$2:$C$100=$B$2,ROW($C$7:$C$105)-ROW($C$7)+1)),ROWS(G$5:G39))))","v":""}]
[null,{"$f":"IF(C40=\"\",\"\",MAX($B$4:B39)+1)","v":""},{"$f":"IF(ROWS(C$5:C40)>COUNTIF(Payments!$C$2:$C$100,$B$2),\"\",INDEX(Payments!B$2:B$100,SMALL(IF(Payments!$C$2:$C$100<>\"\",IF(Payments!$C$2:$C$100=$B$2,ROW($C$7:$C$105)-ROW($C$7)+1)),ROWS(C$5:C40))))","v":""},{"$f":"IF(ROWS(D$5:D40)>COUNTIF(Payments!$C$2:$C$100,$B$2),\"\",INDEX(Payments!C$2:C$100,SMALL(IF(Payments!$C$2:$C$100<>\"\",IF(Payments!$C$2:$C$100=$B$2,ROW($C$7:$C$105)-ROW($C$7)+1)),ROWS(D$5:D40))))","v":""},{"$f":"IF(ROWS(E$5:E40)>COUNTIF(Payments!$C$2:$C$100,$B$2),\"\",INDEX(Payments!D$2:D$100,SMALL(IF(Payments!$C$2:$C$100<>\"\",IF(Payments!$C$2:$C$100=$B$2,ROW($C$7:$C$105)-ROW($C$7)+1)),ROWS(E$5:E40))))","v":""},{"$f":"IF(ROWS(F$5:F40)>COUNTIF(Payments!$C$2:$C$100,$B$2),\"\",INDEX(Payments!E$2:E$100,SMALL(IF(Payments!$C$2:$C$100<>\"\",IF(Payments!$C$2:$C$100=$B$2,ROW($C$7:$C$105)-ROW($C$7)+1)),ROWS(F$5:F40))))","v":""},{"$f":"IF(ROWS(G$5:G40)>COUNTIF(Payments!$C$2:$C$100,$B$2),\"\",INDEX(Payments!F$2:F$100,SMALL(IF(Payments!$C$2:$C$100<>\"\",IF(Payments!$C$2:$C$100=$B$2,ROW($C$7:$C$105)-ROW($C$7)+1)),ROWS(G$5:G40))))","v":""}]
[null,{"$f":"IF(C41=\"\",\"\",MAX($B$4:B40)+1)","v":""},{"$f":"IF(ROWS(C$5:C41)>COUNTIF(Payments!$C$2:$C$100,$B$2),\"\",INDEX(Payments!B$2:B$100,SMALL(IF(Payments!$C$2:$C$100<>\"\",IF(Payments!$C$2:$C$100=$B$2,ROW($C$7:$C$105)-ROW($C$7)+1)),ROWS(C$5:C41))))","v":""},{"$f":"IF(ROWS(D$5:D41)>COUNTIF(Payments!$C$2:$C$100,$B$2),\"\",INDEX(Payments!C$2:C$100,SMALL(IF(Payments!$C$2:$C$100<>\"\",IF(Payments!$C$2:$C$100=$B$2,ROW($C$7:$C$105)-ROW($C$7)+1)),ROWS(D$5:D41))))","v":""},{"$f":"IF(ROWS(E$5:E41)>COUNTIF(Payments!$C$2:$C$100,$B$2),\"\",INDEX(Payments!D$2:D$100,SMALL(IF(Payments!$C$2:$C$100<>\"\",IF(Payments!$C$2:$C$100=$B$2,ROW($C$7:$C$105)-ROW($C$7)+1)),ROWS(E$5:E41))))","v":""},{"$f":"IF(ROWS(F$5:F41)>COUNTIF(Payments!$C$2:$C$100,$B$2),\"\",INDEX(Payments!E$2:E$100,SMALL(IF(Payments!$C$2:$C$100<>\"\",IF(Payments!$C$2:$C$100=$B$2,ROW($C$7:$C$105)-ROW($C$7)+1)),ROWS(F$5:F41))))","v":""},{"$f":"IF(ROWS(G$5:G41)>COUNTIF(Payments!$C$2:$C$100,$B$2),\"\",INDEX(Payments!F$2:F$100,SMALL(IF(Payments!$C$2:$C$100<>\"\",IF(Payments!$C$2:$C$100=$B$2,ROW($C$7:$C$105)-ROW($C$7)+1)),ROWS(G$5:G41))))","v":""}]
[null,{"$f":"IF(C42=\"\",\"\",MAX($B$4:B41)+1)","v":""},{"$f":"IF(ROWS(C$5:C42)>COUNTIF(Payments!$C$2:$C$100,$B$2),\"\",INDEX(Payments!B$2:B$100,SMALL(IF(Payments!$C$2:$C$100<>\"\",IF(Payments!$C$2:$C$100=$B$2,ROW($C$7:$C$105)-ROW($C$7)+1)),ROWS(C$5:C42))))","v":""},{"$f":"IF(ROWS(D$5:D42)>COUNTIF(Payments!$C$2:$C$100,$B$2),\"\",INDEX(Payments!C$2:C$100,SMALL(IF(Payments!$C$2:$C$100<>\"\",IF(Payments!$C$2:$C$100=$B$2,ROW($C$7:$C$105)-ROW($C$7)+1)),ROWS(D$5:D42))))","v":""},{"$f":"IF(ROWS(E$5:E42)>COUNTIF(Payments!$C$2:$C$100,$B$2),\"\",INDEX(Payments!D$2:D$100,SMALL(IF(Payments!$C$2:$C$100<>\"\",IF(Payments!$C$2:$C$100=$B$2,ROW($C$7:$C$105)-ROW($C$7)+1)),ROWS(E$5:E42))))","v":""},{"$f":"IF(ROWS(F$5:F42)>COUNTIF(Payments!$C$2:$C$100,$B$2),\"\",INDEX(Payments!E$2:E$100,SMALL(IF(Payments!$C$2:$C$100<>\"\",IF(Payments!$C$2:$C$100=$B$2,ROW($C$7:$C$105)-ROW($C$7)+1)),ROWS(F$5:F42))))","v":""},{"$f":"IF(ROWS(G$5:G42)>COUNTIF(Payments!$C$2:$C$100,$B$2),\"\",INDEX(Payments!F$2:F$100,SMALL(IF(Payments!$C$2:$C$100<>\"\",IF(Payments!$C$2:$C$100=$B$2,ROW($C$7:$C$105)-ROW($C$7)+1)),ROWS(G$5:G42))))","v":""}]
[null,{"$f":"IF(C43=\"\",\"\",MAX($B$4:B42)+1)","v":""},{"$f":"IF(ROWS(C$5:C43)>COUNTIF(Payments!$C$2:$C$100,$B$2),\"\",INDEX(Payments!B$2:B$100,SMALL(IF(Payments!$C$2:$C$100<>\"\",IF(Payments!$C$2:$C$100=$B$2,ROW($C$7:$C$105)-ROW($C$7)+1)),ROWS(C$5:C43))))","v":""},{"$f":"IF(ROWS(D$5:D43)>COUNTIF(Payments!$C$2:$C$100,$B$2),\"\",INDEX(Payments!C$2:C$100,SMALL(IF(Payments!$C$2:$C$100<>\"\",IF(Payments!$C$2:$C$100=$B$2,ROW($C$7:$C$105)-ROW($C$7)+1)),ROWS(D$5:D43))))","v":""},{"$f":"IF(ROWS(E$5:E43)>COUNTIF(Payments!$C$2:$C$100,$B$2),\"\",INDEX(Payments!D$2:D$100,SMALL(IF(Payments!$C$2:$C$100<>\"\",IF(Payments!$C$2:$C$100=$B$2,ROW($C$7:$C$105)-ROW($C$7)+1)),ROWS(E$5:E43))))","v":""},{"$f":"IF(ROWS(F$5:F43)>COUNTIF(Payments!$C$2:$C$100,$B$2),\"\",INDEX(Payments!E$2:E$100,SMALL(IF(Payments!$C$2:$C$100<>\"\",IF(Payments!$C$2:$C$100=$B$2,ROW($C$7:$C$105)-ROW($C$7)+1)),ROWS(F$5:F43))))","v":""},{"$f":"IF(ROWS(G$5:G43)>COUNTIF(Payments!$C$2:$C$100,$B$2),\"\",INDEX(Payments!F$2:F$100,SMALL(IF(Payments!$C$2:$C$100<>\"\",IF(Payments!$C$2:$C$100=$B$2,ROW($C$7:$C$105)-ROW($C$7)+1)),ROWS(G$5:G43))))","v":""}]
[null,{"$f":"IF(C44=\"\",\"\",MAX($B$4:B43)+1)","v":""},{"$f":"IF(ROWS(C$5:C44)>COUNTIF(Payments!$C$2:$C$100,$B$2),\"\",INDEX(Payments!B$2:B$100,SMALL(IF(Payments!$C$2:$C$100<>\"\",IF(Payments!$C$2:$C$100=$B$2,ROW($C$7:$C$105)-ROW($C$7)+1)),ROWS(C$5:C44))))","v":""},{"$f":"IF(ROWS(D$5:D44)>COUNTIF(Payments!$C$2:$C$100,$B$2),\"\",INDEX(Payments!C$2:C$100,SMALL(IF(Payments!$C$2:$C$100<>\"\",IF(Payments!$C$2:$C$100=$B$2,ROW($C$7:$C$105)-ROW($C$7)+1)),ROWS(D$5:D44))))","v":""},{"$f":"IF(ROWS(E$5:E44)>COUNTIF(Payments!$C$2:$C$100,$B$2),\"\",INDEX(Payments!D$2:D$100,SMALL(IF(Payments!$C$2:$C$100<>\"\",IF(Payments!$C$2:$C$100=$B$2,ROW($C$7:$C$105)-ROW($C$7)+1)),ROWS(E$5:E44))))","v":""},{"$f":"IF(ROWS(F$5:F44)>COUNTIF(Payments!$C$2:$C$100,$B$2),\"\",INDEX(Payments!E$2:E$100,SMALL(IF(Payments!$C$2:$C$100<>\"\",IF(Payments!$C$2:$C$100=$B$2,ROW($C$7:$C$105)-ROW($C$7)+1)),ROWS(F$5:F44))))","v":""},{"$f":"IF(ROWS(G$5:G44)>COUNTIF(Payments!$C$2:$C$100,$B$2),\"\",INDEX(Payments!F$2:F$100,SMALL(IF(Payments!$C$2:$C$100<>\"\",IF(Payments!$C$2:$C$100=$B$2,ROW($C$7:$C$105)-ROW($C$7)+1)),ROWS(G$5:G44))))","v":""}]
[null,{"$f":"IF(C45=\"\",\"\",MAX($B$4:B44)+1)","v":""},{"$f":"IF(ROWS(C$5:C45)>COUNTIF(Payments!$C$2:$C$100,$B$2),\"\",INDEX(Payments!B$2:B$100,SMALL(IF(Payments!$C$2:$C$100<>\"\",IF(Payments!$C$2:$C$100=$B$2,ROW($C$7:$C$105)-ROW($C$7)+1)),ROWS(C$5:C45))))","v":""},{"$f":"IF(ROWS(D$5:D45)>COUNTIF(Payments!$C$2:$C$100,$B$2),\"\",INDEX(Payments!C$2:C$100,SMALL(IF(Payments!$C$2:$C$100<>\"\",IF(Payments!$C$2:$C$100=$B$2,ROW($C$7:$C$105)-ROW($C$7)+1)),ROWS(D$5:D45))))","v":""},{"$f":"IF(ROWS(E$5:E45)>COUNTIF(Payments!$C$2:$C$100,$B$2),\"\",INDEX(Payments!D$2:D$100,SMALL(IF(Payments!$C$2:$C$100<>\"\",IF(Payments!$C$2:$C$100=$B$2,ROW($C$7:$C$105)-ROW($C$7)+1)),ROWS(E$5:E45))))","v":""},{"$f":"IF(ROWS(F$5:F45)>COUNTIF(Payments!$C$2:$C$100,$B$2),\"\",INDEX(Payments!E$2:E$100,SMALL(IF(Payments!$C$2:$C$100<>\"\",IF(Payments!$C$2:$C$100=$B$2,ROW($C$7:$C$105)-ROW($C$7)+1)),ROWS(F$5:F45))))","v":""},{"$f":"IF(ROWS(G$5:G45)>COUNTIF(Payments!$C$2:$C$100,$B$2),\"\",INDEX(Payments!F$2:F$100,SMALL(IF(Payments!$C$2:$C$100<>\"\",IF(Payments!$C$2:$C$100=$B$2,ROW($C$7:$C$105)-ROW($C$7)+1)),ROWS(G$5:G45))))","v":""}]
[null,{"$f":"IF(C46=\"\",\"\",MAX($B$4:B45)+1)","v":""},{"$f":"IF(ROWS(C$5:C46)>COUNTIF(Payments!$C$2:$C$100,$B$2),\"\",INDEX(Payments!B$2:B$100,SMALL(IF(Payments!$C$2:$C$100<>\"\",IF(Payments!$C$2:$C$100=$B$2,ROW($C$7:$C$105)-ROW($C$7)+1)),ROWS(C$5:C46))))","v":""},{"$f":"IF(ROWS(D$5:D46)>COUNTIF(Payments!$C$2:$C$100,$B$2),\"\",INDEX(Payments!C$2:C$100,SMALL(IF(Payments!$C$2:$C$100<>\"\",IF(Payments!$C$2:$C$100=$B$2,ROW($C$7:$C$105)-ROW($C$7)+1)),ROWS(D$5:D46))))","v":""},{"$f":"IF(ROWS(E$5:E46)>COUNTIF(Payments!$C$2:$C$100,$B$2),\"\",INDEX(Payments!D$2:D$100,SMALL(IF(Payments!$C$2:$C$100<>\"\",IF(Payments!$C$2:$C$100=$B$2,ROW($C$7:$C$105)-ROW($C$7)+1)),ROWS(E$5:E46))))","v":""},{"$f":"IF(ROWS(F$5:F46)>COUNTIF(Payments!$C$2:$C$100,$B$2),\"\",INDEX(Payments!E$2:E$100,SMALL(IF(Payments!$C$2:$C$100<>\"\",IF(Payments!$C$2:$C$100=$B$2,ROW($C$7:$C$105)-ROW($C$7)+1)),ROWS(F$5:F46))))","v":""},{"$f":"IF(ROWS(G$5:G46)>COUNTIF(Payments!$C$2:$C$100,$B$2),\"\",INDEX(Payments!F$2:F$100,SMALL(IF(Payments!$C$2:$C$100<>\"\",IF(Payments!$C$2:$C$100=$B$2,ROW($C$7:$C$105)-ROW($C$7)+1)),ROWS(G$5:G46))))","v":""}]
[null,{"$f":"IF(C47=\"\",\"\",MAX($B$4:B46)+1)","v":""},{"$f":"IF(ROWS(C$5:C47)>COUNTIF(Payments!$C$2:$C$100,$B$2),\"\",INDEX(Payments!B$2:B$100,SMALL(IF(Payments!$C$2:$C$100<>\"\",IF(Payments!$C$2:$C$100=$B$2,ROW($C$7:$C$105)-ROW($C$7)+1)),ROWS(C$5:C47))))","v":""},{"$f":"IF(ROWS(D$5:D47)>COUNTIF(Payments!$C$2:$C$100,$B$2),\"\",INDEX(Payments!C$2:C$100,SMALL(IF(Payments!$C$2:$C$100<>\"\",IF(Payments!$C$2:$C$100=$B$2,ROW($C$7:$C$105)-ROW($C$7)+1)),ROWS(D$5:D47))))","v":""},{"$f":"IF(ROWS(E$5:E47)>COUNTIF(Payments!$C$2:$C$100,$B$2),\"\",INDEX(Payments!D$2:D$100,SMALL(IF(Payments!$C$2:$C$100<>\"\",IF(Payments!$C$2:$C$100=$B$2,ROW($C$7:$C$105)-ROW($C$7)+1)),ROWS(E$5:E47))))","v":""},{"$f":"IF(ROWS(F$5:F47)>COUNTIF(Payments!$C$2:$C$100,$B$2),\"\",INDEX(Payments!E$2:E$100,SMALL(IF(Payments!$C$2:$C$100<>\"\",IF(Payments!$C$2:$C$100=$B$2,ROW($C$7:$C$105)-ROW($C$7)+1)),ROWS(F$5:F47))))","v":""},{"$f":"IF(ROWS(G$5:G47)>COUNTIF(Payments!$C$2:$C$100,$B$2),\"\",INDEX(Payments!F$2:F$100,SMALL(IF(Payments!$C$2:$C$100<>\"\",IF(Payments!$C$2:$C$100=$B$2,ROW($C$7:$C$105)-ROW($C$7)+1)),ROWS(G$5:G47))))","v":""}]
[null,{"$f":"IF(C48=\"\",\"\",MAX($B$4:B47)+1)","v":""},{"$f":"IF(ROWS(C$5:C48)>COUNTIF(Payments!$C$2:$C$100,$B$2),\"\",INDEX(Payments!B$2:B$100,SMALL(IF(Payments!$C$2:$C$100<>\"\",IF(Payments!$C$2:$C$100=$B$2,ROW($C$7:$C$105)-ROW($C$7)+1)),ROWS(C$5:C48))))","v":""},{"$f":"IF(ROWS(D$5:D48)>COUNTIF(Payments!$C$2:$C$100,$B$2),\"\",INDEX(Payments!C$2:C$100,SMALL(IF(Payments!$C$2:$C$100<>\"\",IF(Payments!$C$2:$C$100=$B$2,ROW($C$7:$C$105)-ROW($C$7)+1)),ROWS(D$5:D48))))","v":""},{"$f":"IF(ROWS(E$5:E48)>COUNTIF(Payments!$C$2:$C$100,$B$2),\"\",INDEX(Payments!D$2:D$100,SMALL(IF(Payments!$C$2:$C$100<>\"\",IF(Payments!$C$2:$C$100=$B$2,ROW($C$7:$C$105)-ROW($C$7)+1)),ROWS(E$5:E48))))","v":""},{"$f":"IF(ROWS(F$5:F48)>COUNTIF(Payments!$C$2:$C$100,$B$2),\"\",INDEX(Payments!E$2:E$100,SMALL(IF(Payments!$C$2:$C$100<>\"\",IF(Payments!$C$2:$C$100=$B$2,ROW($C$7:$C$105)-ROW($C$7)+1)),ROWS(F$5:F48))))","v":""},{"$f":"IF(ROWS(G$5:G48)>COUNTIF(Payments!$C$2:$C$100,$B$2),\"\",INDEX(Payments!F$2:F$100,SMALL(IF(Payments!$C$2:$C$100<>\"\",IF(Payments!$C$2:$C$100=$B$2,ROW($C$7:$C$105)-ROW($C$7)+1)),ROWS(G$5:G48))))","v":""}]
[null,{"$f":"IF(C49=\"\",\"\",MAX($B$4:B48)+1)","v":""},{"$f":"IF(ROWS(C$5:C49)>COUNTIF(Payments!$C$2:$C$100,$B$2),\"\",INDEX(Payments!B$2:B$100,SMALL(IF(Payments!$C$2:$C$100<>\"\",IF(Payments!$C$2:$C$100=$B$2,ROW($C$7:$C$105)-ROW($C$7)+1)),ROWS(C$5:C49))))","v":""},{"$f":"IF(ROWS(D$5:D49)>COUNTIF(Payments!$C$2:$C$100,$B$2),\"\",INDEX(Payments!C$2:C$100,SMALL(IF(Payments!$C$2:$C$100<>\"\",IF(Payments!$C$2:$C$100=$B$2,ROW($C$7:$C$105)-ROW($C$7)+1)),ROWS(D$5:D49))))","v":""},{"$f":"IF(ROWS(E$5:E49)>COUNTIF(Payments!$C$2:$C$100,$B$2),\"\",INDEX(Payments!D$2:D$100,SMALL(IF(Payments!$C$2:$C$100<>\"\",IF(Payments!$C$2:$C$100=$B$2,ROW($C$7:$C$105)-ROW($C$7)+1)),ROWS(E$5:E49))))","v":""},{"$f":"IF(ROWS(F$5:F49)>COUNTIF(Payments!$C$2:$C$100,$B$2),\"\",INDEX(Payments!E$2:E$100,SMALL(IF(Payments!$C$2:$C$100<>\"\",IF(Payments!$C$2:$C$100=$B$2,ROW($C$7:$C$105)-ROW($C$7)+1)),ROWS(F$5:F49))))","v":""},{"$f":"IF(ROWS(G$5:G49)>COUNTIF(Payments!$C$2:$C$100,$B$2),\"\",INDEX(Payments!F$2:F$100,SMALL(IF(Payments!$C$2:$C$100<>\"\",IF(Payments!$C$2:$C$100=$B$2,ROW($C$7:$C$105)-ROW($C$7)+1)),ROWS(G$5:G49))))","v":""}]
[null,{"$f":"IF(C50=\"\",\"\",MAX($B$4:B49)+1)","v":""},{"$f":"IF(ROWS(C$5:C50)>COUNTIF(Payments!$C$2:$C$100,$B$2),\"\",INDEX(Payments!B$2:B$100,SMALL(IF(Payments!$C$2:$C$100<>\"\",IF(Payments!$C$2:$C$100=$B$2,ROW($C$7:$C$105)-ROW($C$7)+1)),ROWS(C$5:C50))))","v":""},{"$f":"IF(ROWS(D$5:D50)>COUNTIF(Payments!$C$2:$C$100,$B$2),\"\",INDEX(Payments!C$2:C$100,SMALL(IF(Payments!$C$2:$C$100<>\"\",IF(Payments!$C$2:$C$100=$B$2,ROW($C$7:$C$105)-ROW($C$7)+1)),ROWS(D$5:D50))))","v":""},{"$f":"IF(ROWS(E$5:E50)>COUNTIF(Payments!$C$2:$C$100,$B$2),\"\",INDEX(Payments!D$2:D$100,SMALL(IF(Payments!$C$2:$C$100<>\"\",IF(Payments!$C$2:$C$100=$B$2,ROW($C$7:$C$105)-ROW($C$7)+1)),ROWS(E$5:E50))))","v":""},{"$f":"IF(ROWS(F$5:F50)>COUNTIF(Payments!$C$2:$C$100,$B$2),\"\",INDEX(Payments!E$2:E$100,SMALL(IF(Payments!$C$2:$C$100<>\"\",IF(Payments!$C$2:$C$100=$B$2,ROW($C$7:$C$105)-ROW($C$7)+1)),ROWS(F$5:F50))))","v":""},{"$f":"IF(ROWS(G$5:G50)>COUNTIF(Payments!$C$2:$C$100,$B$2),\"\",INDEX(Payments!F$2:F$100,SMALL(IF(Payments!$C$2:$C$100<>\"\",IF(Payments!$C$2:$C$100=$B$2,ROW($C$7:$C$105)-ROW($C$7)+1)),ROWS(G$5:G50))))","v":""}]
[null,{"$f":"IF(C51=\"\",\"\",MAX($B$4:B50)+1)","v":""},{"$f":"IF(ROWS(C$5:C51)>COUNTIF(Payments!$C$2:$C$100,$B$2),\"\",INDEX(Payments!B$2:B$100,SMALL(IF(Payments!$C$2:$C$100<>\"\",IF(Payments!$C$2:$C$100=$B$2,ROW($C$7:$C$105)-ROW($C$7)+1)),ROWS(C$5:C51))))","v":""},{"$f":"IF(ROWS(D$5:D51)>COUNTIF(Payments!$C$2:$C$100,$B$2),\"\",INDEX(Payments!C$2:C$100,SMALL(IF(Payments!$C$2:$C$100<>\"\",IF(Payments!$C$2:$C$100=$B$2,ROW($C$7:$C$105)-ROW($C$7)+1)),ROWS(D$5:D51))))","v":""},{"$f":"IF(ROWS(E$5:E51)>COUNTIF(Payments!$C$2:$C$100,$B$2),\"\",INDEX(Payments!D$2:D$100,SMALL(IF(Payments!$C$2:$C$100<>\"\",IF(Payments!$C$2:$C$100=$B$2,ROW($C$7:$C$105)-ROW($C$7)+1)),ROWS(E$5:E51))))","v":""},{"$f":"IF(ROWS(F$5:F51)>COUNTIF(Payments!$C$2:$C$100,$B$2),\"\",INDEX(Payments!E$2:E$100,SMALL(IF(Payments!$C$2:$C$100<>\"\",IF(Payments!$C$2:$C$100=$B$2,ROW($C$7:$C$105)-ROW($C$7)+1)),ROWS(F$5:F51))))","v":""},{"$f":"IF(ROWS(G$5:G51)>COUNTIF(Payments!$C$2:$C$100,$B$2),\"\",INDEX(Payments!F$2:F$100,SMALL(IF(Payments!$C$2:$C$100<>\"\",IF(Payments!$C$2:$C$100=$B$2,ROW($C$7:$C$105)-ROW($C$7)+1)),ROWS(G$5:G51))))","v":""}]
[null,{"$f":"IF(C52=\"\",\"\",MAX($B$4:B51)+1)","v":""},{"$f":"IF(ROWS(C$5:C52)>COUNTIF(Payments!$C$2:$C$100,$B$2),\"\",INDEX(Payments!B$2:B$100,SMALL(IF(Payments!$C$2:$C$100<>\"\",IF(Payments!$C$2:$C$100=$B$2,ROW($C$7:$C$105)-ROW($C$7)+1)),ROWS(C$5:C52))))","v":""},{"$f":"IF(ROWS(D$5:D52)>COUNTIF(Payments!$C$2:$C$100,$B$2),\"\",INDEX(Payments!C$2:C$100,SMALL(IF(Payments!$C$2:$C$100<>\"\",IF(Payments!$C$2:$C$100=$B$2,ROW($C$7:$C$105)-ROW($C$7)+1)),ROWS(D$5:D52))))","v":""},{"$f":"IF(ROWS(E$5:E52)>COUNTIF(Payments!$C$2:$C$100,$B$2),\"\",INDEX(Payments!D$2:D$100,SMALL(IF(Payments!$C$2:$C$100<>\"\",IF(Payments!$C$2:$C$100=$B$2,ROW($C$7:$C$105)-ROW($C$7)+1)),ROWS(E$5:E52))))","v":""},{"$f":"IF(ROWS(F$5:F52)>COUNTIF(Payments!$C$2:$C$100,$B$2),\"\",INDEX(Payments!E$2:E$100,SMALL(IF(Payments!$C$2:$C$100<>\"\",IF(Payments!$C$2:$C$100=$B$2,ROW($C$7:$C$105)-ROW($C$7)+1)),ROWS(F$5:F52))))","v":""},{"$f":"IF(ROWS(G$5:G52)>COUNTIF(Payments!$C$2:$C$100,$B$2),\"\",INDEX(Payments!F$2:F$100,SMALL(IF(Payments!$C$2:$C$100<>\"\",IF(Payments!$C$2:$C$100=$B$2,ROW($C$7:$C$105)-ROW($C$7)+1)),ROWS(G$5:G52))))","v":""}]
[null,{"$f":"IF(C53=\"\",\"\",MAX($B$4:B52)+1)","v":""},{"$f":"IF(ROWS(C$5:C53)>COUNTIF(Payments!$C$2:$C$100,$B$2),\"\",INDEX(Payments!B$2:B$100,SMALL(IF(Payments!$C$2:$C$100<>\"\",IF(Payments!$C$2:$C$100=$B$2,ROW($C$7:$C$105)-ROW($C$7)+1)),ROWS(C$5:C53))))","v":""},{"$f":"IF(ROWS(D$5:D53)>COUNTIF(Payments!$C$2:$C$100,$B$2),\"\",INDEX(Payments!C$2:C$100,SMALL(IF(Payments!$C$2:$C$100<>\"\",IF(Payments!$C$2:$C$100=$B$2,ROW($C$7:$C$105)-ROW($C$7)+1)),ROWS(D$5:D53))))","v":""},{"$f":"IF(ROWS(E$5:E53)>COUNTIF(Payments!$C$2:$C$100,$B$2),\"\",INDEX(Payments!D$2:D$100,SMALL(IF(Payments!$C$2:$C$100<>\"\",IF(Payments!$C$2:$C$100=$B$2,ROW($C$7:$C$105)-ROW($C$7)+1)),ROWS(E$5:E53))))","v":""},{"$f":"IF(ROWS(F$5:F53)>COUNTIF(Payments!$C$2:$C$100,$B$2),\"\",INDEX(Payments!E$2:E$100,SMALL(IF(Payments!$C$2:$C$100<>\"\",IF(Payments!$C$2:$C$100=$B$2,ROW($C$7:$C$105)-ROW($C$7)+1)),ROWS(F$5:F53))))","v":""},{"$f":"IF(ROWS(G$5:G53)>COUNTIF(Payments!$C$2:$C$100,$B$2),\"\",INDEX(Payments!F$2:F$100,SMALL(IF(Payments!$C$2:$C$100<>\"\",IF(Payments!$C$2:$C$100=$B$2,ROW($C$7:$C$105)-ROW($C$7)+1)),ROWS(G$5:G53))))","v":""}]
[null,{"$f":"IF(C54=\"\",\"\",MAX($B$4:B53)+1)","v":""},{"$f":"IF(ROWS(C$5:C54)>COUNTIF(Payments!$C$2:$C$100,$B$2),\"\",INDEX(Payments!B$2:B$100,SMALL(IF(Payments!$C$2:$C$100<>\"\",IF(Payments!$C$2:$C$100=$B$2,ROW($C$7:$C$105)-ROW($C$7)+1)),ROWS(C$5:C54))))","v":""},{"$f":"IF(ROWS(D$5:D54)>COUNTIF(Payments!$C$2:$C$100,$B$2),\"\",INDEX(Payments!C$2:C$100,SMALL(IF(Payments!$C$2:$C$100<>\"\",IF(Payments!$C$2:$C$100=$B$2,ROW($C$7:$C$105)-ROW($C$7)+1)),ROWS(D$5:D54))))","v":""},{"$f":"IF(ROWS(E$5:E54)>COUNTIF(Payments!$C$2:$C$100,$B$2),\"\",INDEX(Payments!D$2:D$100,SMALL(IF(Payments!$C$2:$C$100<>\"\",IF(Payments!$C$2:$C$100=$B$2,ROW($C$7:$C$105)-ROW($C$7)+1)),ROWS(E$5:E54))))","v":""},{"$f":"IF(ROWS(F$5:F54)>COUNTIF(Payments!$C$2:$C$100,$B$2),\"\",INDEX(Payments!E$2:E$100,SMALL(IF(Payments!$C$2:$C$100<>\"\",IF(Payments!$C$2:$C$100=$B$2,ROW($C$7:$C$105)-ROW($C$7)+1)),ROWS(F$5:F54))))","v":""},{"$f":"IF(ROWS(G$5:G54)>COUNTIF(Payments!$C$2:$C$100,$B$2),\"\",INDEX(Payments!F$2:F$100,SMALL(IF(Payments!$C$2:$C$100<>\"\",IF(Payments!$C$2:$C$100=$B$2,ROW($C$7:$C$105)-ROW($C$7)+1)),ROWS(G$5:G54))))","v":""}]
[null,{"$f":"IF(C55=\"\",\"\",MAX($B$4:B54)+1)","v":""},{"$f":"IF(ROWS(C$5:C55)>COUNTIF(Payments!$C$2:$C$100,$B$2),\"\",INDEX(Payments!B$2:B$100,SMALL(IF(Payments!$C$2:$C$100<>\"\",IF(Payments!$C$2:$C$100=$B$2,ROW($C$7:$C$105)-ROW($C$7)+1)),ROWS(C$5:C55))))","v":""},{"$f":"IF(ROWS(D$5:D55)>COUNTIF(Payments!$C$2:$C$100,$B$2),\"\",INDEX(Payments!C$2:C$100,SMALL(IF(Payments!$C$2:$C$100<>\"\",IF(Payments!$C$2:$C$100=$B$2,ROW($C$7:$C$105)-ROW($C$7)+1)),ROWS(D$5:D55))))","v":""},{"$f":"IF(ROWS(E$5:E55)>COUNTIF(Payments!$C$2:$C$100,$B$2),\"\",INDEX(Payments!D$2:D$100,SMALL(IF(Payments!$C$2:$C$100<>\"\",IF(Payments!$C$2:$C$100=$B$2,ROW($C$7:$C$105)-ROW($C$7)+1)),ROWS(E$5:E55))))","v":""},{"$f":"IF(ROWS(F$5:F55)>COUNTIF(Payments!$C$2:$C$100,$B$2),\"\",INDEX(Payments!E$2:E$100,SMALL(IF(Payments!$C$2:$C$100<>\"\",IF(Payments!$C$2:$C$100=$B$2,ROW($C$7:$C$105)-ROW($C$7)+1)),ROWS(F$5:F55))))","v":""},{"$f":"IF(ROWS(G$5:G55)>COUNTIF(Payments!$C$2:$C$100,$B$2),\"\",INDEX(Payments!F$2:F$100,SMALL(IF(Payments!$C$2:$C$100<>\"\",IF(Payments!$C$2:$C$100=$B$2,ROW($C$7:$C$105)-ROW($C$7)+1)),ROWS(G$5:G55))))","v":""}]
[null,{"$f":"IF(C56=\"\",\"\",MAX($B$4:B55)+1)","v":""},{"$f":"IF(ROWS(C$5:C56)>COUNTIF(Payments!$C$2:$C$100,$B$2),\"\",INDEX(Payments!B$2:B$100,SMALL(IF(Payments!$C$2:$C$100<>\"\",IF(Payments!$C$2:$C$100=$B$2,ROW($C$7:$C$105)-ROW($C$7)+1)),ROWS(C$5:C56))))","v":""},{"$f":"IF(ROWS(D$5:D56)>COUNTIF(Payments!$C$2:$C$100,$B$2),\"\",INDEX(Payments!C$2:C$100,SMALL(IF(Payments!$C$2:$C$100<>\"\",IF(Payments!$C$2:$C$100=$B$2,ROW($C$7:$C$105)-ROW($C$7)+1)),ROWS(D$5:D56))))","v":""},{"$f":"IF(ROWS(E$5:E56)>COUNTIF(Payments!$C$2:$C$100,$B$2),\"\",INDEX(Payments!D$2:D$100,SMALL(IF(Payments!$C$2:$C$100<>\"\",IF(Payments!$C$2:$C$100=$B$2,ROW($C$7:$C$105)-ROW($C$7)+1)),ROWS(E$5:E56))))","v":""},{"$f":"IF(ROWS(F$5:F56)>COUNTIF(Payments!$C$2:$C$100,$B$2),\"\",INDEX(Payments!E$2:E$100,SMALL(IF(Payments!$C$2:$C$100<>\"\",IF(Payments!$C$2:$C$100=$B$2,ROW($C$7:$C$105)-ROW($C$7)+1)),ROWS(F$5:F56))))","v":""},{"$f":"IF(ROWS(G$5:G56)>COUNTIF(Payments!$C$2:$C$100,$B$2),\"\",INDEX(Payments!F$2:F$100,SMALL(IF(Payments!$C$2:$C$100<>\"\",IF(Payments!$C$2:$C$100=$B$2,ROW($C$7:$C$105)-ROW($C$7)+1)),ROWS(G$5:G56))))","v":""}]
[null,{"$f":"IF(C57=\"\",\"\",MAX($B$4:B56)+1)","v":""},{"$f":"IF(ROWS(C$5:C57)>COUNTIF(Payments!$C$2:$C$100,$B$2),\"\",INDEX(Payments!B$2:B$100,SMALL(IF(Payments!$C$2:$C$100<>\"\",IF(Payments!$C$2:$C$100=$B$2,ROW($C$7:$C$105)-ROW($C$7)+1)),ROWS(C$5:C57))))","v":""},{"$f":"IF(ROWS(D$5:D57)>COUNTIF(Payments!$C$2:$C$100,$B$2),\"\",INDEX(Payments!C$2:C$100,SMALL(IF(Payments!$C$2:$C$100<>\"\",IF(Payments!$C$2:$C$100=$B$2,ROW($C$7:$C$105)-ROW($C$7)+1)),ROWS(D$5:D57))))","v":""},{"$f":"IF(ROWS(E$5:E57)>COUNTIF(Payments!$C$2:$C$100,$B$2),\"\",INDEX(Payments!D$2:D$100,SMALL(IF(Payments!$C$2:$C$100<>\"\",IF(Payments!$C$2:$C$100=$B$2,ROW($C$7:$C$105)-ROW($C$7)+1)),ROWS(E$5:E57))))","v":""},{"$f":"IF(ROWS(F$5:F57)>COUNTIF(Payments!$C$2:$C$100,$B$2),\"\",INDEX(Payments!E$2:E$100,SMALL(IF(Payments!$C$2:$C$100<>\"\",IF(Payments!$C$2:$C$100=$B$2,ROW($C$7:$C$105)-ROW($C$7)+1)),ROWS(F$5:F57))))","v":""},{"$f":"IF(ROWS(G$5:G57)>COUNTIF(Payments!$C$2:$C$100,$B$2),\"\",INDEX(Payments!F$2:F$100,SMALL(IF(Payments!$C$2:$C$100<>\"\",IF(Payments!$C$2:$C$100=$B$2,ROW($C$7:$C$105)-ROW($C$7)+1)),ROWS(G$5:G57))))","v":""}]
[null,{"$f":"IF(C58=\"\",\"\",MAX($B$4:B57)+1)","v":""},{"$f":"IF(ROWS(C$5:C58)>COUNTIF(Payments!$C$2:$C$100,$B$2),\"\",INDEX(Payments!B$2:B$100,SMALL(IF(Payments!$C$2:$C$100<>\"\",IF(Payments!$C$2:$C$100=$B$2,ROW($C$7:$C$105)-ROW($C$7)+1)),ROWS(C$5:C58))))","v":""},{"$f":"IF(ROWS(D$5:D58)>COUNTIF(Payments!$C$2:$C$100,$B$2),\"\",INDEX(Payments!C$2:C$100,SMALL(IF(Payments!$C$2:$C$100<>\"\",IF(Payments!$C$2:$C$100=$B$2,ROW($C$7:$C$105)-ROW($C$7)+1)),ROWS(D$5:D58))))","v":""},{"$f":"IF(ROWS(E$5:E58)>COUNTIF(Payments!$C$2:$C$100,$B$2),\"\",INDEX(Payments!D$2:D$100,SMALL(IF(Payments!$C$2:$C$100<>\"\",IF(Payments!$C$2:$C$100=$B$2,ROW($C$7:$C$105)-ROW($C$7)+1)),ROWS(E$5:E58))))","v":""},{"$f":"IF(ROWS(F$5:F58)>COUNTIF(Payments!$C$2:$C$100,$B$2),\"\",INDEX(Payments!E$2:E$100,SMALL(IF(Payments!$C$2:$C$100<>\"\",IF(Payments!$C$2:$C$100=$B$2,ROW($C$7:$C$105)-ROW($C$7)+1)),ROWS(F$5:F58))))","v":""},{"$f":"IF(ROWS(G$5:G58)>COUNTIF(Payments!$C$2:$C$100,$B$2),\"\",INDEX(Payments!F$2:F$100,SMALL(IF(Payments!$C$2:$C$100<>\"\",IF(Payments!$C$2:$C$100=$B$2,ROW($C$7:$C$105)-ROW($C$7)+1)),ROWS(G$5:G58))))","v":""}]
[null,{"$f":"IF(C59=\"\",\"\",MAX($B$4:B58)+1)","v":""},{"$f":"IF(ROWS(C$5:C59)>COUNTIF(Payments!$C$2:$C$100,$B$2),\"\",INDEX(Payments!B$2:B$100,SMALL(IF(Payments!$C$2:$C$100<>\"\",IF(Payments!$C$2:$C$100=$B$2,ROW($C$7:$C$105)-ROW($C$7)+1)),ROWS(C$5:C59))))","v":""},{"$f":"IF(ROWS(D$5:D59)>COUNTIF(Payments!$C$2:$C$100,$B$2),\"\",INDEX(Payments!C$2:C$100,SMALL(IF(Payments!$C$2:$C$100<>\"\",IF(Payments!$C$2:$C$100=$B$2,ROW($C$7:$C$105)-ROW($C$7)+1)),ROWS(D$5:D59))))","v":""},{"$f":"IF(ROWS(E$5:E59)>COUNTIF(Payments!$C$2:$C$100,$B$2),\"\",INDEX(Payments!D$2:D$100,SMALL(IF(Payments!$C$2:$C$100<>\"\",IF(Payments!$C$2:$C$100=$B$2,ROW($C$7:$C$105)-ROW($C$7)+1)),ROWS(E$5:E59))))","v":""},{"$f":"IF(ROWS(F$5:F59)>COUNTIF(Payments!$C$2:$C$100,$B$2),\"\",INDEX(Payments!E$2:E$100,SMALL(IF(Payments!$C$2:$C$100<>\"\",IF(Payments!$C$2:$C$100=$B$2,ROW($C$7:$C$105)-ROW($C$7)+1)),ROWS(F$5:F59))))","v":""},{"$f":"IF(ROWS(G$5:G59)>COUNTIF(Payments!$C$2:$C$100,$B$2),\"\",INDEX(Payments!F$2:F$100,SMALL(IF(Payments!$C$2:$C$100<>\"\",IF(Payments!$C$2:$C$100=$B$2,ROW($C$7:$C$105)-ROW($C$7)+1)),ROWS(G$5:G59))))","v":""}]
[null,{"$f":"IF(C60=\"\",\"\",MAX($B$4:B59)+1)","v":""},{"$f":"IF(ROWS(C$5:C60)>COUNTIF(Payments!$C$2:$C$100,$B$2),\"\",INDEX(Payments!B$2:B$100,SMALL(IF(Payments!$C$2:$C$100<>\"\",IF(Payments!$C$2:$C$100=$B$2,ROW($C$7:$C$105)-ROW($C$7)+1)),ROWS(C$5:C60))))","v":""},{"$f":"IF(ROWS(D$5:D60)>COUNTIF(Payments!$C$2:$C$100,$B$2),\"\",INDEX(Payments!C$2:C$100,SMALL(IF(Payments!$C$2:$C$100<>\"\",IF(Payments!$C$2:$C$100=$B$2,ROW($C$7:$C$105)-ROW($C$7)+1)),ROWS(D$5:D60))))","v":""},{"$f":"IF(ROWS(E$5:E60)>COUNTIF(Payments!$C$2:$C$100,$B$2),\"\",INDEX(Payments!D$2:D$100,SMALL(IF(Payments!$C$2:$C$100<>\"\",IF(Payments!$C$2:$C$100=$B$2,ROW($C$7:$C$105)-ROW($C$7)+1)),ROWS(E$5:E60))))","v":""},{"$f":"IF(ROWS(F$5:F60)>COUNTIF(Payments!$C$2:$C$100,$B$2),\"\",INDEX(Payments!E$2:E$100,SMALL(IF(Payments!$C$2:$C$100<>\"\",IF(Payments!$C$2:$C$100=$B$2,ROW($C$7:$C$105)-ROW($C$7)+1)),ROWS(F$5:F60))))","v":""},{"$f":"IF(ROWS(G$5:G60)>COUNTIF(Payments!$C$2:$C$100,$B$2),\"\",INDEX(Payments!F$2:F$100,SMALL(IF(Payments!$C$2:$C$100<>\"\",IF(Payments!$C$2:$C$100=$B$2,ROW($C$7:$C$105)-ROW($C$7)+1)),ROWS(G$5:G60))))","v":""}]
[null,{"$f":"IF(C61=\"\",\"\",MAX($B$4:B60)+1)","v":""},{"$f":"IF(ROWS(C$5:C61)>COUNTIF(Payments!$C$2:$C$100,$B$2),\"\",INDEX(Payments!B$2:B$100,SMALL(IF(Payments!$C$2:$C$100<>\"\",IF(Payments!$C$2:$C$100=$B$2,ROW($C$7:$C$105)-ROW($C$7)+1)),ROWS(C$5:C61))))","v":""},{"$f":"IF(ROWS(D$5:D61)>COUNTIF(Payments!$C$2:$C$100,$B$2),\"\",INDEX(Payments!C$2:C$100,SMALL(IF(Payments!$C$2:$C$100<>\"\",IF(Payments!$C$2:$C$100=$B$2,ROW($C$7:$C$105)-ROW($C$7)+1)),ROWS(D$5:D61))))","v":""},{"$f":"IF(ROWS(E$5:E61)>COUNTIF(Payments!$C$2:$C$100,$B$2),\"\",INDEX(Payments!D$2:D$100,SMALL(IF(Payments!$C$2:$C$100<>\"\",IF(Payments!$C$2:$C$100=$B$2,ROW($C$7:$C$105)-ROW($C$7)+1)),ROWS(E$5:E61))))","v":""},{"$f":"IF(ROWS(F$5:F61)>COUNTIF(Payments!$C$2:$C$100,$B$2),\"\",INDEX(Payments!E$2:E$100,SMALL(IF(Payments!$C$2:$C$100<>\"\",IF(Payments!$C$2:$C$100=$B$2,ROW($C$7:$C$105)-ROW($C$7)+1)),ROWS(F$5:F61))))","v":""},{"$f":"IF(ROWS(G$5:G61)>COUNTIF(Payments!$C$2:$C$100,$B$2),\"\",INDEX(Payments!F$2:F$100,SMALL(IF(Payments!$C$2:$C$100<>\"\",IF(Payments!$C$2:$C$100=$B$2,ROW($C$7:$C$105)-ROW($C$7)+1)),ROWS(G$5:G61))))","v":""}]
[null,{"$f":"IF(C62=\"\",\"\",MAX($B$4:B61)+1)","v":""},{"$f":"IF(ROWS(C$5:C62)>COUNTIF(Payments!$C$2:$C$100,$B$2),\"\",INDEX(Payments!B$2:B$100,SMALL(IF(Payments!$C$2:$C$100<>\"\",IF(Payments!$C$2:$C$100=$B$2,ROW($C$7:$C$105)-ROW($C$7)+1)),ROWS(C$5:C62))))","v":""},{"$f":"IF(ROWS(D$5:D62)>COUNTIF(Payments!$C$2:$C$100,$B$2),\"\",INDEX(Payments!C$2:C$100,SMALL(IF(Payments!$C$2:$C$100<>\"\",IF(Payments!$C$2:$C$100=$B$2,ROW($C$7:$C$105)-ROW($C$7)+1)),ROWS(D$5:D62))))","v":""},{"$f":"IF(ROWS(E$5:E62)>COUNTIF(Payments!$C$2:$C$100,$B$2),\"\",INDEX(Payments!D$2:D$100,SMALL(IF(Payments!$C$2:$C$100<>\"\",IF(Payments!$C$2:$C$100=$B$2,ROW($C$7:$C$105)-ROW($C$7)+1)),ROWS(E$5:E62))))","v":""},{"$f":"IF(ROWS(F$5:F62)>COUNTIF(Payments!$C$2:$C$100,$B$2),\"\",INDEX(Payments!E$2:E$100,SMALL(IF(Payments!$C$2:$C$100<>\"\",IF(Payments!$C$2:$C$100=$B$2,ROW($C$7:$C$105)-ROW($C$7)+1)),ROWS(F$5:F62))))","v":""},{"$f":"IF(ROWS(G$5:G62)>COUNTIF(Payments!$C$2:$C$100,$B$2),\"\",INDEX(Payments!F$2:F$100,SMALL(IF(Payments!$C$2:$C$100<>\"\",IF(Payments!$C$2:$C$100=$B$2,ROW($C$7:$C$105)-ROW($C$7)+1)),ROWS(G$5:G62))))","v":""}]
[null,{"$f":"IF(C63=\"\",\"\",MAX($B$4:B62)+1)","v":""},{"$f":"IF(ROWS(C$5:C63)>COUNTIF(Payments!$C$2:$C$100,$B$2),\"\",INDEX(Payments!B$2:B$100,SMALL(IF(Payments!$C$2:$C$100<>\"\",IF(Payments!$C$2:$C$100=$B$2,ROW($C$7:$C$105)-ROW($C$7)+1)),ROWS(C$5:C63))))","v":""},{"$f":"IF(ROWS(D$5:D63)>COUNTIF(Payments!$C$2:$C$100,$B$2),\"\",INDEX(Payments!C$2:C$100,SMALL(IF(Payments!$C$2:$C$100<>\"\",IF(Payments!$C$2:$C$100=$B$2,ROW($C$7:$C$105)-ROW($C$7)+1)),ROWS(D$5:D63))))","v":""},{"$f":"IF(ROWS(E$5:E63)>COUNTIF(Payments!$C$2:$C$100,$B$2),\"\",INDEX(Payments!D$2:D$100,SMALL(IF(Payments!$C$2:$C$100<>\"\",IF(Payments!$C$2:$C$100=$B$2,ROW($C$7:$C$105)-ROW($C$7)+1)),ROWS(E$5:E63))))","v":""},{"$f":"IF(ROWS(F$5:F63)>COUNTIF(Payments!$C$2:$C$100,$B$2),\"\",INDEX(Payments!E$2:E$100,SMALL(IF(Payments!$C$2:$C$100<>\"\",IF(Payments!$C$2:$C$100=$B$2,ROW($C$7:$C$105)-ROW($C$7)+1)),ROWS(F$5:F63))))","v":""},{"$f":"IF(ROWS(G$5:G63)>COUNTIF(Payments!$C$2:$C$100,$B$2),\"\",INDEX(Payments!F$2:F$100,SMALL(IF(Payments!$C$2:$C$100<>\"\",IF(Payments!$C$2:$C$100=$B$2,ROW($C$7:$C$105)-ROW($C$7)+1)),ROWS(G$5:G63))))","v":""}]
[null,{"$f":"IF(C64=\"\",\"\",MAX($B$4:B63)+1)","v":""},{"$f":"IF(ROWS(C$5:C64)>COUNTIF(Payments!$C$2:$C$100,$B$2),\"\",INDEX(Payments!B$2:B$100,SMALL(IF(Payments!$C$2:$C$100<>\"\",IF(Payments!$C$2:$C$100=$B$2,ROW($C$7:$C$105)-ROW($C$7)+1)),ROWS(C$5:C64))))","v":""},{"$f":"IF(ROWS(D$5:D64)>COUNTIF(Payments!$C$2:$C$100,$B$2),\"\",INDEX(Payments!C$2:C$100,SMALL(IF(Payments!$C$2:$C$100<>\"\",IF(Payments!$C$2:$C$100=$B$2,ROW($C$7:$C$105)-ROW($C$7)+1)),ROWS(D$5:D64))))","v":""},{"$f":"IF(ROWS(E$5:E64)>COUNTIF(Payments!$C$2:$C$100,$B$2),\"\",INDEX(Payments!D$2:D$100,SMALL(IF(Payments!$C$2:$C$100<>\"\",IF(Payments!$C$2:$C$100=$B$2,ROW($C$7:$C$105)-ROW($C$7)+1)),ROWS(E$5:E64))))","v":""},{"$f":"IF(ROWS(F$5:F64)>COUNTIF(Payments!$C$2:$C$100,$B$2),\"\",INDEX(Payments!E$2:E$100,SMALL(IF(Payments!$C$2:$C$100<>\"\",IF(Payments!$C$2:$C$100=$B$2,ROW($C$7:$C$105)-ROW($C$7)+1)),ROWS(F$5:F64))))","v":""},{"$f":"IF(ROWS(G$5:G64)>COUNTIF(Payments!$C$2:$C$100,$B$2),\"\",INDEX(Payments!F$2:F$100,SMALL(IF(Payments!$C$2:$C$100<>\"\",IF(Payments!$C$2:$C$100=$B$2,ROW($C$7:$C$105)-ROW($C$7)+1)),ROWS(G$5:G64))))","v":""}]
[null,{"$f":"IF(C65=\"\",\"\",MAX($B$4:B64)+1)","v":""},{"$f":"IF(ROWS(C$5:C65)>COUNTIF(Payments!$C$2:$C$100,$B$2),\"\",INDEX(Payments!B$2:B$100,SMALL(IF(Payments!$C$2:$C$100<>\"\",IF(Payments!$C$2:$C$100=$B$2,ROW($C$7:$C$105)-ROW($C$7)+1)),ROWS(C$5:C65))))","v":""},{"$f":"IF(ROWS(D$5:D65)>COUNTIF(Payments!$C$2:$C$100,$B$2),\"\",INDEX(Payments!C$2:C$100,SMALL(IF(Payments!$C$2:$C$100<>\"\",IF(Payments!$C$2:$C$100=$B$2,ROW($C$7:$C$105)-ROW($C$7)+1)),ROWS(D$5:D65))))","v":""},{"$f":"IF(ROWS(E$5:E65)>COUNTIF(Payments!$C$2:$C$100,$B$2),\"\",INDEX(Payments!D$2:D$100,SMALL(IF(Payments!$C$2:$C$100<>\"\",IF(Payments!$C$2:$C$100=$B$2,ROW($C$7:$C$105)-ROW($C$7)+1)),ROWS(E$5:E65))))","v":""},{"$f":"IF(ROWS(F$5:F65)>COUNTIF(Payments!$C$2:$C$100,$B$2),\"\",INDEX(Payments!E$2:E$100,SMALL(IF(Payments!$C$2:$C$100<>\"\",IF(Payments!$C$2:$C$100=$B$2,ROW($C$7:$C$105)-ROW($C$7)+1)),ROWS(F$5:F65))))","v":""},{"$f":"IF(ROWS(G$5:G65)>COUNTIF(Payments!$C$2:$C$100,$B$2),\"\",INDEX(Payments!F$2:F$100,SMALL(IF(Payments!$C$2:$C$100<>\"\",IF(Payments!$C$2:$C$100=$B$2,ROW($C$7:$C$105)-ROW($C$7)+1)),ROWS(G$5:G65))))","v":""}]
[null,{"$f":"IF(C66=\"\",\"\",MAX($B$4:B65)+1)","v":""},{"$f":"IF(ROWS(C$5:C66)>COUNTIF(Payments!$C$2:$C$100,$B$2),\"\",INDEX(Payments!B$2:B$100,SMALL(IF(Payments!$C$2:$C$100<>\"\",IF(Payments!$C$2:$C$100=$B$2,ROW($C$7:$C$105)-ROW($C$7)+1)),ROWS(C$5:C66))))","v":""},{"$f":"IF(ROWS(D$5:D66)>COUNTIF(Payments!$C$2:$C$100,$B$2),\"\",INDEX(Payments!C$2:C$100,SMALL(IF(Payments!$C$2:$C$100<>\"\",IF(Payments!$C$2:$C$100=$B$2,ROW($C$7:$C$105)-ROW($C$7)+1)),ROWS(D$5:D66))))","v":""},{"$f":"IF(ROWS(E$5:E66)>COUNTIF(Payments!$C$2:$C$100,$B$2),\"\",INDEX(Payments!D$2:D$100,SMALL(IF(Payments!$C$2:$C$100<>\"\",IF(Payments!$C$2:$C$100=$B$2,ROW($C$7:$C$105)-ROW($C$7)+1)),ROWS(E$5:E66))))","v":""},{"$f":"IF(ROWS(F$5:F66)>COUNTIF(Payments!$C$2:$C$100,$B$2),\"\",INDEX(Payments!E$2:E$100,SMALL(IF(Payments!$C$2:$C$100<>\"\",IF(Payments!$C$2:$C$100=$B$2,ROW($C$7:$C$105)-ROW($C$7)+1)),ROWS(F$5:F66))))","v":""},{"$f":"IF(ROWS(G$5:G66)>COUNTIF(Payments!$C$2:$C$100,$B$2),\"\",INDEX(Payments!F$2:F$100,SMALL(IF(Payments!$C$2:$C$100<>\"\",IF(Payments!$C$2:$C$100=$B$2,ROW($C$7:$C$105)-ROW($C$7)+1)),ROWS(G$5:G66))))","v":""}]
[null,{"$f":"IF(C67=\"\",\"\",MAX($B$4:B66)+1)","v":""},{"$f":"IF(ROWS(C$5:C67)>COUNTIF(Payments!$C$2:$C$100,$B$2),\"\",INDEX(Payments!B$2:B$100,SMALL(IF(Payments!$C$2:$C$100<>\"\",IF(Payments!$C$2:$C$100=$B$2,ROW($C$7:$C$105)-ROW($C$7)+1)),ROWS(C$5:C67))))","v":""},{"$f":"IF(ROWS(D$5:D67)>COUNTIF(Payments!$C$2:$C$100,$B$2),\"\",INDEX(Payments!C$2:C$100,SMALL(IF(Payments!$C$2:$C$100<>\"\",IF(Payments!$C$2:$C$100=$B$2,ROW($C$7:$C$105)-ROW($C$7)+1)),ROWS(D$5:D67))))","v":""},{"$f":"IF(ROWS(E$5:E67)>COUNTIF(Payments!$C$2:$C$100,$B$2),\"\",INDEX(Payments!D$2:D$100,SMALL(IF(Payments!$C$2:$C$100<>\"\",IF(Payments!$C$2:$C$100=$B$2,ROW($C$7:$C$105)-ROW($C$7)+1)),ROWS(E$5:E67))))","v":""},{"$f":"IF(ROWS(F$5:F67)>COUNTIF(Payments!$C$2:$C$100,$B$2),\"\",INDEX(Payments!E$2:E$100,SMALL(IF(Payments!$C$2:$C$100<>\"\",IF(Payments!$C$2:$C$100=$B$2,ROW($C$7:$C$105)-ROW($C$7)+1)),ROWS(F$5:F67))))","v":""},{"$f":"IF(ROWS(G$5:G67)>COUNTIF(Payments!$C$2:$C$100,$B$2),\"\",INDEX(Payments!F$2:F$100,SMALL(IF(Payments!$C$2:$C$100<>\"\",IF(Payments!$C$2:$C$100=$B$2,ROW($C$7:$C$105)-ROW($C$7)+1)),ROWS(G$5:G67))))","v":""}]
[]
[]
[null,null,null,null,null,null,null,null,{"$f":"SUM(I2:I69)","v":0}]

{"sheet":"Payments","index":3,"n_rows":1199,"n_cols":6,"rows_kept":1199,"cut":false,"hidden":false,"merged":[]}
["م","Date","الموقع","المستفيد","المبلغ","التفاصيل"]
[{"$f":"IF(B2=\"\",\"\",MAX($A$1:A1)+1)","v":1},"2020-12-13","جريده الوطن","محمد علي",2000,"السور الخارجي"]
[{"$f":"IF(B3=\"\",\"\",MAX($A$1:A2)+1)","v":2},"2020-12-13","نادي الفروسيه","محمد علي",3000,"توصيلات كهرباء"]
[{"$f":"IF(B4=\"\",\"\",MAX($A$1:A3)+1)","v":3},"2020-12-13","نادي الفروسيه","النور احمد",10000,"تركيب طاقه شمسيه"]
[{"$f":"IF(B5=\"\",\"\",MAX($A$1:A4)+1)","v":4},"2020-12-13","مدرسه السلامه","محمد علي",60000,"اناره الميدان"]
[{"$f":"IF(B6=\"\",\"\",MAX($A$1:A5)+1)","v":5},"2020-12-14","نادي الفروسيه","محمد علي",1000,"المسبح"]
[{"$f":"IF(B7=\"\",\"\",MAX($A$1:A6)+1)","v":6},"2020-12-15","جريده الوطن","محمد علي",1001,"المسبح"]
[{"$f":"IF(B8=\"\",\"\",MAX($A$1:A7)+1)","v":7},"2020-12-13","جريده الوطن","محمد علي",2000,"السور الخارجي"]
[{"$f":"IF(B9=\"\",\"\",MAX($A$1:A8)+1)","v":8},"2020-12-13","نادي الفروسيه","محمد علي",3000,"توصيلات كهرباء"]
[{"$f":"IF(B10=\"\",\"\",MAX($A$1:A9)+1)","v":9},"2020-12-13","نادي الفروسيه","النور احمد",10000,"تركيب طاقه شمسيه"]
[{"$f":"IF(B11=\"\",\"\",MAX($A$1:A10)+1)","v":10},"2020-12-13","مدرسه السلامه","محمد علي",60000,"اناره الميدان"]
[{"$f":"IF(B12=\"\",\"\",MAX($A$1:A11)+1)","v":11},"2020-12-14","نادي الفروسيه","محمد علي",1000,"المسبح"]
[{"$f":"IF(B13=\"\",\"\",MAX($A$1:A12)+1)","v":12},"2020-12-15","جريده الوطن","النور احمد",1001,"المسبح"]
[{"$f":"IF(B14=\"\",\"\",MAX($A$1:A13)+1)","v":13},"2020-12-16","جريده الوطن","Officena",2000,"السور الخارجي"]
[{"$f":"IF(B15=\"\",\"\",MAX($A$1:A14)+1)","v":14},"2020-12-13","نادي الفروسيه","Officena",3000,"توصيلات كهرباء"]
[{"$f":"IF(B16=\"\",\"\",MAX($A$1:A15)+1)","v":15},"2020-12-13","نادي الفروسيه","Officena",10000,"تركيب طاقه شمسيه"]
[{"$f":"IF(B17=\"\",\"\",MAX($A$1:A16)+1)","v":16},"2020-12-13","مدرسه السلامه","Officena",60000,"اناره الميدان"]
[{"$f":"IF(B18=\"\",\"\",MAX($A$1:A17)+1)","v":17},"2020-12-14","نادي الفروسيه","Officena",1000,"المسبح"]
[{"$f":"IF(B19=\"\",\"\",MAX($A$1:A18)+1)","v":18},"2020-12-15","جريده الوطن","Officena",1001,"المسبح"]
[{"$f":"IF(B20=\"\",\"\",MAX($A$1:A19)+1)","v":""}]
[{"$f":"IF(B21=\"\",\"\",MAX($A$1:A20)+1)","v":""}]
[{"$f":"IF(B22=\"\",\"\",MAX($A$1:A21)+1)","v":""}]
[{"$f":"IF(B23=\"\",\"\",MAX($A$1:A22)+1)","v":""}]
[{"$f":"IF(B24=\"\",\"\",MAX($A$1:A23)+1)","v":""}]
[{"$f":"IF(B25=\"\",\"\",MAX($A$1:A24)+1)","v":""}]
[{"$f":"IF(B26=\"\",\"\",MAX($A$1:A25)+1)","v":""}]
[{"$f":"IF(B27=\"\",\"\",MAX($A$1:A26)+1)","v":""}]
[{"$f":"IF(B28=\"\",\"\",MAX($A$1:A27)+1)","v":""}]
[{"$f":"IF(B29=\"\",\"\",MAX($A$1:A28)+1)","v":""}]
[{"$f":"IF(B30=\"\",\"\",MAX($A$1:A29)+1)","v":""}]
[{"$f":"IF(B31=\"\",\"\",MAX($A$1:A30)+1)","v":""}]
[{"$f":"IF(B32=\"\",\"\",MAX($A$1:A31)+1)","v":""}]
[{"$f":"IF(B33=\"\",\"\",MAX($A$1:A32)+1)","v":""}]
[{"$f":"IF(B34=\"\",\"\",MAX($A$1:A33)+1)","v":""}]
[{"$f":"IF(B35=\"\",\"\",MAX($A$1:A34)+1)","v":""}]
[{"$f":"IF(B36=\"\",\"\",MAX($A$1:A35)+1)","v":""}]
[{"$f":"IF(B37=\"\",\"\",MAX($A$1:A36)+1)","v":""}]
[{"$f":"IF(B38=\"\",\"\",MAX($A$1:A37)+1)","v":""}]
[{"$f":"IF(B39=\"\",\"\",MAX($A$1:A38)+1)","v":""}]
[{"$f":"IF(B40=\"\",\"\",MAX($A$1:A39)+1)","v":""}]
[{"$f":"IF(B41=\"\",\"\",MAX($A$1:A40)+1)","v":""}]
[{"$f":"IF(B42=\"\",\"\",MAX($A$1:A41)+1)","v":""}]
[{"$f":"IF(B43=\"\",\"\",MAX($A$1:A42)+1)","v":""}]
[{"$f":"IF(B44=\"\",\"\",MAX($A$1:A43)+1)","v":""}]
[{"$f":"IF(B45=\"\",\"\",MAX($A$1:A44)+1)","v":""}]
[{"$f":"IF(B46=\"\",\"\",MAX($A$1:A45)+1)","v":""}]
[{"$f":"IF(B47=\"\",\"\",MAX($A$1:A46)+1)","v":""}]
[{"$f":"IF(B48=\"\",\"\",MAX($A$1:A47)+1)","v":""}]
[{"$f":"IF(B49=\"\",\"\",MAX($A$1:A48)+1)","v":""}]
[{"$f":"IF(B50=\"\",\"\",MAX($A$1:A49)+1)","v":""}]
[{"$f":"IF(B51=\"\",\"\",MAX($A$1:A50)+1)","v":""}]
[{"$f":"IF(B52=\"\",\"\",MAX($A$1:A51)+1)","v":""}]
[{"$f":"IF(B53=\"\",\"\",MAX($A$1:A52)+1)","v":""}]
[{"$f":"IF(B54=\"\",\"\",MAX($A$1:A53)+1)","v":""}]
[{"$f":"IF(B55=\"\",\"\",MAX($A$1:A54)+1)","v":""}]
[{"$f":"IF(B56=\"\",\"\",MAX($A$1:A55)+1)","v":""}]
[{"$f":"IF(B57=\"\",\"\",MAX($A$1:A56)+1)","v":""}]
[{"$f":"IF(B58=\"\",\"\",MAX($A$1:A57)+1)","v":""}]
[{"$f":"IF(B59=\"\",\"\",MAX($A$1:A58)+1)","v":""}]
[{"$f":"IF(B60=\"\",\"\",MAX($A$1:A59)+1)","v":""}]
[{"$f":"IF(B61=\"\",\"\",MAX($A$1:A60)+1)","v":""}]
[{"$f":"IF(B62=\"\",\"\",MAX($A$1:A61)+1)","v":""}]
[{"$f":"IF(B63=\"\",\"\",MAX($A$1:A62)+1)","v":""}]
[{"$f":"IF(B64=\"\",\"\",MAX($A$1:A63)+1)","v":""}]
[{"$f":"IF(B65=\"\",\"\",MAX($A$1:A64)+1)","v":""}]
[{"$f":"IF(B66=\"\",\"\",MAX($A$1:A65)+1)","v":""}]
[{"$f":"IF(B67=\"\",\"\",MAX($A$1:A66)+1)","v":""}]
[{"$f":"IF(B68=\"\",\"\",MAX($A$1:A67)+1)","v":""}]
[{"$f":"IF(B69=\"\",\"\",MAX($A$1:A68)+1)","v":""}]
[{"$f":"IF(B70=\"\",\"\",MAX($A$1:A69)+1)","v":""}]
[{"$f":"IF(B71=\"\",\"\",MAX($A$1:A70)+1)","v":""}]
[{"$f":"IF(B72=\"\",\"\",MAX($A$1:A71)+1)","v":""}]
[{"$f":"IF(B73=\"\",\"\",MAX($A$1:A72)+1)","v":""}]
[{"$f":"IF(B74=\"\",\"\",MAX($A$1:A73)+1)","v":""}]
[{"$f":"IF(B75=\"\",\"\",MAX($A$1:A74)+1)","v":""}]
[{"$f":"IF(B76=\"\",\"\",MAX($A$1:A75)+1)","v":""}]
[{"$f":"IF(B77=\"\",\"\",MAX($A$1:A76)+1)","v":""}]
[{"$f":"IF(B78=\"\",\"\",MAX($A$1:A77)+1)","v":""}]
[{"$f":"IF(B79=\"\",\"\",MAX($A$1:A78)+1)","v":""}]
[{"$f":"IF(B80=\"\",\"\",MAX($A$1:A79)+1)","v":""}]
[{"$f":"IF(B81=\"\",\"\",MAX($A$1:A80)+1)","v":""}]
[{"$f":"IF(B82=\"\",\"\",MAX($A$1:A81)+1)","v":""}]
[{"$f":"IF(B83=\"\",\"\",MAX($A$1:A82)+1)","v":""}]
[{"$f":"IF(B84=\"\",\"\",MAX($A$1:A83)+1)","v":""}]
[{"$f":"IF(B85=\"\",\"\",MAX($A$1:A84)+1)","v":""}]
[{"$f":"IF(B86=\"\",\"\",MAX($A$1:A85)+1)","v":""}]
[{"$f":"IF(B87=\"\",\"\",MAX($A$1:A86)+1)","v":""}]
[{"$f":"IF(B88=\"\",\"\",MAX($A$1:A87)+1)","v":""}]
[{"$f":"IF(B89=\"\",\"\",MAX($A$1:A88)+1)","v":""}]
[{"$f":"IF(B90=\"\",\"\",MAX($A$1:A89)+1)","v":""}]
[{"$f":"IF(B91=\"\",\"\",MAX($A$1:A90)+1)","v":""}]
[{"$f":"IF(B92=\"\",\"\",MAX($A$1:A91)+1)","v":""}]
[{"$f":"IF(B93=\"\",\"\",MAX($A$1:A92)+1)","v":""}]
[{"$f":"IF(B94=\"\",\"\",MAX($A$1:A93)+1)","v":""}]
[{"$f":"IF(B95=\"\",\"\",MAX($A$1:A94)+1)","v":""}]
[{"$f":"IF(B96=\"\",\"\",MAX($A$1:A95)+1)","v":""}]
[{"$f":"IF(B97=\"\",\"\",MAX($A$1:A96)+1)","v":""}]
[{"$f":"IF(B98=\"\",\"\",MAX($A$1:A97)+1)","v":""}]
[{"$f":"IF(B99=\"\",\"\",MAX($A$1:A98)+1)","v":""}]
[{"$f":"IF(B100=\"\",\"\",MAX($A$1:A99)+1)","v":""}]
[{"$f":"IF(B101=\"\",\"\",MAX($A$1:A100)+1)","v":""}]
[{"$f":"IF(B102=\"\",\"\",MAX($A$1:A101)+1)","v":""}]
[{"$f":"IF(B103=\"\",\"\",MAX($A$1:A102)+1)","v":""}]
[{"$f":"IF(B104=\"\",\"\",MAX($A$1:A103)+1)","v":""}]
[{"$f":"IF(B105=\"\",\"\",MAX($A$1:A104)+1)","v":""}]
[{"$f":"IF(B106=\"\",\"\",MAX($A$1:A105)+1)","v":""}]
[{"$f":"IF(B107=\"\",\"\",MAX($A$1:A106)+1)","v":""}]
[{"$f":"IF(B108=\"\",\"\",MAX($A$1:A107)+1)","v":""}]
[{"$f":"IF(B109=\"\",\"\",MAX($A$1:A108)+1)","v":""}]
[{"$f":"IF(B110=\"\",\"\",MAX($A$1:A109)+1)","v":""}]
[{"$f":"IF(B111=\"\",\"\",MAX($A$1:A110)+1)","v":""}]
[{"$f":"IF(B112=\"\",\"\",MAX($A$1:A111)+1)","v":""}]
[{"$f":"IF(B113=\"\",\"\",MAX($A$1:A112)+1)","v":""}]
[{"$f":"IF(B114=\"\",\"\",MAX($A$1:A113)+1)","v":""}]
[{"$f":"IF(B115=\"\",\"\",MAX($A$1:A114)+1)","v":""}]
[{"$f":"IF(B116=\"\",\"\",MAX($A$1:A115)+1)","v":""}]
[{"$f":"IF(B117=\"\",\"\",MAX($A$1:A116)+1)","v":""}]
[{"$f":"IF(B118=\"\",\"\",MAX($A$1:A117)+1)","v":""}]
[{"$f":"IF(B119=\"\",\"\",MAX($A$1:A118)+1)","v":""}]
[{"$f":"IF(B120=\"\",\"\",MAX($A$1:A119)+1)","v":""}]
[{"$f":"IF(B121=\"\",\"\",MAX($A$1:A120)+1)","v":""}]
[{"$f":"IF(B122=\"\",\"\",MAX($A$1:A121)+1)","v":""}]
[{"$f":"IF(B123=\"\",\"\",MAX($A$1:A122)+1)","v":""}]
[{"$f":"IF(B124=\"\",\"\",MAX($A$1:A123)+1)","v":""}]
[{"$f":"IF(B125=\"\",\"\",MAX($A$1:A124)+1)","v":""}]
[{"$f":"IF(B126=\"\",\"\",MAX($A$1:A125)+1)","v":""}]
[{"$f":"IF(B127=\"\",\"\",MAX($A$1:A126)+1)","v":""}]
[{"$f":"IF(B128=\"\",\"\",MAX($A$1:A127)+1)","v":""}]
[{"$f":"IF(B129=\"\",\"\",MAX($A$1:A128)+1)","v":""}]
[{"$f":"IF(B130=\"\",\"\",MAX($A$1:A129)+1)","v":""}]
[{"$f":"IF(B131=\"\",\"\",MAX($A$1:A130)+1)","v":""}]
[{"$f":"IF(B132=\"\",\"\",MAX($A$1:A131)+1)","v":""}]
[{"$f":"IF(B133=\"\",\"\",MAX($A$1:A132)+1)","v":""}]
[{"$f":"IF(B134=\"\",\"\",MAX($A$1:A133)+1)","v":""}]
[{"$f":"IF(B135=\"\",\"\",MAX($A$1:A134)+1)","v":""}]
[{"$f":"IF(B136=\"\",\"\",MAX($A$1:A135)+1)","v":""}]
[{"$f":"IF(B137=\"\",\"\",MAX($A$1:A136)+1)","v":""}]
[{"$f":"IF(B138=\"\",\"\",MAX($A$1:A137)+1)","v":""}]
[{"$f":"IF(B139=\"\",\"\",MAX($A$1:A138)+1)","v":""}]
[{"$f":"IF(B140=\"\",\"\",MAX($A$1:A139)+1)","v":""}]
[{"$f":"IF(B141=\"\",\"\",MAX($A$1:A140)+1)","v":""}]
[{"$f":"IF(B142=\"\",\"\",MAX($A$1:A141)+1)","v":""}]
[{"$f":"IF(B143=\"\",\"\",MAX($A$1:A142)+1)","v":""}]
[{"$f":"IF(B144=\"\",\"\",MAX($A$1:A143)+1)","v":""}]
[{"$f":"IF(B145=\"\",\"\",MAX($A$1:A144)+1)","v":""}]
[{"$f":"IF(B146=\"\",\"\",MAX($A$1:A145)+1)","v":""}]
[{"$f":"IF(B147=\"\",\"\",MAX($A$1:A146)+1)","v":""}]
[{"$f":"IF(B148=\"\",\"\",MAX($A$1:A147)+1)","v":""}]
[{"$f":"IF(B149=\"\",\"\",MAX($A$1:A148)+1)","v":""}]
[{"$f":"IF(B150=\"\",\"\",MAX($A$1:A149)+1)","v":""}]
[{"$f":"IF(B151=\"\",\"\",MAX($A$1:A150)+1)","v":""}]
[{"$f":"IF(B152=\"\",\"\",MAX($A$1:A151)+1)","v":""}]
[{"$f":"IF(B153=\"\",\"\",MAX($A$1:A152)+1)","v":""}]
[{"$f":"IF(B154=\"\",\"\",MAX($A$1:A153)+1)","v":""}]
[{"$f":"IF(B155=\"\",\"\",MAX($A$1:A154)+1)","v":""}]
[{"$f":"IF(B156=\"\",\"\",MAX($A$1:A155)+1)","v":""}]
[{"$f":"IF(B157=\"\",\"\",MAX($A$1:A156)+1)","v":""}]
[{"$f":"IF(B158=\"\",\"\",MAX($A$1:A157)+1)","v":""}]
[{"$f":"IF(B159=\"\",\"\",MAX($A$1:A158)+1)","v":""}]
[{"$f":"IF(B160=\"\",\"\",MAX($A$1:A159)+1)","v":""}]
[{"$f":"IF(B161=\"\",\"\",MAX($A$1:A160)+1)","v":""}]
[{"$f":"IF(B162=\"\",\"\",MAX($A$1:A161)+1)","v":""}]
[{"$f":"IF(B163=\"\",\"\",MAX($A$1:A162)+1)","v":""}]
[{"$f":"IF(B164=\"\",\"\",MAX($A$1:A163)+1)","v":""}]
[{"$f":"IF(B165=\"\",\"\",MAX($A$1:A164)+1)","v":""}]
[{"$f":"IF(B166=\"\",\"\",MAX($A$1:A165)+1)","v":""}]
[{"$f":"IF(B167=\"\",\"\",MAX($A$1:A166)+1)","v":""}]
[{"$f":"IF(B168=\"\",\"\",MAX($A$1:A167)+1)","v":""}]
[{"$f":"IF(B169=\"\",\"\",MAX($A$1:A168)+1)","v":""}]
[{"$f":"IF(B170=\"\",\"\",MAX($A$1:A169)+1)","v":""}]
[{"$f":"IF(B171=\"\",\"\",MAX($A$1:A170)+1)","v":""}]
[{"$f":"IF(B172=\"\",\"\",MAX($A$1:A171)+1)","v":""}]
[{"$f":"IF(B173=\"\",\"\",MAX($A$1:A172)+1)","v":""}]
[{"$f":"IF(B174=\"\",\"\",MAX($A$1:A173)+1)","v":""}]
[{"$f":"IF(B175=\"\",\"\",MAX($A$1:A174)+1)","v":""}]
[{"$f":"IF(B176=\"\",\"\",MAX($A$1:A175)+1)","v":""}]
[{"$f":"IF(B177=\"\",\"\",MAX($A$1:A176)+1)","v":""}]
[{"$f":"IF(B178=\"\",\"\",MAX($A$1:A177)+1)","v":""}]
[{"$f":"IF(B179=\"\",\"\",MAX($A$1:A178)+1)","v":""}]
[{"$f":"IF(B180=\"\",\"\",MAX($A$1:A179)+1)","v":""}]
[{"$f":"IF(B181=\"\",\"\",MAX($A$1:A180)+1)","v":""}]
[{"$f":"IF(B182=\"\",\"\",MAX($A$1:A181)+1)","v":""}]
[{"$f":"IF(B183=\"\",\"\",MAX($A$1:A182)+1)","v":""}]
[{"$f":"IF(B184=\"\",\"\",MAX($A$1:A183)+1)","v":""}]
[{"$f":"IF(B185=\"\",\"\",MAX($A$1:A184)+1)","v":""}]
[{"$f":"IF(B186=\"\",\"\",MAX($A$1:A185)+1)","v":""}]
[{"$f":"IF(B187=\"\",\"\",MAX($A$1:A186)+1)","v":""}]
[{"$f":"IF(B188=\"\",\"\",MAX($A$1:A187)+1)","v":""}]
[{"$f":"IF(B189=\"\",\"\",MAX($A$1:A188)+1)","v":""}]
[{"$f":"IF(B190=\"\",\"\",MAX($A$1:A189)+1)","v":""}]
[{"$f":"IF(B191=\"\",\"\",MAX($A$1:A190)+1)","v":""}]
[{"$f":"IF(B192=\"\",\"\",MAX($A$1:A191)+1)","v":""}]
[{"$f":"IF(B193=\"\",\"\",MAX($A$1:A192)+1)","v":""}]
[{"$f":"IF(B194=\"\",\"\",MAX($A$1:A193)+1)","v":""}]
[{"$f":"IF(B195=\"\",\"\",MAX($A$1:A194)+1)","v":""}]
[{"$f":"IF(B196=\"\",\"\",MAX($A$1:A195)+1)","v":""}]
[{"$f":"IF(B197=\"\",\"\",MAX($A$1:A196)+1)","v":""}]
[{"$f":"IF(B198=\"\",\"\",MAX($A$1:A197)+1)","v":""}]
[{"$f":"IF(B199=\"\",\"\",MAX($A$1:A198)+1)","v":""}]
[{"$f":"IF(B200=\"\",\"\",MAX($A$1:A199)+1)","v":""}]
[{"$f":"IF(B201=\"\",\"\",MAX($A$1:A200)+1)","v":""}]
[{"$f":"IF(B202=\"\",\"\",MAX($A$1:A201)+1)","v":""}]
[]
[]
[]
[]
[]
[]
[]
[]
[]
[]
[]
[]
[]
[]
[]
[]
[]
[]
[]
[]
[]
[]
[]
[]
[]
[]
[]
[]
[]
[]
[]
[]
[]
[]
[]
[]
[]
[]
[]
[]
[]
[]
[]
[]
[]
[]
[]
[]
[]
[]
[]
[]
[]
[]
[]
[]
[]
[]
[]
[]
[]
[]
[]
[]
[]
[]
[]
[]
[]
[]
[]
[]
[]
[]
[]
[]
[]
[]
[]
[]
[]
[]
[]
[]
[]
[]
[]
[]
[]
[]
[]
[]
[]
[]
[]
[]
[]
[]
[]
[]
[]
[]
[]
[]
[]
[]
[]
[]
[]
[]
[]
[]
[]
[]
[]
[]
[]
[]
[]
[]
[]
[]
[]
[]
[]
[]
[]
[]
[]
[]
[]
[]
[]
[]
[]
[]
[]
[]
[]
[]
[]
[]
[]
[]
[]
[]
[]
[]
[]
[]
[]
[]
[]
[]
[]
[]
[]
[]
[]
[]
[]
[]
[]
[]
[]
[]
[]
[]
[]
[]
[]
[]
[]
[]
[]
[]
[]
[]
[]
[]
[]
[]
[]
[]
[]
[]
[]
[]
[]
[]
[]
[]
[]
[]
[]
[]
[]
[]
[]
[]
[]
[]
[]
[]
[]
[]
[]
[]
[]
[]
[]
[]
[]
[]
[]
[]
[]
[]
[]
[]
[]
[]
[]
[]
[]
[]
[]
[]
[]
[]
[]
[]
[]
[]
[]
[]
[]
[]
[]
[]
[]
[]
[]
[]
[]
[]
[]
[]
[]
[]
[]
[]
[]
[]
[]
[]
[]
[]
[]
[]
[]
[]
[]
[]
[]
[]
[]
[]
[]
[]
[]
[]
[]
[]
[]
[]
[]
[]
[]
[]
[]
[]
[]
[]
[]
[]
[]
[]
[]
[]
[]
[]
[]
[]
[]
[]
[]
[]
[]
[]
[]
[]
[]
[]
[]
[]
[]
[]
[]
[]
[]
[]
[]
[]
[]
[]
[]
[]
[]
[]
[]
[]
[]
[]
[]
[]
[]
[]
[]
[]
[]
[]
[]
[]
[]
[]
[]
[]
[]
[]
[]
[]
[]
[]
[]
[]
[]
[]
[]
[]
[]
[]
[]
[]
[]
[]
[]
[]
[]
[]
[]
[]
[]
[]
[]
[]
[]
[]
[]
[]
[]
[]
[]
[]
[]
[]
[]
[]
[]
[]
[]
[]
[]
[]
[]
[]
[]
[]
[]
[]
[]
[]
[]
[]
[]
[]
[]
[]
[]
[]
[]
[]
[]
[]
[]
[]
[]
[]
[]
[]
[]
[]
[]
[]
[]
[]
[]
[]
[]
[]
[]
[]
[]
[]
[]
[]
[]
[]
[]
[]
[]
[]
[]
[]
[]
[]
[]
[]
[]
[]
[]
[]
[]
[]
[]
[]
[]
[]
[]
[]
[]
[]
[]
[]
[]
[]
[]
[]
[]
[]
[]
[]
[]
[]
[]
[]
[]
[]
[]
[]
[]
[]
[]
[]
[]
[]
[]
[]
[]
[]
[]
[]
[]
[]
[]
[]
[]
[]
[]
[]
[]
[]
[]
[]
[]
[]
[]
[]
[]
[]
[]
[]
[]
[]
[]
[]
[]
[]
[]
[]
[]
[]
[]
[]
[]
[]
[]
[]
[]
[]
[]
[]
[]
[]
[]
[]
[]
[]
[]
[]
[]
[]
[]
[]
[]
[]
[]
[]
[]
[]
[]
[]
[]
[]
[]
[]
[]
[]
[]
[]
[]
[]
[]
[]
[]
[]
[]
[]
[]
[]
[]
[]
[]
[]
[]
[]
[]
[]
[]
[]
[]
[]
[]
[]
[]
[]
[]
[]
[]
[]
[]
[]
[]
[]
[]
[]
[]
[]
[]
[]
[]
[]
[]
[]
[]
[]
[]
[]
[]
[]
[]
[]
[]
[]
[]
[]
[]
[]
[]
[]
[]
[]
[]
[]
[]
[]
[]
[]
[]
[]
[]
[]
[]
[]
[]
[]
[]
[]
[]
[]
[]
[]
[]
[]
[]
[]
[]
[]
[]
[]
[]
[]
[]
[]
[]
[]
[]
[]
[]
[]
[]
[]
[]
[]
[]
[]
[]
[]
[]
[]
[]
[]
[]
[]
[]
[]
[]
[]
[]
[]
[]
[]
[]
[]
[]
[]
[]
[]
[]
[]
[]
[]
[]
[]
[]
[]
[]
[]
[]
[]
[]
[]
[]
[]
[]
[]
[]
[]
[]
[]
[]
[]
[]
[]
[]
[]
[]
[]
[]
[]
[]
[]
[]
[]
[]
[]
[]
[]
[]
[]
[]
[]
[]
[]
[]
[]
[]
[]
[]
[]
[]
[]
[]
[]
[]
[]
[]
[]
[]
[]
[]
[]
[]
[]
[]
[]
[]
[]
[]
[]
[]
[]
[]
[]
[]
[]
[]
[]
[]
[]
[]
[]
[]
[]
[]
[]
[]
[]
[]
[]
[]
[]
[]
[]
[]
[]
[]
[]
[]
[]
[]
[]
[]
[]
[]
[]
[]
[]
[]
[]
[]
[]
[]
[]
[]
[]
[]
[]
[]
[]
[]
[]
[]
[]
[]
[]
[]
[]
[]
[]
[]
[]
[]
[]
[]
[]
[]
[]
[]
[]
[]
[]
[]
[]
[]
[]
[]
[]
[]
[]
[]
[]
[]
[]
[]
[]
[]
[]
[]
[]
[]
[]
[]
[]
[]
[]
[]
[]
[]
[]
[]
[]
[]
[]
[]
[]
[]
[]
[]
[]
[]
[]
[]
[]
[]
[]
[]
[]
[]
[]
[]
[]
[]
[]
[]
[]
[]
[]
[]
[]
[]
[]
[]
[]
[]
[]
[]
[]
[]
[]
[]
[]
[]
[]
[]
[]
[]
[]
[]
[]
[]
[]
[]
[]
[]
[]
[]
[]
[]
[]
[]
[]
[]
[]
[]
[]
[]
[]
[]
[]
[]
[]
[]
[]
[]
[]
[]
[]
[]
[]
[]
[]
[]
[]
[]
[]
[]
[]
[]
[]
[]
[]
[]
[]
[]
[]
[]
[]
[]
[]
[]
[]
[]
[]
[]
[]
[]
[]
[]
[]
[]
[]
[]
[]
[]
[]
[]
[]
[]
[]
[]
[]
[]
[]
[]
[]
[]
[]
[]
[]
[]
[]
[]
[]
[]
[]
[]
[]
[]
[]
[]
[]
[]
[]
[]
[]
[null,null,null,null,{"$f":"SUM(E2:E1198)","v":231003}]

{"sheet":"One For_All","index":4,"n_rows":13,"n_cols":11,"rows_kept":13,"cut":false,"hidden":false,"merged":[]}
[null,null,null,"الموقع","المستفيد",null,"Chose Here",null,null,"for filter by الموقع","D"]
[null,null,null,"نادي الفروسيه","Officena",null,"D",null,null,"for filter by المستفيد","E"]
[null,null,null,null,null,null,null,null,null,"for filter by الموقع andالمستفيد","D+E"]
[null,null,"م","Date","الموقع","المستفيد","المبلغ","التفاصيل"]
[null,null,1,"2020-12-13","نادي الفروسيه","محمد علي",3000,"توصيلات كهرباء"]
[null,null,2,"2020-12-13","نادي الفروسيه","النور احمد",10000,"تركيب طاقه شمسيه"]
[null,null,3,"2020-12-14","نادي الفروسيه","محمد علي",1000,"المسبح"]
[null,null,4,"2020-12-13","نادي الفروسيه","محمد علي",3000,"توصيلات كهرباء"]
[null,null,5,"2020-12-13","نادي الفروسيه","النور احمد",10000,"تركيب طاقه شمسيه"]
[null,null,6,"2020-12-14","نادي الفروسيه","محمد علي",1000,"المسبح"]
[null,null,7,"2020-12-13","نادي الفروسيه","Officena",3000,"توصيلات كهرباء"]
[null,null,8,"2020-12-13","نادي الفروسيه","Officena",10000,"تركيب طاقه شمسيه"]
[null,null,9,"2020-12-14","نادي الفروسيه","Officena",1000,"المسبح"]