{"text_format":"1","workbook":"xlsx","n_sheets":5,"sheets":["جريده الوطن","نادي الفروسيه","مدرسه السلامه","Payments","One For_All"],"not_rendered":{"charts":0,"images":0,"macros":1,"external_links":6,"defined_names":45,"comments":0,"pivot_tables":0},"unopened":[],"bounds":{"document_bytes":16777216,"sheet_cells":100000,"rows_first":2000,"rows_last":500,"rows_between":2000,"halvings":0,"cell_chars":16384,"cell_head_chars":4096},"cells_cut":0,"cells_raw":0,"read":"whole","date_system":"1900"}

{"sheet":"جريده الوطن","index":0,"n_rows":70,"n_cols":10,"rows_kept":70,"cut":false,"hidden":false,"merged":[]}
[null,null,null,null,null,"Sum",null,"المستفيد","المبلغ","المشروع"]
["الموقع","جريده الوطن",null,null,null,{"$f":"SUM(F5:F67)","v":9003}]
["تاريخ بدء العمل"]
[null,"م","Date","الموقع","المستفيد","المبلغ","التفاصيل"]
[null,{"$f":"IF(C5=\"\",\"\",MAX($B$4:B4)+1)","v":1},{"$f":"IF(ROWS(C$5:C5)>COUNTIF(Payments!$C$2:$C$100,$B$2),\"\",INDEX(Payments!B$2:B$100,SMALL(IF(Payments!$C$2:$C$100<>\"\",IF(Payments!$C$2:$C$100=$B$2,ROW($C$7:$C$105)-ROW($C$7)+1)),ROWS(C$5:C5))))","v":"2020-12-13"},{"$f":"IF(ROWS(D$5:D5)>COUNTIF(Payments!$C$2:$C$100,$B$2),\"\",INDEX(Payments!C$2:C$100,SMALL(IF(Payments!$C$2:$C$100<>\"\",IF(Payments!$C$2:$C$100=$B$2,ROW($C$7:$C$105)-ROW($C$7)+1)),ROWS(D$5:D5))))","v":"جريده الوطن"},{"$f":"IF(ROWS(E$5:E5)>COUNTIF(Payments!$C$2:$C$100,$B$2),\"\",INDEX(Payments!D$2:D$100,SMALL(IF(Payments!$C$2:$C$100<>\"\",IF(Payments!$C$2:$C$100=$B$2,ROW($C$7:$C$105)-ROW($C$7)+1)),ROWS(E$5:E5))))","v":"محمد علي"},{"$f":"IF(ROWS(F$5:F5)>COUNTIF(Payments!$C$2:$C$100,$B$2),\"\",INDEX(Payments!E$2:E$100,SMALL(IF(Payments!$C$2:$C$100<>\"\",IF(Payments!$C$2:$C$100=$B$2,ROW($C$7:$C$105)-ROW($C$7)+1)),ROWS(F$5:F5))))","v":2000},{"$f":"IF(ROWS(G$5:G5)>COUNTIF(Payments!$C$2:$C$100,$B$2),\"\",INDEX(Payments!F$2:F$100,SMALL(IF(Payments!$C$2:$C$100<>\"\",IF(Payments!$C$2:$C$100=$B$2,ROW($C$7:$C$105)-ROW($C$7)+1)),ROWS(G$5:G5))))","v":"السور الخارجي"}]
[null,{"$f":"IF(C6=\"\",\"\",MAX($B$4:B5)+1)","v":2},{"$f":"IF(ROWS(C$5:C6)>COUNTIF(Payments!$C$2:$C$100,$B$2),\"\",INDEX(Payments!B$2:B$100,SMALL(IF(Payments!$C$2:$C$100<>\"\",IF(Payments!$C$2:$C$100=$B$2,ROW($C$7:$C$105)-ROW($C$7)+1)),ROWS(C$5:C6))))","v":"2020-12-15"},{"$f":"IF(ROWS(D$5:D6)>COUNTIF(Payments!$C$2:$C$100,$B$2),\"\",INDEX(Payments!C$2:C$100,SMALL(IF(Payments!$C$2:$C$100<>\"\",IF(Payments!$C$2:$C$100=$B$2,ROW($C$7:$C$105)-ROW($C$7)+1)),ROWS(D$5:D6))))","v":"جريده الوطن"},{"$f":"IF(ROWS(E$5:E6)>COUNTIF(Payments!$C$2:$C$100,$B$2),\"\",INDEX(Payments!D$2:D$100,SMALL(IF(Payments!$C$2:$C$100<>\"\",IF(Payments!$C$2:$C$100=$B$2,ROW($C$7:$C$105)-ROW($C$7)+1)),ROWS(E$5:E6))))","v":"محمد علي"},{"$f":"IF(ROWS(F$5:F6)>COUNTIF(Payments!$C$2:$C$100,$B$2),\"\",INDEX(Payments!E$2:E$100,SMALL(IF(Payments!$C$2:$C$100<>\"\",IF(Payments!$C$2:$C$100=$B$2,ROW($C$7:$C$105)-ROW($C$7)+1)),ROWS(F$5:F6))))","v":"1902-09-27"},{"$f":"IF(ROWS(G$5:G6)>COUNTIF(Payments!$C$2:$C$100,$B$2),\"\",INDEX(Payments!F$2:F$100,SMALL(IF(Payments!$C$2:$C$100<>\"\",IF(Payments!$C$2:$C$100=$B$2,ROW($C$7:$C$105)-ROW($C$7)+1)),ROWS(G$5:G6))))","v":"المسبح"}]
[null,{"$f":"IF(C7=\"\",\"\",MAX($B$4:B6)+1)","v":3},{"$f":"IF(ROWS(C$5:C7)>COUNTIF(Payments!$C$2:$C$100,$B$2),\"\",INDEX(Payments!B$2:B$100,SMALL(IF(Payments!$C$2:$C$100<>\"\",IF(Payments!$C$2:$C$100=$B$2,ROW($C$7:$C$105)-ROW($C$7)+1)),ROWS(C$5:C7))))","v":"2020-12-13"},{"$f":"IF(ROWS(D$5:D7)>COUNTIF(Payments!$C$2:$C$100,$B$2),\"\",INDEX(Payments!C$2:C$100,SMALL(IF(Payments!$C$2:$C$100<>\"\",IF(Payments!$C$2:$C$100=$B$2,ROW($C$7:$C$105)-ROW($C$7)+1)),ROWS(D$5:D7))))","v":"جريده الوطن"},{"$f":"IF(ROWS(E$5:E7)>COUNTIF(Payments!$C$2:$C$100,$B$2),\"\",INDEX(Payments!D$2:D$100,SMALL(IF(Payments!$C$2:$C$100<>\"\",IF(Payments!$C$2:$C$100=$B$2,ROW($C$7:$C$105)-ROW($C$7)+1)),ROWS(E$5:E7))))","v":"محمد علي"},{"$f":"IF(ROWS(F$5:F7)>COUNTIF(Payments!$C$2:$C$100,$B$2),\"\",INDEX(Payments!E$2:E$100,SMALL(IF(Payments!$C$2:$C$100<>\"\",IF(Payments!$C$2:$C$100=$B$2,ROW($C$7:$C$105)-ROW($C$7)+1)),ROWS(F$5:F7))))","v":"1905-06-22"},{"$f":"IF(ROWS(G$5:G7)>COUNTIF(Payments!$C$2:$C$100,$B$2),\"\",INDEX(Payments!F$2:F$100,SMALL(IF(Payments!$C$2:$C$100<>\"\",IF(Payments!$C$2:$C$100=$B$2,ROW($C$7:$C$105)-ROW($C$7)+1)),ROWS(G$5:G7))))","v":"السور الخارجي"}]
[null,{"$f":"IF(C8=\"\",\"\",MAX($B$4:B7)+1)","v":4},{"$f":"IF(ROWS(C$5:C8)>COUNTIF(Payments!$C$2:$C$100,$B$2),\"\",INDEX(Payments!B$2:B$100,SMALL(IF(Payments!$C$2:$C$100<>\"\",IF(Payments!$C$2:$C$100=$B$2,ROW($C$7:$C$105)-ROW($C$7)+1)),ROWS(C$5:C8))))","v":"2020-12-15"},{"$f":"IF(ROWS(D$5:D8)>COUNTIF(Payments!$C$2:$C$100,$B$2),\"\",INDEX(Payments!C$2:C$100,SMALL(IF(Payments!$C$2:$C$100<>\"\",IF(Payments!$C$2:$C$100=$B$2,ROW($C$7:$C$105)-ROW($C$7)+1)),ROWS(D$5:D8))))","v":"جريده الوطن"},{"$f":"IF(ROWS(E$5:E8)>COUNTIF(Payments!$C$2:$C$100,$B$2),\"\",INDEX(Payments!D$2:D$100,SMALL(IF(Payments!$C$2:$C$100<>\"\",IF(Payments!$C$2:$C$100=$B$2,ROW($C$7:$C$105)-ROW($C$7)+1)),ROWS(E$5:E8))))","v":"النور احمد"},{"$f":"IF(ROWS(F$5:F8)>COUNTIF(Payments!$C$2:$C$100,$B$2),\"\",INDEX(Payments!E$2:E$100,SMALL(IF(Payments!$C$2:$C$100<>\"\",IF(Payments!$C$2:$C$100=$B$2,ROW($C$7:$C$105)-ROW($C$7)+1)),ROWS(F$5:F8))))","v":"1902-09-27"},{"$f":"IF(ROWS(G$5:G8)>COUNTIF(Payments!$C$2:$C$100,$B$2),\"\",INDEX(Payments!F$2:F$100,SMALL(IF(Payments!$C$2:$C$100<>\"\",IF(Payments!$C$2:$C$100=$B$2,ROW($C$7:$C$105)-ROW($C$7)+1)),ROWS(G$5:G8))))","v":"المسبح"}]
[null,{"$f":"IF(C9=\"\",\"\",MAX($B$4:B8)+1)","v":5},{"$f":"IF(ROWS(C$5:C9)>COUNTIF(Payments!$C$2:$C$100,$B$2),\"\",INDEX(Payments!B$2:B$100,SMALL(IF(Payments!$C$2:$C$100<>\"\",IF(Payments!$C$2:$C$100=$B$2,ROW($C$7:$C$105)-ROW($C$7)+1)),ROWS(C$5:C9))))","v":"2020-12-16"},{"$f":"IF(ROWS(D$5:D9)>COUNTIF(Payments!$C$2:$C$100,$B$2),\"\",INDEX(Payments!C$2:C$100,SMALL(IF(Payments!$C$2:$C$100<>\"\",IF(Payments!$C$2:$C$100=$B$2,ROW($C$7:$C$105)-ROW($C$7)+1)),ROWS(D$5:D9))))","v":"جريده الوطن"},{"$f":"IF(ROWS(E$5:E9)>COUNTIF(Payments!$C$2:$C$100,$B$2),\"\",INDEX(Payments!D$2:D$100,SMALL(IF(Payments!$C$2:$C$100<>\"\",IF(Payments!$C$2:$C$100=$B$2,ROW($C$7:$C$105)-ROW($C$7)+1)),ROWS(E$5:E9))))","v":"Officena"},{"$f":"IF(ROWS(F$5:F9)>COUNTIF(Payments!$C$2:$C$100,$B$2),\"\",INDEX(Payments!E$2:E$100,SMALL(IF(Payments!$C$2:$C$100<>\"\",IF(Payments!$C$2:$C$100=$B$2,ROW($C$7:$C$105)-ROW($C$7)+1)),ROWS(F$5:F9))))","v":"1905-06-22"},{"$f":"IF(ROWS(G$5:G9)>COUNTIF(Payments!$C$2:$C$100,$B$2),\"\",INDEX(Payments!F$2:F$100,SMALL(IF(Payments!$C$2:$C$100<>\"\",IF(Payments!$C$2:$C$100=$B$2,ROW($C$7:$C$105)-ROW($C$7)+1)),ROWS(G$5:G9))))","v":"السور الخارجي"}]
[null,{"$f":"IF(C10=\"\",\"\",MAX($B$4:B9)+1)","v":6},{"$f":"IF(ROWS(C$5:C10)>COUNTIF(Payments!$C$2:$C$100,$B$2),\"\",INDEX(Payments!B$2:B$100,SMALL(IF(Payments!$C$2:$C$100<>\"\",IF(Payments!$C$2:$C$100=$B$2,ROW($C$7:$C$105)-ROW($C$7)+1)),ROWS(C$5:C10))))","v":"2020-12-15"},{"$f":"IF(ROWS(D$5:D10)>COUNTIF(Payments!$C$2:$C$100,$B$2),\"\",INDEX(Payments!C$2:C$100,SMALL(IF(Payments!$C$2:$C$100<>\"\",IF(Payments!$C$2:$C$100=$B$2,ROW($C$7:$C$105)-ROW($C$7)+1)),ROWS(D$5:D10))))","v":"جريده الوطن"},{"$f":"IF(ROWS(E$5:E10)>COUNTIF(Payments!$C$2:$C$100,$B$2),\"\",INDEX(Payments!D$2:D$100,SMALL(IF(Payments!$C$2:$C$100<>\"\",IF(Payments!$C$2:$C$100=$B$2,ROW($C$7:$C$105)-ROW($C$7)+1)),ROWS(E$5:E10))))","v":"Officena"},{"$f":"IF(ROWS(F$5:F10)>COUNTIF(Payments!$C$2:$C$100,$B$2),\"\",INDEX(Payments!E$2:E$100,SMALL(IF(Payments!$C$2:$C$100<>\"\",IF(Payments!$C$2:$C$100=$B$2,ROW($C$7:$C$105)-ROW($C$7)+1)),ROWS(F$5:F10))))","v":"1902-09-27"},{"$f":"IF(ROWS(G$5:G10)>COUNTIF(Payments!$C$2:$C$100,$B$2),\"\",INDEX(Payments!F$2:F$100,SMALL(IF(Payments!$C$2:$C$100<>\"\",IF(Payments!$C$2:$C$100=$B$2,ROW($C$7:$C$105)-ROW($C$7)+1)),ROWS(G$5:G10))))","v":"المسبح"}]
{"$rows_left_out":61}
{"sheet":"نادي الفروسيه","index":1,"n_rows":70,"n_cols":10,"rows_kept":70,"cut":false,"hidden":false,"merged":[]}
[null,null,null,null,null,"Sum",null,"المستفيد","المبلغ","المشروع"]
[null,"نادي الفروسيه",null,null,null,{"$f":"SUM(F5:F67)","v":42000}]
[]
[null,"م","Date","الموقع","المستفيد","المبلغ","التفاصيل"]
[null,{"$f":"IF(C5=\"\",\"\",MAX($B$4:B4)+1)","v":1},{"$f":"IF(ROWS(C$5:C5)>COUNTIF(Payments!$C$2:$C$100,$B$2),\"\",INDEX(Payments!B$2:B$100,SMALL(IF(Payments!$C$2:$C$100<>\"\",IF(Payments!$C$2:$C$100=$B$2,ROW($C$7:$C$105)-ROW($C$7)+1)),ROWS(C$5:C5))))","v":"2020-12-13"},{"$f":"IF(ROWS(D$5:D5)>COUNTIF(Payments!$C$2:$C$100,$B$2),\"\",INDEX(Payments!C$2:C$100,SMALL(IF(Payments!$C$2:$C$100<>\"\",IF(Payments!$C$2:$C$100=$B$2,ROW($C$7:$C$105)-ROW($C$7)+1)),ROWS(D$5:D5))))","v":"نادي الفروسيه"},{"$f":"IF(ROWS(E$5:E5)>COUNTIF(Payments!$C$2:$C$100,$B$2),\"\",INDEX(Payments!D$2:D$100,SMALL(IF(Payments!$C$2:$C$100<>\"\",IF(Payments!$C$2:$C$100=$B$2,ROW($C$7:$C$105)-ROW($C$7)+1)),ROWS(E$5:E5))))","v":"محمد علي"},{"$f":"IF(ROWS(F$5:F5)>COUNTIF(Payments!$C$2:$C$100,$B$2),\"\",INDEX(Payments!E$2:E$100,SMALL(IF(Payments!$C$2:$C$100<>\"\",IF(Payments!$C$2:$C$100=$B$2,ROW($C$7:$C$105)-ROW($C$7)+1)),ROWS(F$5:F5))))","v":3000},{"$f":"IF(ROWS(G$5:G5)>COUNTIF(Payments!$C$2:$C$100,$B$2),\"\",INDEX(Payments!F$2:F$100,SMALL(IF(Payments!$C$2:$C$100<>\"\",IF(Payments!$C$2:$C$100=$B$2,ROW($C$7:$C$105)-ROW($C$7)+1)),ROWS(G$5:G5))))","v":"توصيلات كهرباء"}]
[null,{"$f":"IF(C6=\"\",\"\",MAX($B$4:B5)+1)","v":2},{"$f":"IF(ROWS(C$5:C6)>COUNTIF(Payments!$C$2:$C$100,$B$2),\"\",INDEX(Payments!B$2:B$100,SMALL(IF(Payments!$C$2:$C$100<>\"\",IF(Payments!$C$2:$C$100=$B$2,ROW($C$7:$C$105)-ROW($C$7)+1)),ROWS(C$5:C6))))","v":"2020-12-13"},{"$f":"IF(ROWS(D$5:D6)>COUNTIF(Payments!$C$2:$C$100,$B$2),\"\",INDEX(Payments!C$2:C$100,SMALL(IF(Payments!$C$2:$C$100<>\"\",IF(Payments!$C$2:$C$100=$B$2,ROW($C$7:$C$105)-ROW($C$7)+1)),ROWS(D$5:D6))))","v":"نادي الفروسيه"},{"$f":"IF(ROWS(E$5:E6)>COUNTIF(Payments!$C$2:$C$100,$B$2),\"\",INDEX(Payments!D$2:D$100,SMALL(IF(Payments!$C$2:$C$100<>\"\",IF(Payments!$C$2:$C$100=$B$2,ROW($C$7:$C$105)-ROW($C$7)+1)),ROWS(E$5:E6))))","v":"النور احمد"},{"$f":"IF(ROWS(F$5:F6)>COUNTIF(Payments!$C$2:$C$100,$B$2),\"\",INDEX(Payments!E$2:E$100,SMALL(IF(Payments!$C$2:$C$100<>\"\",IF(Payments!$C$2:$C$100=$B$2,ROW($C$7:$C$105)-ROW($C$7)+1)),ROWS(F$5:F6))))","v":10000},{"$f":"IF(ROWS(G$5:G6)>COUNTIF(Payments!$C$2:$C$100,$B$2),\"\",INDEX(Payments!F$2:F$100,SMALL(IF(Payments!$C$2:$C$100<>\"\",IF(Payments!$C$2:$C$100=$B$2,ROW($C$7:$C$105)-ROW($C$7)+1)),ROWS(G$5:G6))))","v":"تركيب طاقه شمسيه"}]
[null,{"$f":"IF(C7=\"\",\"\",MAX($B$4:B6)+1)","v":3},{"$f":"IF(ROWS(C$5:C7)>COUNTIF(Payments!$C$2:$C$100,$B$2),\"\",INDEX(Payments!B$2:B$100,SMALL(IF(Payments!$C$2:$C$100<>\"\",IF(Payments!$C$2:$C$100=$B$2,ROW($C$7:$C$105)-ROW($C$7)+1)),ROWS(C$5:C7))))","v":"2020-12-14"},{"$f":"IF(ROWS(D$5:D7)>COUNTIF(Payments!$C$2:$C$100,$B$2),\"\",INDEX(Payments!C$2:C$100,SMALL(IF(Payments!$C$2:$C$100<>\"\",IF(Payments!$C$2:$C$100=$B$2,ROW($C$7:$C$105)-ROW($C$7)+1)),ROWS(D$5:D7))))","v":"نادي الفروسيه"},{"$f":"IF(ROWS(E$5:E7)>COUNTIF(Payments!$C$2:$C$100,$B$2),\"\",INDEX(Payments!D$2:D$100,SMALL(IF(Payments!$C$2:$C$100<>\"\",IF(Payments!$C$2:$C$100=$B$2,ROW($C$7:$C$105)-ROW($C$7)+1)),ROWS(E$5:E7))))","v":"محمد علي"},{"$f":"IF(ROWS(F$5:F7)>COUNTIF(Payments!$C$2:$C$100,$B$2),\"\",INDEX(Payments!E$2:E$100,SMALL(IF(Payments!$C$2:$C$100<>\"\",IF(Payments!$C$2:$C$100=$B$2,ROW($C$7:$C$105)-ROW($C$7)+1)),ROWS(F$5:F7))))","v":1000},{"$f":"IF(ROWS(G$5:G7)>COUNTIF(Payments!$C$2:$C$100,$B$2),\"\",INDEX(Payments!F$2:F$100,SMALL(IF(Payments!$C$2:$C$100<>\"\",IF(Payments!$C$2:$C$100=$B$2,ROW($C$7:$C$105)-ROW($C$7)+1)),ROWS(G$5:G7))))","v":"المسبح"}]
[null,{"$f":"IF(C8=\"\",\"\",MAX($B$4:B7)+1)","v":4},{"$f":"IF(ROWS(C$5:C8)>COUNTIF(Payments!$C$2:$C$100,$B$2),\"\",INDEX(Payments!B$2:B$100,SMALL(IF(Payments!$C$2:$C$100<>\"\",IF(Payments!$C$2:$C$100=$B$2,ROW($C$7:$C$105)-ROW($C$7)+1)),ROWS(C$5:C8))))","v":"2020-12-13"},{"$f":"IF(ROWS(D$5:D8)>COUNTIF(Payments!$C$2:$C$100,$B$2),\"\",INDEX(Payments!C$2:C$100,SMALL(IF(Payments!$C$2:$C$100<>\"\",IF(Payments!$C$2:$C$100=$B$2,ROW($C$7:$C$105)-ROW($C$7)+1)),ROWS(D$5:D8))))","v":"نادي الفروسيه"},{"$f":"IF(ROWS(E$5:E8)>COUNTIF(Payments!$C$2:$C$100,$B$2),\"\",INDEX(Payments!D$2:D$100,SMALL(IF(Payments!$C$2:$C$100<>\"\",IF(Payments!$C$2:$C$100=$B$2,ROW($C$7:$C$105)-ROW($C$7)+1)),ROWS(E$5:E8))))","v":"محمد علي"},{"$f":"IF(ROWS(F$5:F8)>COUNTIF(Payments!$C$2:$C$100,$B$2),\"\",INDEX(Payments!E$2:E$100,SMALL(IF(Payments!$C$2:$C$100<>\"\",IF(Payments!$C$2:$C$100=$B$2,ROW($C$7:$C$105)-ROW($C$7)+1)),ROWS(F$5:F8))))","v":3000},{"$f":"IF(ROWS(G$5:G8)>COUNTIF(Payments!$C$2:$C$100,$B$2),\"\",INDEX(Payments!F$2:F$100,SMALL(IF(Payments!$C$2:$C$100<>\"\",IF(Payments!$C$2:$C$100=$B$2,ROW($C$7:$C$105)-ROW($C$7)+1)),ROWS(G$5:G8))))","v":"توصيلات كهرباء"}]
[null,{"$f":"IF(C9=\"\",\"\",MAX($B$4:B8)+1)","v":5},{"$f":"IF(ROWS(C$5:C9)>COUNTIF(Payments!$C$2:$C$100,$B$2),\"\",INDEX(Payments!B$2:B$100,SMALL(IF(Payments!$C$2:$C$100<>\"\",IF(Payments!$C$2:$C$100=$B$2,ROW($C$7:$C$105)-ROW($C$7)+1)),ROWS(C$5:C9))))","v":"2020-12-13"},{"$f":"IF(ROWS(D$5:D9)>COUNTIF(Payments!$C$2:$C$100,$B$2),\"\",INDEX(Payments!C$2:C$100,SMALL(IF(Payments!$C$2:$C$100<>\"\",IF(Payments!$C$2:$C$100=$B$2,ROW($C$7:$C$105)-ROW($C$7)+1)),ROWS(D$5:D9))))","v":"نادي الفروسيه"},{"$f":"IF(ROWS(E$5:E9)>COUNTIF(Payments!$C$2:$C$100,$B$2),\"\",INDEX(Payments!D$2:D$100,SMALL(IF(Payments!$C$2:$C$100<>\"\",IF(Payments!$C$2:$C$100=$B$2,ROW($C$7:$C$105)-ROW($C$7)+1)),ROWS(E$5:E9))))","v":"النور احمد"},{"$f":"IF(ROWS(F$5:F9)>COUNTIF(Payments!$C$2:$C$100,$B$2),\"\",INDEX(Payments!E$2:E$100,SMALL(IF(Payments!$C$2:$C$100<>\"\",IF(Payments!$C$2:$C$100=$B$2,ROW($C$7:$C$105)-ROW($C$7)+1)),ROWS(F$5:F9))))","v":10000},{"$f":"IF(ROWS(G$5:G9)>COUNTIF(Payments!$C$2:$C$100,$B$2),\"\",INDEX(Payments!F$2:F$100,SMALL(IF(Payments!$C$2:$C$100<>\"\",IF(Payments!$C$2:$C$100=$B$2,ROW($C$7:$C$105)-ROW($C$7)+1)),ROWS(G$5:G9))))","v":"تركيب طاقه شمسيه"}]
[null,{"$f":"IF(C10=\"\",\"\",MAX($B$4:B9)+1)","v":6},{"$f":"IF(ROWS(C$5:C10)>COUNTIF(Payments!$C$2:$C$100,$B$2),\"\",INDEX(Payments!B$2:B$100,SMALL(IF(Payments!$C$2:$C$100<>\"\",IF(Payments!$C$2:$C$100=$B$2,ROW($C$7:$C$105)-ROW($C$7)+1)),ROWS(C$5:C10))))","v":"2020-12-14"},{"$f":"IF(ROWS(D$5:D10)>COUNTIF(Payments!$C$2:$C$100,$B$2),\"\",INDEX(Payments!C$2:C$100,SMALL(IF(Payments!$C$2:$C$100<>\"\",IF(Payments!$C$2:$C$100=$B$2,ROW($C$7:$C$105)-ROW($C$7)+1)),ROWS(D$5:D10))))","v":"نادي الفروسيه"},{"$f":"IF(ROWS(E$5:E10)>COUNTIF(Payments!$C$2:$C$100,$B$2),\"\",INDEX(Payments!D$2:D$100,SMALL(IF(Payments!$C$2:$C$100<>\"\",IF(Payments!$C$2:$C$100=$B$2,ROW($C$7:$C$105)-ROW($C$7)+1)),ROWS(E$5:E10))))","v":"محمد علي"},{"$f":"IF(ROWS(F$5:F10)>COUNTIF(Payments!$C$2:$C$100,$B$2),\"\",INDEX(Payments!E$2:E$100,SMALL(IF(Payments!$C$2:$C$100<>\"\",IF(Payments!$C$2:$C$100=$B$2,ROW($C$7:$C$105)-ROW($C$7)+1)),ROWS(F$5:F10))))","v":1000},{"$f":"IF(ROWS(G$5:G10)>COUNTIF(Payments!$C$2:$C$100,$B$2),\"\",INDEX(Payments!F$2:F$100,SMALL(IF(Payments!$C$2:$C$100<>\"\",IF(Payments!$C$2:$C$100=$B$2,ROW($C$7:$C$105)-ROW($C$7)+1)),ROWS(G$5:G10))))","v":"المسبح"}]
{"$rows_left_out":61}
{"sheet":"مدرسه السلامه","index":2,"n_rows":70,"n_cols":10,"rows_kept":70,"cut":false,"hidden":false,"merged":[]}
[null,null,null,null,null,"Sum",null,"المستفيد","المبلغ","المشروع"]
[null,"مدرسه السلامه",null,null,null,{"$f":"SUM(F5:F67)","v":180000}]
[]
[null,"م","Date","الموقع","المستفيد","المبلغ","التفاصيل"]
[null,{"$f":"IF(C5=\"\",\"\",MAX($B$4:B4)+1)","v":1},{"$f":"IF(ROWS(C$5:C5)>COUNTIF(Payments!$C$2:$C$100,$B$2),\"\",INDEX(Payments!B$2:B$100,SMALL(IF(Payments!$C$2:$C$100<>\"\",IF(Payments!$C$2:$C$100=$B$2,ROW($C$7:$C$105)-ROW($C$7)+1)),ROWS(C$5:C5))))","v":"2020-12-13"},{"$f":"IF(ROWS(D$5:D5)>COUNTIF(Payments!$C$2:$C$100,$B$2),\"\",INDEX(Payments!C$2:C$100,SMALL(IF(Payments!$C$2:$C$100<>\"\",IF(Payments!$C$2:$C$100=$B$2,ROW($C$7:$C$105)-ROW($C$7)+1)),ROWS(D$5:D5))))","v":"مدرسه السلامه"},{"$f":"IF(ROWS(E$5:E5)>COUNTIF(Payments!$C$2:$C$100,$B$2),\"\",INDEX(Payments!D$2:D$100,SMALL(IF(Payments!$C$2:$C$100<>\"\",IF(Payments!$C$2:$C$100=$B$2,ROW($C$7:$C$105)-ROW($C$7)+1)),ROWS(E$5:E5))))","v":"محمد علي"},{"$f":"IF(ROWS(F$5:F5)>COUNTIF(Payments!$C$2:$C$100,$B$2),\"\",INDEX(Payments!E$2:E$100,SMALL(IF(Payments!$C$2:$C$100<>\"\",IF(Payments!$C$2:$C$100=$B$2,ROW($C$7:$C$105)-ROW($C$7)+1)),ROWS(F$5:F5))))","v":60000},{"$f":"IF(ROWS(G$5:G5)>COUNTIF(Payments!$C$2:$C$100,$B$2),\"\",INDEX(Payments!F$2:F$100,SMALL(IF(Payments!$C$2:$C$100<>\"\",IF(Payments!$C$2:$C$100=$B$2,ROW($C$7:$C$105)-ROW($C$7)+1)),ROWS(G$5:G5))))","v":"اناره الميدان"}]
[null,{"$f":"IF(C6=\"\",\"\",MAX($B$4:B5)+1)","v":2},{"$f":"IF(ROWS(C$5:C6)>COUNTIF(Payments!$C$2:$C$100,$B$2),\"\",INDEX(Payments!B$2:B$100,SMALL(IF(Payments!$C$2:$C$100<>\"\",IF(Payments!$C$2:$C$100=$B$2,ROW($C$7:$C$105)-ROW($C$7)+1)),ROWS(C$5:C6))))","v":"2020-12-13"},{"$f":"IF(ROWS(D$5:D6)>COUNTIF(Payments!$C$2:$C$100,$B$2),\"\",INDEX(Payments!C$2:C$100,SMALL(IF(Payments!$C$2:$C$100<>\"\",IF(Payments!$C$2:$C$100=$B$2,ROW($C$7:$C$105)-ROW($C$7)+1)),ROWS(D$5:D6))))","v":"مدرسه السلامه"},{"$f":"IF(ROWS(E$5:E6)>COUNTIF(Payments!$C$2:$C$100,$B$2),\"\",INDEX(Payments!D$2:D$100,SMALL(IF(Payments!$C$2:$C$100<>\"\",IF(Payments!$C$2:$C$100=$B$2,ROW($C$7:$C$105)-ROW($C$7)+1)),ROWS(E$5:E6))))","v":"محمد علي"},{"$f":"IF(ROWS(F$5:F6)>COUNTIF(Payments!$C$2:$C$100,$B$2),\"\",INDEX(Payments!E$2:E$100,SMALL(IF(Payments!$C$2:$C$100<>\"\",IF(Payments!$C$2:$C$100=$B$2,ROW($C$7:$C$105)-ROW($C$7)+1)),ROWS(F$5:F6))))","v":60000},{"$f":"IF(ROWS(G$5:G6)>COUNTIF(Payments!$C$2:$C$100,$B$2),\"\",INDEX(Payments!F$2:F$100,SMALL(IF(Payments!$C$2:$C$100<>\"\",IF(Payments!$C$2:$C$100=$B$2,ROW($C$7:$C$105)-ROW($C$7)+1)),ROWS(G$5:G6))))","v":"اناره الميدان"}]
[null,{"$f":"IF(C7=\"\",\"\",MAX($B$4:B6)+1)","v":3},{"$f":"IF(ROWS(C$5:C7)>COUNTIF(Payments!$C$2:$C$100,$B$2),\"\",INDEX(Payments!B$2:B$100,SMALL(IF(Payments!$C$2:$C$100<>\"\",IF(Payments!$C$2:$C$100=$B$2,ROW($C$7:$C$105)-ROW($C$7)+1)),ROWS(C$5:C7))))","v":"2020-12-13"},{"$f":"IF(ROWS(D$5:D7)>COUNTIF(Payments!$C$2:$C$100,$B$2),\"\",INDEX(Payments!C$2:C$100,SMALL(IF(Payments!$C$2:$C$100<>\"\",IF(Payments!$C$2:$C$100=$B$2,ROW($C$7:$C$105)-ROW($C$7)+1)),ROWS(D$5:D7))))","v":"مدرسه السلامه"},{"$f":"IF(ROWS(E$5:E7)>COUNTIF(Payments!$C$2:$C$100,$B$2),\"\",INDEX(Payments!D$2:D$100,SMALL(IF(Payments!$C$2:$C$100<>\"\",IF(Payments!$C$2:$C$100=$B$2,ROW($C$7:$C$105)-ROW($C$7)+1)),ROWS(E$5:E7))))","v":"Officena"},{"$f":"IF(ROWS(F$5:F7)>COUNTIF(Payments!$C$2:$C$100,$B$2),\"\",INDEX(Payments!E$2:E$100,SMALL(IF(Payments!$C$2:$C$100<>\"\",IF(Payments!$C$2:$C$100=$B$2,ROW($C$7:$C$105)-ROW($C$7)+1)),ROWS(F$5:F7))))","v":60000},{"$f":"IF(ROWS(G$5:G7)>COUNTIF(Payments!$C$2:$C$100,$B$2),\"\",INDEX(Payments!F$2:F$100,SMALL(IF(Payments!$C$2:$C$100<>\"\",IF(Payments!$C$2:$C$100=$B$2,ROW($C$7:$C$105)-ROW($C$7)+1)),ROWS(G$5:G7))))","v":"اناره الميدان"}]
[null,{"$f":"IF(C8=\"\",\"\",MAX($B$4:B7)+1)","v":""},{"$f":"IF(ROWS(C$5:C8)>COUNTIF(Payments!$C$2:$C$100,$B$2),\"\",INDEX(Payments!B$2:B$100,SMALL(IF(Payments!$C$2:$C$100<>\"\",IF(Payments!$C$2:$C$100=$B$2,ROW($C$7:$C$105)-ROW($C$7)+1)),ROWS(C$5:C8))))","v":""},{"$f":"IF(ROWS(D$5:D8)>COUNTIF(Payments!$C$2:$C$100,$B$2),\"\",INDEX(Payments!C$2:C$100,SMALL(IF(Payments!$C$2:$C$100<>\"\",IF(Payments!$C$2:$C$100=$B$2,ROW($C$7:$C$105)-ROW($C$7)+1)),ROWS(D$5:D8))))","v":""},{"$f":"IF(ROWS(E$5:E8)>COUNTIF(Payments!$C$2:$C$100,$B$2),\"\",INDEX(Payments!D$2:D$100,SMALL(IF(Payments!$C$2:$C$100<>\"\",IF(Payments!$C$2:$C$100=$B$2,ROW($C$7:$C$105)-ROW($C$7)+1)),ROWS(E$5:E8))))","v":""},{"$f":"IF(ROWS(F$5:F8)>COUNTIF(Payments!$C$2:$C$100,$B$2),\"\",INDEX(Payments!E$2:E$100,SMALL(IF(Payments!$C$2:$C$100<>\"\",IF(Payments!$C$2:$C$100=$B$2,ROW($C$7:$C$105)-ROW($C$7)+1)),ROWS(F$5:F8))))","v":""},{"$f":"IF(ROWS(G$5:G8)>COUNTIF(Payments!$C$2:$C$100,$B$2),\"\",INDEX(Payments!F$2:F$100,SMALL(IF(Payments!$C$2:$C$100<>\"\",IF(Payments!$C$2:$C$100=$B$2,ROW($C$7:$C$105)-ROW($C$7)+1)),ROWS(G$5:G8))))","v":""}]
[null,{"$f":"IF(C9=\"\",\"\",MAX($B$4:B8)+1)","v":""},{"$f":"IF(ROWS(C$5:C9)>COUNTIF(Payments!$C$2:$C$100,$B$2),\"\",INDEX(Payments!B$2:B$100,SMALL(IF(Payments!$C$2:$C$100<>\"\",IF(Payments!$C$2:$C$100=$B$2,ROW($C$7:$C$105)-ROW($C$7)+1)),ROWS(C$5:C9))))","v":""},{"$f":"IF(ROWS(D$5:D9)>COUNTIF(Payments!$C$2:$C$100,$B$2),\"\",INDEX(Payments!C$2:C$100,SMALL(IF(Payments!$C$2:$C$100<>\"\",IF(Payments!$C$2:$C$100=$B$2,ROW($C$7:$C$105)-ROW($C$7)+1)),ROWS(D$5:D9))))","v":""},{"$f":"IF(ROWS(E$5:E9)>COUNTIF(Payments!$C$2:$C$100,$B$2),\"\",INDEX(Payments!D$2:D$100,SMALL(IF(Payments!$C$2:$C$100<>\"\",IF(Payments!$C$2:$C$100=$B$2,ROW($C$7:$C$105)-ROW($C$7)+1)),ROWS(E$5:E9))))","v":""},{"$f":"IF(ROWS(F$5:F9)>COUNTIF(Payments!$C$2:$C$100,$B$2),\"\",INDEX(Payments!E$2:E$100,SMALL(IF(Payments!$C$2:$C$100<>\"\",IF(Payments!$C$2:$C$100=$B$2,ROW($C$7:$C$105)-ROW($C$7)+1)),ROWS(F$5:F9))))","v":""},{"$f":"IF(ROWS(G$5:G9)>COUNTIF(Payments!$C$2:$C$100,$B$2),\"\",INDEX(Payments!F$2:F$100,SMALL(IF(Payments!$C$2:$C$100<>\"\",IF(Payments!$C$2:$C$100=$B$2,ROW($C$7:$C$105)-ROW($C$7)+1)),ROWS(G$5:G9))))","v":""}]
[null,{"$f":"IF(C10=\"\",\"\",MAX($B$4:B9)+1)","v":""},{"$f":"IF(ROWS(C$5:C10)>COUNTIF(Payments!$C$2:$C$100,$B$2),\"\",INDEX(Payments!B$2:B$100,SMALL(IF(Payments!$C$2:$C$100<>\"\",IF(Payments!$C$2:$C$100=$B$2,ROW($C$7:$C$105)-ROW($C$7)+1)),ROWS(C$5:C10))))","v":""},{"$f":"IF(ROWS(D$5:D10)>COUNTIF(Payments!$C$2:$C$100,$B$2),\"\",INDEX(Payments!C$2:C$100,SMALL(IF(Payments!$C$2:$C$100<>\"\",IF(Payments!$C$2:$C$100=$B$2,ROW($C$7:$C$105)-ROW($C$7)+1)),ROWS(D$5:D10))))","v":""},{"$f":"IF(ROWS(E$5:E10)>COUNTIF(Payments!$C$2:$C$100,$B$2),\"\",INDEX(Payments!D$2:D$100,SMALL(IF(Payments!$C$2:$C$100<>\"\",IF(Payments!$C$2:$C$100=$B$2,ROW($C$7:$C$105)-ROW($C$7)+1)),ROWS(E$5:E10))))","v":""},{"$f":"IF(ROWS(F$5:F10)>COUNTIF(Payments!$C$2:$C$100,$B$2),\"\",INDEX(Payments!E$2:E$100,SMALL(IF(Payments!$C$2:$C$100<>\"\",IF(Payments!$C$2:$C$100=$B$2,ROW($C$7:$C$105)-ROW($C$7)+1)),ROWS(F$5:F10))))","v":""},{"$f":"IF(ROWS(G$5:G10)>COUNTIF(Payments!$C$2:$C$100,$B$2),\"\",INDEX(Payments!F$2:F$100,SMALL(IF(Payments!$C$2:$C$100<>\"\",IF(Payments!$C$2:$C$100=$B$2,ROW($C$7:$C$105)-ROW($C$7)+1)),ROWS(G$5:G10))))","v":""}]
{"$rows_left_out":61}
{"sheet":"Payments","index":3,"n_rows":1199,"n_cols":6,"rows_kept":1199,"cut":false,"hidden":false,"merged":[]}
["م","Date","الموقع","المستفيد","المبلغ","التفاصيل"]
[{"$f":"IF(B2=\"\",\"\",MAX($A$1:A1)+1)","v":1},"2020-12-13","جريده الوطن","محمد علي",2000,"السور الخارجي"]
[{"$f":"IF(B3=\"\",\"\",MAX($A$1:A2)+1)","v":2},"2020-12-13","نادي الفروسيه","محمد علي",3000,"توصيلات كهرباء"]
[{"$f":"IF(B4=\"\",\"\",MAX($A$1:A3)+1)","v":3},"2020-12-13","نادي الفروسيه","النور احمد",10000,"تركيب طاقه شمسيه"]
[{"$f":"IF(B5=\"\",\"\",MAX($A$1:A4)+1)","v":4},"2020-12-13","مدرسه السلامه","محمد علي",60000,"اناره الميدان"]
[{"$f":"IF(B6=\"\",\"\",MAX($A$1:A5)+1)","v":5},"2020-12-14","نادي الفروسيه","محمد علي",1000,"المسبح"]
[{"$f":"IF(B7=\"\",\"\",MAX($A$1:A6)+1)","v":6},"2020-12-15","جريده الوطن","محمد علي",1001,"المسبح"]
[{"$f":"IF(B8=\"\",\"\",MAX($A$1:A7)+1)","v":7},"2020-12-13","جريده الوطن","محمد علي",2000,"السور الخارجي"]
[{"$f":"IF(B9=\"\",\"\",MAX($A$1:A8)+1)","v":8},"2020-12-13","نادي الفروسيه","محمد علي",3000,"توصيلات كهرباء"]
[{"$f":"IF(B10=\"\",\"\",MAX($A$1:A9)+1)","v":9},"2020-12-13","نادي الفروسيه","النور احمد",10000,"تركيب طاقه شمسيه"]
{"$rows_left_out":1190}
{"sheet":"One For_All","index":4,"n_rows":13,"n_cols":11,"rows_kept":13,"cut":false,"hidden":false,"merged":[]}
[null,null,null,"الموقع","المستفيد",null,"Chose Here",null,null,"for filter by الموقع","D"]
[null,null,null,"نادي الفروسيه","Officena",null,"D",null,null,"for filter by المستفيد","E"]
[null,null,null,null,null,null,null,null,null,"for filter by الموقع andالمستفيد","D+E"]
[null,null,"م","Date","الموقع","المستفيد","المبلغ","التفاصيل"]
[null,null,1,"2020-12-13","نادي الفروسيه","محمد علي",3000,"توصيلات كهرباء"]
[null,null,2,"2020-12-13","نادي الفروسيه","النور احمد",10000,"تركيب طاقه شمسيه"]
[null,null,3,"2020-12-14","نادي الفروسيه","محمد علي",1000,"المسبح"]
[null,null,4,"2020-12-13","نادي الفروسيه","محمد علي",3000,"توصيلات كهرباء"]
[null,null,5,"2020-12-13","نادي الفروسيه","النور احمد",10000,"تركيب طاقه شمسيه"]
[null,null,6,"2020-12-14","نادي الفروسيه","محمد علي",1000,"المسبح"]
{"$rows_left_out":3}